You are viewing a plain text version of this content. The canonical link for it is here.
Posted to builds@beam.apache.org by Apache Jenkins Server <je...@builds.apache.org> on 2023/10/25 17:18:50 UTC
Build failed in Jenkins: beam_PostCommit_Python38 #4752
See <https://ci-beam.apache.org/job/beam_PostCommit_Python38/4752/display/redirect>
Changes:
------------------------------------------
[...truncated 12.16 MB...]
[32mINFO [0m apache_beam.runners.dataflow.dataflow_runner:dataflow_runner.py:200 2023-10-25T15:12:57.921Z: JOB_MESSAGE_BASIC: Executing operation Generate Direct Rows/Create/MaybeReshuffle/Reshuffle/ReshufflePerKey/GroupByKey/Read+Generate Direct Rows/Create/MaybeReshuffle/Reshuffle/ReshufflePerKey/GroupByKey/GroupByWindow+Generate Direct Rows/Create/MaybeReshuffle/Reshuffle/ReshufflePerKey/FlatMap(restore_timestamps)+Generate Direct Rows/Create/MaybeReshuffle/Reshuffle/RemoveRandomKeys+Generate Direct Rows/Create/Map(decode)+Generate Direct Rows/WriteToBigTable/ParDo(_BigTableWriteFn)
[32mINFO [0m apache_beam.runners.dataflow.dataflow_runner:dataflow_runner.py:200 2023-10-25T16:23:22.553Z: JOB_MESSAGE_BASIC: Cancel request is committed for workflow job: 2023-10-25_08_09_59-12766427955256430269.
[32mINFO [0m apache_beam.runners.dataflow.dataflow_runner:dataflow_runner.py:200 2023-10-25T16:23:22.577Z: JOB_MESSAGE_BASIC: Finished operation Generate Direct Rows/Create/MaybeReshuffle/Reshuffle/ReshufflePerKey/GroupByKey/Read+Generate Direct Rows/Create/MaybeReshuffle/Reshuffle/ReshufflePerKey/GroupByKey/GroupByWindow+Generate Direct Rows/Create/MaybeReshuffle/Reshuffle/ReshufflePerKey/FlatMap(restore_timestamps)+Generate Direct Rows/Create/MaybeReshuffle/Reshuffle/RemoveRandomKeys+Generate Direct Rows/Create/Map(decode)+Generate Direct Rows/WriteToBigTable/ParDo(_BigTableWriteFn)
[32mINFO [0m apache_beam.runners.dataflow.dataflow_runner:dataflow_runner.py:200 2023-10-25T16:23:22.749Z: JOB_MESSAGE_BASIC: Stopping worker pool...
[32mINFO [0m apache_beam.runners.dataflow.dataflow_runner:dataflow_runner.py:150 Job 2023-10-25_08_09_59-12766427955256430269 is in state JOB_STATE_CANCELLING
[31m[1m_____________________ ReadNewTypesTests.test_iobase_source _____________________[0m
[gw6] linux -- Python 3.8.10 <https://ci-beam.apache.org/job/beam_PostCommit_Python38/ws/src/build/gradleenv/-1734967051/bin/python3.8>
self = <apache_beam.io.gcp.bigquery_read_it_test.ReadNewTypesTests testMethod=test_iobase_source>
@pytest.mark.it_postcommit
def test_iobase_source(self):
with beam.Pipeline(argv=self.args) as p:
result = (
p
| 'read' >> beam.io.ReadFromBigQuery(
query=self.query,
use_standard_sql=True,
project=self.project,
bigquery_job_labels={'launcher': 'apache_beam_tests'})
| beam.Map(datetime_to_utc))
> assert_that(result, equal_to(self.get_expected_data(native=False)))
[1m[31mapache_beam/io/gcp/bigquery_read_it_test.py[0m:720:
_ _ _ _ _ _ _ _ _ _ _ _ _ _ _ _ _ _ _ _ _ _ _ _ _ _ _ _ _ _ _ _ _ _ _ _ _ _ _ _
[1m[31mapache_beam/pipeline.py[0m:608: in __exit__
self.result = self.run()
[1m[31mapache_beam/pipeline.py[0m:558: in run
return Pipeline.from_runner_api(
[1m[31mapache_beam/pipeline.py[0m:585: in run
return self.runner.run_pipeline(self, self._options)
[1m[31mapache_beam/runners/dataflow/test_dataflow_runner.py[0m:66: in run_pipeline
self.result.wait_until_finish(duration=wait_duration)
_ _ _ _ _ _ _ _ _ _ _ _ _ _ _ _ _ _ _ _ _ _ _ _ _ _ _ _ _ _ _ _ _ _ _ _ _ _ _ _
self = <DataflowPipelineResult <Job
clientRequestId: '20231025170159765543-4534'
createTime: '2023-10-25T17:03:07.397108Z'
...023-10-25T17:03:07.397108Z'
steps: []
tempFiles: []
type: TypeValueValuesEnum(JOB_TYPE_BATCH, 1)> at 0x7f02e10be850>
duration = None
def wait_until_finish(self, duration=None):
if not self.is_in_terminal_state():
if not self.has_job:
raise IOError('Failed to get the Dataflow job id.')
consoleUrl = (
"Console URL: https://console.cloud.google.com/"
f"dataflow/jobs/<RegionId>/{self.job_id()}"
"?project=<ProjectId>")
thread = threading.Thread(
target=DataflowRunner.poll_for_job_completion,
args=(self._runner, self, duration))
# Mark the thread as a daemon thread so a keyboard interrupt on the main
# thread will terminate everything. This is also the reason we will not
# use thread.join() to wait for the polling thread.
thread.daemon = True
thread.start()
while thread.is_alive():
time.sleep(5.0)
# TODO: Merge the termination code in poll_for_job_completion and
# is_in_terminal_state.
terminated = self.is_in_terminal_state()
assert duration or terminated, (
'Job did not reach to a terminal state after waiting indefinitely. '
'{}'.format(consoleUrl))
if terminated and self.state != PipelineState.DONE:
# TODO(BEAM-1290): Consider converting this to an error log based on
# theresolution of the issue.
_LOGGER.error(consoleUrl)
> raise DataflowRuntimeException(
'Dataflow pipeline failed. State: %s, Error:\n%s' %
(self.state, getattr(self._runner, 'last_error_msg', None)),
[1m[31mE apache_beam.runners.dataflow.dataflow_runner.DataflowRuntimeException: Dataflow pipeline failed. State: FAILED, Error:[0m
[1m[31mE Workflow failed.[0m
[1m[31mapache_beam/runners/dataflow/dataflow_runner.py[0m:771: DataflowRuntimeException
------------------------------ Captured log setup ------------------------------
[32mINFO [0m apache_beam.io.gcp.bigquery_tools:bigquery_tools.py:812 Dataset apache-beam-testing:python_read_table_1698253316f1eda8 does not exist so we will create it as temporary with location=None
[32mINFO [0m apache_beam.io.gcp.bigquery_read_it_test:bigquery_read_it_test.py:104 Created dataset python_read_table_1698253316f1eda8 in project apache-beam-testing
------------------------------ Captured log call -------------------------------
[32mINFO [0m apache_beam.runners.portability.stager:stager.py:761 Executing command: ['<https://ci-beam.apache.org/job/beam_PostCommit_Python38/ws/src/build/gradleenv/-1734967051/bin/python3.8',> '-m', 'pip', 'download', '--dest', '/tmp/dataflow-requirements-cache', '-r', '/tmp/tmpacr9jvy2/tmp_requirements.txt', '--exists-action', 'i', '--no-deps', '--implementation', 'cp', '--abi', 'cp38', '--platform', 'manylinux2014_x86_64']
[32mINFO [0m apache_beam.runners.portability.stager:stager.py:322 Copying Beam SDK "<https://ci-beam.apache.org/job/beam_PostCommit_Python38/ws/src/sdks/python/build/apache_beam-2.52.0.dev0-cp38-cp38-manylinux_2_17_x86_64.manylinux2014_x86_64.whl"> to staging location.
[32mINFO [0m apache_beam.runners.dataflow.dataflow_runner:dataflow_runner.py:395 Pipeline has additional dependencies to be installed in SDK worker container, consider using the SDK container image pre-building workflow to avoid repetitive installations. Learn more on https://cloud.google.com/dataflow/docs/guides/using-custom-containers#prebuild
[32mINFO [0m root:environments.py:313 Using provided Python SDK container image: gcr.io/cloud-dataflow/v1beta3/beam_python3.8_sdk:beam-master-20231023
[32mINFO [0m root:environments.py:320 Python SDK container image set to "gcr.io/cloud-dataflow/v1beta3/beam_python3.8_sdk:beam-master-20231023" for Docker environment
[32mINFO [0m apache_beam.runners.portability.fn_api_runner.translations:translations.py:712 ==================== <function pack_combiners at 0x7f0339b43ca0> ====================
[32mINFO [0m apache_beam.runners.portability.fn_api_runner.translations:translations.py:712 ==================== <function sort_stages at 0x7f0339b444c0> ====================
[32mINFO [0m apache_beam.runners.dataflow.internal.apiclient:apiclient.py:668 Starting GCS upload to gs://temp-storage-for-end-to-end-tests/staging-it/beamapp-jenkins-1025170159-764378-rzlxck0b.1698253319.764570/requirements.txt...
[32mINFO [0m apache_beam.runners.dataflow.internal.apiclient:apiclient.py:684 Completed GCS upload to gs://temp-storage-for-end-to-end-tests/staging-it/beamapp-jenkins-1025170159-764378-rzlxck0b.1698253319.764570/requirements.txt in 0 seconds.
[32mINFO [0m apache_beam.runners.dataflow.internal.apiclient:apiclient.py:668 Starting GCS upload to gs://temp-storage-for-end-to-end-tests/staging-it/beamapp-jenkins-1025170159-764378-rzlxck0b.1698253319.764570/mock-2.0.0-py2.py3-none-any.whl...
[32mINFO [0m apache_beam.runners.dataflow.internal.apiclient:apiclient.py:684 Completed GCS upload to gs://temp-storage-for-end-to-end-tests/staging-it/beamapp-jenkins-1025170159-764378-rzlxck0b.1698253319.764570/mock-2.0.0-py2.py3-none-any.whl in 0 seconds.
[32mINFO [0m apache_beam.runners.dataflow.internal.apiclient:apiclient.py:668 Starting GCS upload to gs://temp-storage-for-end-to-end-tests/staging-it/beamapp-jenkins-1025170159-764378-rzlxck0b.1698253319.764570/seaborn-0.12.2-py3-none-any.whl...
[32mINFO [0m apache_beam.runners.dataflow.internal.apiclient:apiclient.py:684 Completed GCS upload to gs://temp-storage-for-end-to-end-tests/staging-it/beamapp-jenkins-1025170159-764378-rzlxck0b.1698253319.764570/seaborn-0.12.2-py3-none-any.whl in 0 seconds.
[32mINFO [0m apache_beam.runners.dataflow.internal.apiclient:apiclient.py:668 Starting GCS upload to gs://temp-storage-for-end-to-end-tests/staging-it/beamapp-jenkins-1025170159-764378-rzlxck0b.1698253319.764570/seaborn-0.13.0-py3-none-any.whl...
[32mINFO [0m apache_beam.runners.dataflow.internal.apiclient:apiclient.py:684 Completed GCS upload to gs://temp-storage-for-end-to-end-tests/staging-it/beamapp-jenkins-1025170159-764378-rzlxck0b.1698253319.764570/seaborn-0.13.0-py3-none-any.whl in 0 seconds.
[32mINFO [0m apache_beam.runners.dataflow.internal.apiclient:apiclient.py:668 Starting GCS upload to gs://temp-storage-for-end-to-end-tests/staging-it/beamapp-jenkins-1025170159-764378-rzlxck0b.1698253319.764570/PyHamcrest-1.10.1-py3-none-any.whl...
[32mINFO [0m apache_beam.runners.dataflow.internal.apiclient:apiclient.py:684 Completed GCS upload to gs://temp-storage-for-end-to-end-tests/staging-it/beamapp-jenkins-1025170159-764378-rzlxck0b.1698253319.764570/PyHamcrest-1.10.1-py3-none-any.whl in 0 seconds.
[32mINFO [0m apache_beam.runners.dataflow.internal.apiclient:apiclient.py:668 Starting GCS upload to gs://temp-storage-for-end-to-end-tests/staging-it/beamapp-jenkins-1025170159-764378-rzlxck0b.1698253319.764570/inflection-0.5.1-py2.py3-none-any.whl...
[32mINFO [0m apache_beam.runners.dataflow.internal.apiclient:apiclient.py:684 Completed GCS upload to gs://temp-storage-for-end-to-end-tests/staging-it/beamapp-jenkins-1025170159-764378-rzlxck0b.1698253319.764570/inflection-0.5.1-py2.py3-none-any.whl in 0 seconds.
[32mINFO [0m apache_beam.runners.dataflow.internal.apiclient:apiclient.py:668 Starting GCS upload to gs://temp-storage-for-end-to-end-tests/staging-it/beamapp-jenkins-1025170159-764378-rzlxck0b.1698253319.764570/beautifulsoup4-4.12.2-py3-none-any.whl...
[32mINFO [0m apache_beam.runners.dataflow.internal.apiclient:apiclient.py:684 Completed GCS upload to gs://temp-storage-for-end-to-end-tests/staging-it/beamapp-jenkins-1025170159-764378-rzlxck0b.1698253319.764570/beautifulsoup4-4.12.2-py3-none-any.whl in 0 seconds.
[32mINFO [0m apache_beam.runners.dataflow.internal.apiclient:apiclient.py:668 Starting GCS upload to gs://temp-storage-for-end-to-end-tests/staging-it/beamapp-jenkins-1025170159-764378-rzlxck0b.1698253319.764570/parameterized-0.7.5-py2.py3-none-any.whl...
[32mINFO [0m apache_beam.runners.dataflow.internal.apiclient:apiclient.py:684 Completed GCS upload to gs://temp-storage-for-end-to-end-tests/staging-it/beamapp-jenkins-1025170159-764378-rzlxck0b.1698253319.764570/parameterized-0.7.5-py2.py3-none-any.whl in 0 seconds.
[32mINFO [0m apache_beam.runners.dataflow.internal.apiclient:apiclient.py:668 Starting GCS upload to gs://temp-storage-for-end-to-end-tests/staging-it/beamapp-jenkins-1025170159-764378-rzlxck0b.1698253319.764570/tensorflow_transform-1.14.0-py3-none-any.whl...
[32mINFO [0m apache_beam.runners.dataflow.internal.apiclient:apiclient.py:684 Completed GCS upload to gs://temp-storage-for-end-to-end-tests/staging-it/beamapp-jenkins-1025170159-764378-rzlxck0b.1698253319.764570/tensorflow_transform-1.14.0-py3-none-any.whl in 0 seconds.
[32mINFO [0m apache_beam.runners.dataflow.internal.apiclient:apiclient.py:668 Starting GCS upload to gs://temp-storage-for-end-to-end-tests/staging-it/beamapp-jenkins-1025170159-764378-rzlxck0b.1698253319.764570/google_cloud_aiplatform-1.33.0-py2.py3-none-any.whl...
[32mINFO [0m apache_beam.runners.dataflow.internal.apiclient:apiclient.py:684 Completed GCS upload to gs://temp-storage-for-end-to-end-tests/staging-it/beamapp-jenkins-1025170159-764378-rzlxck0b.1698253319.764570/google_cloud_aiplatform-1.33.0-py2.py3-none-any.whl in 0 seconds.
[32mINFO [0m apache_beam.runners.dataflow.internal.apiclient:apiclient.py:668 Starting GCS upload to gs://temp-storage-for-end-to-end-tests/staging-it/beamapp-jenkins-1025170159-764378-rzlxck0b.1698253319.764570/google_cloud_aiplatform-1.33.1-py2.py3-none-any.whl...
[32mINFO [0m apache_beam.runners.dataflow.internal.apiclient:apiclient.py:684 Completed GCS upload to gs://temp-storage-for-end-to-end-tests/staging-it/beamapp-jenkins-1025170159-764378-rzlxck0b.1698253319.764570/google_cloud_aiplatform-1.33.1-py2.py3-none-any.whl in 0 seconds.
[32mINFO [0m apache_beam.runners.dataflow.internal.apiclient:apiclient.py:668 Starting GCS upload to gs://temp-storage-for-end-to-end-tests/staging-it/beamapp-jenkins-1025170159-764378-rzlxck0b.1698253319.764570/google_cloud_aiplatform-1.34.0-py2.py3-none-any.whl...
[32mINFO [0m apache_beam.runners.dataflow.internal.apiclient:apiclient.py:684 Completed GCS upload to gs://temp-storage-for-end-to-end-tests/staging-it/beamapp-jenkins-1025170159-764378-rzlxck0b.1698253319.764570/google_cloud_aiplatform-1.34.0-py2.py3-none-any.whl in 0 seconds.
[32mINFO [0m apache_beam.runners.dataflow.internal.apiclient:apiclient.py:668 Starting GCS upload to gs://temp-storage-for-end-to-end-tests/staging-it/beamapp-jenkins-1025170159-764378-rzlxck0b.1698253319.764570/google_cloud_aiplatform-1.35.0-py2.py3-none-any.whl...
[32mINFO [0m apache_beam.runners.dataflow.internal.apiclient:apiclient.py:684 Completed GCS upload to gs://temp-storage-for-end-to-end-tests/staging-it/beamapp-jenkins-1025170159-764378-rzlxck0b.1698253319.764570/google_cloud_aiplatform-1.35.0-py2.py3-none-any.whl in 0 seconds.
[32mINFO [0m apache_beam.runners.dataflow.internal.apiclient:apiclient.py:668 Starting GCS upload to gs://temp-storage-for-end-to-end-tests/staging-it/beamapp-jenkins-1025170159-764378-rzlxck0b.1698253319.764570/tfx_bsl-1.14.0-cp39-cp39-manylinux_2_17_x86_64.manylinux2014_x86_64.whl...
[32mINFO [0m apache_beam.runners.dataflow.internal.apiclient:apiclient.py:684 Completed GCS upload to gs://temp-storage-for-end-to-end-tests/staging-it/beamapp-jenkins-1025170159-764378-rzlxck0b.1698253319.764570/tfx_bsl-1.14.0-cp39-cp39-manylinux_2_17_x86_64.manylinux2014_x86_64.whl in 1 seconds.
[32mINFO [0m apache_beam.runners.dataflow.internal.apiclient:apiclient.py:668 Starting GCS upload to gs://temp-storage-for-end-to-end-tests/staging-it/beamapp-jenkins-1025170159-764378-rzlxck0b.1698253319.764570/matplotlib-3.7.3-cp38-cp38-manylinux_2_12_x86_64.manylinux2010_x86_64.whl...
[32mINFO [0m apache_beam.runners.dataflow.internal.apiclient:apiclient.py:684 Completed GCS upload to gs://temp-storage-for-end-to-end-tests/staging-it/beamapp-jenkins-1025170159-764378-rzlxck0b.1698253319.764570/matplotlib-3.7.3-cp38-cp38-manylinux_2_12_x86_64.manylinux2010_x86_64.whl in 0 seconds.
[32mINFO [0m apache_beam.runners.dataflow.internal.apiclient:apiclient.py:668 Starting GCS upload to gs://temp-storage-for-end-to-end-tests/staging-it/beamapp-jenkins-1025170159-764378-rzlxck0b.1698253319.764570/matplotlib-3.8.0-cp39-cp39-manylinux_2_17_x86_64.manylinux2014_x86_64.whl...
[32mINFO [0m apache_beam.runners.dataflow.internal.apiclient:apiclient.py:684 Completed GCS upload to gs://temp-storage-for-end-to-end-tests/staging-it/beamapp-jenkins-1025170159-764378-rzlxck0b.1698253319.764570/matplotlib-3.8.0-cp39-cp39-manylinux_2_17_x86_64.manylinux2014_x86_64.whl in 0 seconds.
[32mINFO [0m apache_beam.runners.dataflow.internal.apiclient:apiclient.py:668 Starting GCS upload to gs://temp-storage-for-end-to-end-tests/staging-it/beamapp-jenkins-1025170159-764378-rzlxck0b.1698253319.764570/tensorflow-2.13.0-cp38-cp38-manylinux_2_17_x86_64.manylinux2014_x86_64.whl...
[32mINFO [0m apache_beam.runners.dataflow.internal.apiclient:apiclient.py:684 Completed GCS upload to gs://temp-storage-for-end-to-end-tests/staging-it/beamapp-jenkins-1025170159-764378-rzlxck0b.1698253319.764570/tensorflow-2.13.0-cp38-cp38-manylinux_2_17_x86_64.manylinux2014_x86_64.whl in 29 seconds.
[32mINFO [0m apache_beam.runners.dataflow.internal.apiclient:apiclient.py:668 Starting GCS upload to gs://temp-storage-for-end-to-end-tests/staging-it/beamapp-jenkins-1025170159-764378-rzlxck0b.1698253319.764570/tensorflow-2.13.1-cp38-cp38-manylinux_2_17_x86_64.manylinux2014_x86_64.whl...
[32mINFO [0m apache_beam.runners.dataflow.internal.apiclient:apiclient.py:684 Completed GCS upload to gs://temp-storage-for-end-to-end-tests/staging-it/beamapp-jenkins-1025170159-764378-rzlxck0b.1698253319.764570/tensorflow-2.13.1-cp38-cp38-manylinux_2_17_x86_64.manylinux2014_x86_64.whl in 26 seconds.
[32mINFO [0m apache_beam.runners.dataflow.internal.apiclient:apiclient.py:668 Starting GCS upload to gs://temp-storage-for-end-to-end-tests/staging-it/beamapp-jenkins-1025170159-764378-rzlxck0b.1698253319.764570/matplotlib-3.8.0-cp310-cp310-manylinux_2_17_x86_64.manylinux2014_x86_64.whl...
[32mINFO [0m apache_beam.runners.dataflow.internal.apiclient:apiclient.py:684 Completed GCS upload to gs://temp-storage-for-end-to-end-tests/staging-it/beamapp-jenkins-1025170159-764378-rzlxck0b.1698253319.764570/matplotlib-3.8.0-cp310-cp310-manylinux_2_17_x86_64.manylinux2014_x86_64.whl in 0 seconds.
[32mINFO [0m apache_beam.runners.dataflow.internal.apiclient:apiclient.py:668 Starting GCS upload to gs://temp-storage-for-end-to-end-tests/staging-it/beamapp-jenkins-1025170159-764378-rzlxck0b.1698253319.764570/scikit_learn-1.0.2-cp38-cp38-manylinux_2_17_x86_64.manylinux2014_x86_64.whl...
[32mINFO [0m apache_beam.runners.dataflow.internal.apiclient:apiclient.py:684 Completed GCS upload to gs://temp-storage-for-end-to-end-tests/staging-it/beamapp-jenkins-1025170159-764378-rzlxck0b.1698253319.764570/scikit_learn-1.0.2-cp38-cp38-manylinux_2_17_x86_64.manylinux2014_x86_64.whl in 1 seconds.
[32mINFO [0m apache_beam.runners.dataflow.internal.apiclient:apiclient.py:668 Starting GCS upload to gs://temp-storage-for-end-to-end-tests/staging-it/beamapp-jenkins-1025170159-764378-rzlxck0b.1698253319.764570/scikit_learn-1.0.2-cp310-cp310-manylinux_2_17_x86_64.manylinux2014_x86_64.whl...
[32mINFO [0m apache_beam.runners.dataflow.internal.apiclient:apiclient.py:684 Completed GCS upload to gs://temp-storage-for-end-to-end-tests/staging-it/beamapp-jenkins-1025170159-764378-rzlxck0b.1698253319.764570/scikit_learn-1.0.2-cp310-cp310-manylinux_2_17_x86_64.manylinux2014_x86_64.whl in 1 seconds.
[32mINFO [0m apache_beam.runners.dataflow.internal.apiclient:apiclient.py:668 Starting GCS upload to gs://temp-storage-for-end-to-end-tests/staging-it/beamapp-jenkins-1025170159-764378-rzlxck0b.1698253319.764570/apache_beam-2.52.0.dev0-cp38-cp38-manylinux_2_17_x86_64.manylinux2014_x86_64.whl...
[32mINFO [0m apache_beam.runners.dataflow.internal.apiclient:apiclient.py:684 Completed GCS upload to gs://temp-storage-for-end-to-end-tests/staging-it/beamapp-jenkins-1025170159-764378-rzlxck0b.1698253319.764570/apache_beam-2.52.0.dev0-cp38-cp38-manylinux_2_17_x86_64.manylinux2014_x86_64.whl in 1 seconds.
[32mINFO [0m apache_beam.runners.dataflow.internal.apiclient:apiclient.py:668 Starting GCS upload to gs://temp-storage-for-end-to-end-tests/staging-it/beamapp-jenkins-1025170159-764378-rzlxck0b.1698253319.764570/pipeline.pb...
[32mINFO [0m apache_beam.runners.dataflow.internal.apiclient:apiclient.py:684 Completed GCS upload to gs://temp-storage-for-end-to-end-tests/staging-it/beamapp-jenkins-1025170159-764378-rzlxck0b.1698253319.764570/pipeline.pb in 0 seconds.
[32mINFO [0m apache_beam.runners.dataflow.internal.apiclient:apiclient.py:843 Create job: <Job
clientRequestId: '20231025170159765543-4534'
createTime: '2023-10-25T17:03:07.397108Z'
currentStateTime: '1970-01-01T00:00:00Z'
id: '2023-10-25_10_03_06-1091204220898933194'
location: 'us-central1'
name: 'beamapp-jenkins-1025170159-764378-rzlxck0b'
projectId: 'apache-beam-testing'
stageStates: []
startTime: '2023-10-25T17:03:07.397108Z'
steps: []
tempFiles: []
type: TypeValueValuesEnum(JOB_TYPE_BATCH, 1)>
[32mINFO [0m apache_beam.runners.dataflow.internal.apiclient:apiclient.py:845 Created job with id: [2023-10-25_10_03_06-1091204220898933194]
[32mINFO [0m apache_beam.runners.dataflow.internal.apiclient:apiclient.py:846 Submitted job: 2023-10-25_10_03_06-1091204220898933194
[32mINFO [0m apache_beam.runners.dataflow.internal.apiclient:apiclient.py:847 To access the Dataflow monitoring console, please navigate to https://console.cloud.google.com/dataflow/jobs/us-central1/2023-10-25_10_03_06-1091204220898933194?project=apache-beam-testing
[32mINFO [0m apache_beam.runners.dataflow.test_dataflow_runner:test_dataflow_runner.py:58 Console log:
[32mINFO [0m apache_beam.runners.dataflow.test_dataflow_runner:test_dataflow_runner.py:59 https://console.cloud.google.com/dataflow/jobs/us-central1/2023-10-25_10_03_06-1091204220898933194?project=apache-beam-testing
[32mINFO [0m apache_beam.runners.dataflow.dataflow_runner:dataflow_runner.py:150 Job 2023-10-25_10_03_06-1091204220898933194 is in state JOB_STATE_RUNNING
[32mINFO [0m apache_beam.runners.dataflow.dataflow_runner:dataflow_runner.py:200 2023-10-25T17:03:11.717Z: JOB_MESSAGE_BASIC: Worker configuration: e2-standard-2 in us-central1-b.
[32mINFO [0m apache_beam.runners.dataflow.dataflow_runner:dataflow_runner.py:200 2023-10-25T17:03:14.886Z: JOB_MESSAGE_BASIC: Executing operation read/FilesToRemoveImpulse/Impulse+read/FilesToRemoveImpulse/FlatMap(<lambda at core.py:3759>)+read/FilesToRemoveImpulse/Map(decode)+read/MapFilesToRemove
[32mINFO [0m apache_beam.runners.dataflow.dataflow_runner:dataflow_runner.py:200 2023-10-25T17:03:14.908Z: JOB_MESSAGE_BASIC: Executing operation read/Read/Impulse+read/Read/EmitSource+ref_AppliedPTransform_read-Read-SDFBoundedSourceReader-ParDo-SDFBoundedSourceDoFn-_13/PairWithRestriction+ref_AppliedPTransform_read-Read-SDFBoundedSourceReader-ParDo-SDFBoundedSourceDoFn-_13/SplitWithSizing
[32mINFO [0m apache_beam.runners.dataflow.dataflow_runner:dataflow_runner.py:200 2023-10-25T17:03:14.940Z: JOB_MESSAGE_BASIC: Starting 1 workers in us-central1-b...
[32mINFO [0m apache_beam.runners.dataflow.dataflow_runner:dataflow_runner.py:200 2023-10-25T17:03:35.518Z: JOB_MESSAGE_BASIC: Your project already contains 100 Dataflow-created metric descriptors, so new user metrics of the form custom.googleapis.com/* will not be created. However, all user metrics are also available in the metric dataflow.googleapis.com/job/user_counter. If you rely on the custom metrics, you can delete old / unused metric descriptors. See https://developers.google.com/apis-explorer/#p/monitoring/v3/monitoring.projects.metricDescriptors.list and https://developers.google.com/apis-explorer/#p/monitoring/v3/monitoring.projects.metricDescriptors.delete
[1m[31mERROR [0m apache_beam.runners.dataflow.dataflow_runner:dataflow_runner.py:204 2023-10-25T17:04:09.541Z: JOB_MESSAGE_ERROR: Startup of the worker pool in zone us-central1-b failed to bring up any of the desired 1 workers. Please refer to https://cloud.google.com/dataflow/docs/guides/common-errors#worker-pool-failure for help troubleshooting. QUOTA_EXCEEDED: Instance 'beamapp-jenkins-102517015-10251003-akrr-harness-b3pf' creation failed: Quota 'DISKS_TOTAL_GB' exceeded. Limit: 500000.0 in region us-central1.
[1m[31mERROR [0m apache_beam.runners.dataflow.dataflow_runner:dataflow_runner.py:204 2023-10-25T17:04:09.569Z: JOB_MESSAGE_ERROR: Workflow failed.
[33mWARNING [0m apache_beam.runners.dataflow.dataflow_runner:dataflow_runner.py:202 2023-10-25T17:04:09.675Z: JOB_MESSAGE_WARNING: Unable to delete temp files: "gs://temp-storage-for-end-to-end-tests/temp-it/beamapp-jenkins-1025170159-764378-rzlxck0b.1698253319.764570/dax-tmp-2023-10-25_10_03_06-1091204220898933194-S05-0-e6889b5f4484ea7d/tmp-e6889b5f4484e772@DAX.recordio."
[33mWARNING [0m apache_beam.runners.dataflow.dataflow_runner:dataflow_runner.py:202 2023-10-25T17:04:09.678Z: JOB_MESSAGE_WARNING: Unable to delete temp files: "gs://temp-storage-for-end-to-end-tests/temp-it/beamapp-jenkins-1025170159-764378-rzlxck0b.1698253319.764570/dax-tmp-2023-10-25_10_03_06-1091204220898933194-S01-0-4b1cc547a5a0bcf2/tmp-4b1cc547a5a0bd27@DAX.sdfmeta."
[33mWARNING [0m apache_beam.runners.dataflow.dataflow_runner:dataflow_runner.py:202 2023-10-25T17:04:09.699Z: JOB_MESSAGE_WARNING: S01:read/Read/Impulse+read/Read/EmitSource+ref_AppliedPTransform_read-Read-SDFBoundedSourceReader-ParDo-SDFBoundedSourceDoFn-_13/PairWithRestriction+ref_AppliedPTransform_read-Read-SDFBoundedSourceReader-ParDo-SDFBoundedSourceDoFn-_13/SplitWithSizing failed.
[33mWARNING [0m apache_beam.runners.dataflow.dataflow_runner:dataflow_runner.py:202 2023-10-25T17:04:09.699Z: JOB_MESSAGE_WARNING: S05:read/FilesToRemoveImpulse/Impulse+read/FilesToRemoveImpulse/FlatMap(<lambda at core.py:3759>)+read/FilesToRemoveImpulse/Map(decode)+read/MapFilesToRemove failed.
[32mINFO [0m apache_beam.runners.dataflow.dataflow_runner:dataflow_runner.py:200 2023-10-25T17:04:09.726Z: JOB_MESSAGE_BASIC: Finished operation read/FilesToRemoveImpulse/Impulse+read/FilesToRemoveImpulse/FlatMap(<lambda at core.py:3759>)+read/FilesToRemoveImpulse/Map(decode)+read/MapFilesToRemove
[32mINFO [0m apache_beam.runners.dataflow.dataflow_runner:dataflow_runner.py:200 2023-10-25T17:04:09.726Z: JOB_MESSAGE_BASIC: Finished operation read/Read/Impulse+read/Read/EmitSource+ref_AppliedPTransform_read-Read-SDFBoundedSourceReader-ParDo-SDFBoundedSourceDoFn-_13/PairWithRestriction+ref_AppliedPTransform_read-Read-SDFBoundedSourceReader-ParDo-SDFBoundedSourceDoFn-_13/SplitWithSizing
[32mINFO [0m apache_beam.runners.dataflow.dataflow_runner:dataflow_runner.py:200 2023-10-25T17:04:09.855Z: JOB_MESSAGE_BASIC: Stopping worker pool...
[32mINFO [0m apache_beam.runners.dataflow.dataflow_runner:dataflow_runner.py:200 2023-10-25T17:04:26.396Z: JOB_MESSAGE_BASIC: Worker pool stopped.
[32mINFO [0m apache_beam.runners.dataflow.dataflow_runner:dataflow_runner.py:150 Job 2023-10-25_10_03_06-1091204220898933194 is in state JOB_STATE_FAILED
[1m[31mERROR [0m apache_beam.runners.dataflow.dataflow_runner:dataflow_runner.py:770 Console URL: https://console.cloud.google.com/dataflow/jobs/<RegionId>/2023-10-25_10_03_06-1091204220898933194?project=<ProjectId>
[33m=============================== warnings summary ===============================[0m
apache_beam/ml/inference/vertex_ai_inference_it_test.py:68
apache_beam/ml/inference/vertex_ai_inference_it_test.py:68
apache_beam/ml/inference/vertex_ai_inference_it_test.py:68
apache_beam/ml/inference/vertex_ai_inference_it_test.py:68
apache_beam/ml/inference/vertex_ai_inference_it_test.py:68
apache_beam/ml/inference/vertex_ai_inference_it_test.py:68
apache_beam/ml/inference/vertex_ai_inference_it_test.py:68
apache_beam/ml/inference/vertex_ai_inference_it_test.py:68
<https://ci-beam.apache.org/job/beam_PostCommit_Python38/ws/src/sdks/python/apache_beam/ml/inference/vertex_ai_inference_it_test.py>:68: PytestUnknownMarkWarning: Unknown pytest.mark.uses_vertex_ai - is this a typo? You can register custom marks to avoid this warning - for details, see https://docs.pytest.org/en/stable/how-to/mark.html
@pytest.mark.uses_vertex_ai
apache_beam/examples/complete/game/hourly_team_score_it_test.py::HourlyTeamScoreIT::test_hourly_team_score_it
apache_beam/examples/complete/game/game_stats_it_test.py::GameStatsIT::test_game_stats_it
apache_beam/examples/complete/game/leader_board_it_test.py::LeaderBoardIT::test_leader_board_it
apache_beam/io/gcp/bigquery_test.py::PubSubBigQueryIT::test_file_loads
apache_beam/io/gcp/bigquery_test.py::PubSubBigQueryIT::test_streaming_inserts
<https://ci-beam.apache.org/job/beam_PostCommit_Python38/ws/src/sdks/python/apache_beam/io/gcp/tests/utils.py>:63: PendingDeprecationWarning: Client.dataset is deprecated and will be removed in a future version. Use a string like 'my_project.my_dataset' or a cloud.google.bigquery.DatasetReference object, instead.
dataset_ref = client.dataset(unique_dataset_name, project=project)
apache_beam/examples/cookbook/bigquery_tornadoes_it_test.py::BigqueryTornadoesIT::test_bigquery_tornadoes_it
<https://ci-beam.apache.org/job/beam_PostCommit_Python38/ws/src/sdks/python/apache_beam/io/gcp/tests/utils.py>:100: PendingDeprecationWarning: Client.dataset is deprecated and will be removed in a future version. Use a string like 'my_project.my_dataset' or a cloud.google.bigquery.DatasetReference object, instead.
table_ref = client.dataset(dataset_id).table(table_id)
apache_beam/examples/dataframe/flight_delays_it_test.py::FlightDelaysTest::test_flight_delays
<https://ci-beam.apache.org/job/beam_PostCommit_Python38/ws/src/sdks/python/apache_beam/examples/dataframe/flight_delays.py>:47: FutureWarning: The default value of numeric_only in DataFrame.mean is deprecated. In a future version, it will default to False. In addition, specifying 'numeric_only=None' is deprecated. Select only valid columns or specify the value of numeric_only to silence this warning.
return airline_df[at_top_airports].mean()
apache_beam/io/gcp/bigquery_read_it_test.py::ReadTests::test_native_source
<https://ci-beam.apache.org/job/beam_PostCommit_Python38/ws/src/sdks/python/apache_beam/io/gcp/bigquery_read_it_test.py>:170: BeamDeprecationWarning: BigQuerySource is deprecated since 2.25.0. Use ReadFromBigQuery instead.
beam.io.BigQuerySource(query=self.query, use_standard_sql=True)))
apache_beam/io/gcp/bigquery_read_it_test.py::ReadNewTypesTests::test_native_source
<https://ci-beam.apache.org/job/beam_PostCommit_Python38/ws/src/sdks/python/apache_beam/io/gcp/bigquery_read_it_test.py>:706: BeamDeprecationWarning: BigQuerySource is deprecated since 2.25.0. Use ReadFromBigQuery instead.
beam.io.BigQuerySource(query=self.query, use_standard_sql=True)))
-- Docs: https://docs.pytest.org/en/stable/how-to/capture-warnings.html
- generated xml file: <https://ci-beam.apache.org/job/beam_PostCommit_Python38/ws/src/sdks/python/pytest_postCommitIT-df-py38.xml> -
[36m[1m=========================== short test summary info ============================[0m
[31mFAILED[0m apache_beam/examples/cookbook/bigtableio_it_test.py::[1mBigtableIOWriteTest::test_bigtable_write[0m - Failed: Timeout >4500.0s
[31mFAILED[0m apache_beam/io/gcp/bigquery_read_it_test.py::[1mReadNewTypesTests::test_iobase_source[0m - apache_beam.runners.dataflow.dataflow_runner.DataflowRuntimeException: Dataflow pipeline failed. State: FAILED, Error:
Workflow failed.
[31m====== [31m[1m2 failed[0m, [32m87 passed[0m, [33m49 skipped[0m, [33m17 warnings[0m[31m in 8279.60s (2:17:59)[0m[31m ======[0m
> Task :sdks:python:test-suites:dataflow:py38:postCommitIT FAILED
FAILURE: Build failed with an exception.
* Where:
Script '<https://ci-beam.apache.org/job/beam_PostCommit_Python38/ws/src/sdks/python/test-suites/dataflow/common.gradle'> line: 139
* What went wrong:
Execution failed for task ':sdks:python:test-suites:dataflow:py38:postCommitIT'.
> Process 'command 'sh'' finished with non-zero exit value 1
* Try:
> Run with --stacktrace option to get the stack trace.
> Run with --info or --debug option to get more log output.
> Get more help at https://help.gradle.org.
Deprecated Gradle features were used in this build, making it incompatible with Gradle 9.0.
You can use '--warning-mode all' to show the individual deprecation warnings and determine if they come from your own scripts or plugins.
For more on this, please refer to https://docs.gradle.org/8.4/userguide/command_line_interface.html#sec:command_line_warnings in the Gradle documentation.
BUILD FAILED in 3h 3m 15s
221 actionable tasks: 157 executed, 60 from cache, 4 up-to-date
Publishing build scan...
https://ge.apache.org/s/55gqk37fpiouo
Build step 'Invoke Gradle script' changed build result to FAILURE
Build step 'Invoke Gradle script' marked build as failure
---------------------------------------------------------------------
To unsubscribe, e-mail: builds-unsubscribe@beam.apache.org
For additional commands, e-mail: builds-help@beam.apache.org
Jenkins build is back to normal : beam_PostCommit_Python38 #4753
Posted by Apache Jenkins Server <je...@builds.apache.org>.
See <https://ci-beam.apache.org/job/beam_PostCommit_Python38/4753/display/redirect?page=changes>
---------------------------------------------------------------------
To unsubscribe, e-mail: builds-unsubscribe@beam.apache.org
For additional commands, e-mail: builds-help@beam.apache.org