You are viewing a plain text version of this content. The canonical link for it is here.
Posted to builds@solr.apache.org by Apache Jenkins Server <je...@builds.apache.org> on 2023/07/17 20:28:54 UTC

[JENKINS] Solr » Solr-NightlyTests-main - Build # 855 - Still Unstable!

Build: https://ci-builds.apache.org/job/Solr/job/Solr-NightlyTests-main/855/

7 tests failed.
FAILED:  org.apache.solr.cloud.OverseerTest.testShardLeaderChange

Error Message:
com.carrotsearch.randomizedtesting.UncaughtExceptionError: Captured an uncaught exception in thread: Thread[id=9561, name=OverseerCollectionConfigSetProcessor-72162435303014402-127.0.0.1:43899_solr-n_0000000000, state=RUNNABLE, group=Overseer collection creation process.]

Stack Trace:
com.carrotsearch.randomizedtesting.UncaughtExceptionError: Captured an uncaught exception in thread: Thread[id=9561, name=OverseerCollectionConfigSetProcessor-72162435303014402-127.0.0.1:43899_solr-n_0000000000, state=RUNNABLE, group=Overseer collection creation process.]
	at __randomizedtesting.SeedInfo.seed([D2F64F8150AC4953:CA5C8764A34BCA2]:0)
Caused by: org.apache.solr.common.AlreadyClosedException
	at __randomizedtesting.SeedInfo.seed([D2F64F8150AC4953]:0)
	at app//org.apache.solr.common.cloud.ZkCmdExecutor.retryOperation(ZkCmdExecutor.java:70)
	at app//org.apache.solr.common.cloud.SolrZkClient.getData(SolrZkClient.java:437)
	at app//org.apache.solr.cloud.OverseerTaskProcessor.amILeader(OverseerTaskProcessor.java:486)
	at app//org.apache.solr.cloud.OverseerTaskProcessor.run(OverseerTaskProcessor.java:171)
	at java.base@11.0.16.1/java.lang.Thread.run(Thread.java:829)


FAILED:  org.apache.solr.core.TestSolrDeletionPolicy1.testNumCommitsConfigured

Error Message:
java.lang.AssertionError

Stack Trace:
java.lang.AssertionError
	at __randomizedtesting.SeedInfo.seed([D2F64F8150AC4953:E0FE70A42A49393]:0)
	at org.junit.Assert.fail(Assert.java:87)
	at org.junit.Assert.assertTrue(Assert.java:42)
	at org.junit.Assert.assertTrue(Assert.java:53)
	at org.apache.solr.core.TestSolrDeletionPolicy1.testNumCommitsConfigured(TestSolrDeletionPolicy1.java:83)
	at java.base/jdk.internal.reflect.NativeMethodAccessorImpl.invoke0(Native Method)
	at java.base/jdk.internal.reflect.NativeMethodAccessorImpl.invoke(NativeMethodAccessorImpl.java:62)
	at java.base/jdk.internal.reflect.DelegatingMethodAccessorImpl.invoke(DelegatingMethodAccessorImpl.java:43)
	at java.base/java.lang.reflect.Method.invoke(Method.java:566)
	at com.carrotsearch.randomizedtesting.RandomizedRunner.invoke(RandomizedRunner.java:1758)
	at com.carrotsearch.randomizedtesting.RandomizedRunner$8.evaluate(RandomizedRunner.java:946)
	at com.carrotsearch.randomizedtesting.RandomizedRunner$9.evaluate(RandomizedRunner.java:982)
	at com.carrotsearch.randomizedtesting.RandomizedRunner$10.evaluate(RandomizedRunner.java:996)
	at com.carrotsearch.randomizedtesting.rules.SystemPropertiesRestoreRule$1.evaluate(SystemPropertiesRestoreRule.java:80)
	at org.junit.rules.RunRules.evaluate(RunRules.java:20)
	at org.apache.lucene.tests.util.TestRuleSetupTeardownChained$1.evaluate(TestRuleSetupTeardownChained.java:48)
	at org.apache.lucene.tests.util.AbstractBeforeAfterRule$1.evaluate(AbstractBeforeAfterRule.java:43)
	at org.apache.lucene.tests.util.TestRuleThreadAndTestName$1.evaluate(TestRuleThreadAndTestName.java:45)
	at org.apache.lucene.tests.util.TestRuleIgnoreAfterMaxFailures$1.evaluate(TestRuleIgnoreAfterMaxFailures.java:60)
	at org.apache.lucene.tests.util.TestRuleMarkFailure$1.evaluate(TestRuleMarkFailure.java:44)
	at org.junit.rules.RunRules.evaluate(RunRules.java:20)
	at com.carrotsearch.randomizedtesting.rules.StatementAdapter.evaluate(StatementAdapter.java:36)
	at com.carrotsearch.randomizedtesting.ThreadLeakControl$StatementRunner.run(ThreadLeakControl.java:390)
	at com.carrotsearch.randomizedtesting.ThreadLeakControl.forkTimeoutingTask(ThreadLeakControl.java:843)
	at com.carrotsearch.randomizedtesting.ThreadLeakControl$3.evaluate(ThreadLeakControl.java:490)
	at com.carrotsearch.randomizedtesting.RandomizedRunner.runSingleTest(RandomizedRunner.java:955)
	at com.carrotsearch.randomizedtesting.RandomizedRunner$5.evaluate(RandomizedRunner.java:840)
	at com.carrotsearch.randomizedtesting.RandomizedRunner$6.evaluate(RandomizedRunner.java:891)
	at com.carrotsearch.randomizedtesting.RandomizedRunner$7.evaluate(RandomizedRunner.java:902)
	at com.carrotsearch.randomizedtesting.rules.StatementAdapter.evaluate(StatementAdapter.java:36)
	at com.carrotsearch.randomizedtesting.rules.StatementAdapter.evaluate(StatementAdapter.java:36)
	at org.apache.lucene.tests.util.AbstractBeforeAfterRule$1.evaluate(AbstractBeforeAfterRule.java:43)
	at com.carrotsearch.randomizedtesting.rules.SystemPropertiesRestoreRule$1.evaluate(SystemPropertiesRestoreRule.java:80)
	at org.junit.rules.RunRules.evaluate(RunRules.java:20)
	at org.apache.lucene.tests.util.AbstractBeforeAfterRule$1.evaluate(AbstractBeforeAfterRule.java:43)
	at com.carrotsearch.randomizedtesting.rules.StatementAdapter.evaluate(StatementAdapter.java:36)
	at org.apache.lucene.tests.util.TestRuleStoreClassName$1.evaluate(TestRuleStoreClassName.java:38)
	at com.carrotsearch.randomizedtesting.rules.NoShadowingOrOverridesOnMethodsRule$1.evaluate(NoShadowingOrOverridesOnMethodsRule.java:40)
	at com.carrotsearch.randomizedtesting.rules.NoShadowingOrOverridesOnMethodsRule$1.evaluate(NoShadowingOrOverridesOnMethodsRule.java:40)
	at com.carrotsearch.randomizedtesting.rules.StatementAdapter.evaluate(StatementAdapter.java:36)
	at com.carrotsearch.randomizedtesting.rules.StatementAdapter.evaluate(StatementAdapter.java:36)
	at org.apache.lucene.tests.util.TestRuleAssertionsRequired$1.evaluate(TestRuleAssertionsRequired.java:53)
	at org.apache.lucene.tests.util.AbstractBeforeAfterRule$1.evaluate(AbstractBeforeAfterRule.java:43)
	at org.apache.lucene.tests.util.TestRuleMarkFailure$1.evaluate(TestRuleMarkFailure.java:44)
	at org.apache.lucene.tests.util.TestRuleIgnoreAfterMaxFailures$1.evaluate(TestRuleIgnoreAfterMaxFailures.java:60)
	at org.apache.lucene.tests.util.TestRuleIgnoreTestSuites$1.evaluate(TestRuleIgnoreTestSuites.java:47)
	at org.junit.rules.RunRules.evaluate(RunRules.java:20)
	at com.carrotsearch.randomizedtesting.rules.StatementAdapter.evaluate(StatementAdapter.java:36)
	at com.carrotsearch.randomizedtesting.ThreadLeakControl$StatementRunner.run(ThreadLeakControl.java:390)
	at com.carrotsearch.randomizedtesting.ThreadLeakControl.lambda$forkTimeoutingTask$0(ThreadLeakControl.java:850)
	at java.base/java.lang.Thread.run(Thread.java:829)


FAILED:  org.apache.solr.search.function.TestDenseVectorFunctionQuery.resultOfVectorFunction_canBeUsedAsFloatFunctionInput

Error Message:
java.lang.RuntimeException: Exception during query

Stack Trace:
java.lang.RuntimeException: Exception during query
	at __randomizedtesting.SeedInfo.seed([D2F64F8150AC4953:B75C6A9B69C18A1]:0)
	at org.apache.solr.SolrTestCaseJ4.assertQ(SolrTestCaseJ4.java:1024)
	at org.apache.solr.SolrTestCaseJ4.assertQ(SolrTestCaseJ4.java:982)
	at org.apache.solr.search.function.TestDenseVectorFunctionQuery.resultOfVectorFunction_canBeUsedAsFloatFunctionInput(TestDenseVectorFunctionQuery.java:142)
	at java.base/jdk.internal.reflect.NativeMethodAccessorImpl.invoke0(Native Method)
	at java.base/jdk.internal.reflect.NativeMethodAccessorImpl.invoke(NativeMethodAccessorImpl.java:62)
	at java.base/jdk.internal.reflect.DelegatingMethodAccessorImpl.invoke(DelegatingMethodAccessorImpl.java:43)
	at java.base/java.lang.reflect.Method.invoke(Method.java:566)
	at com.carrotsearch.randomizedtesting.RandomizedRunner.invoke(RandomizedRunner.java:1758)
	at com.carrotsearch.randomizedtesting.RandomizedRunner$8.evaluate(RandomizedRunner.java:946)
	at com.carrotsearch.randomizedtesting.RandomizedRunner$9.evaluate(RandomizedRunner.java:982)
	at com.carrotsearch.randomizedtesting.RandomizedRunner$10.evaluate(RandomizedRunner.java:996)
	at com.carrotsearch.randomizedtesting.rules.SystemPropertiesRestoreRule$1.evaluate(SystemPropertiesRestoreRule.java:80)
	at org.junit.rules.RunRules.evaluate(RunRules.java:20)
	at org.apache.lucene.tests.util.TestRuleSetupTeardownChained$1.evaluate(TestRuleSetupTeardownChained.java:48)
	at org.apache.lucene.tests.util.AbstractBeforeAfterRule$1.evaluate(AbstractBeforeAfterRule.java:43)
	at org.apache.lucene.tests.util.TestRuleThreadAndTestName$1.evaluate(TestRuleThreadAndTestName.java:45)
	at org.apache.lucene.tests.util.TestRuleIgnoreAfterMaxFailures$1.evaluate(TestRuleIgnoreAfterMaxFailures.java:60)
	at org.apache.lucene.tests.util.TestRuleMarkFailure$1.evaluate(TestRuleMarkFailure.java:44)
	at org.junit.rules.RunRules.evaluate(RunRules.java:20)
	at com.carrotsearch.randomizedtesting.rules.StatementAdapter.evaluate(StatementAdapter.java:36)
	at com.carrotsearch.randomizedtesting.ThreadLeakControl$StatementRunner.run(ThreadLeakControl.java:390)
	at com.carrotsearch.randomizedtesting.ThreadLeakControl.forkTimeoutingTask(ThreadLeakControl.java:843)
	at com.carrotsearch.randomizedtesting.ThreadLeakControl$3.evaluate(ThreadLeakControl.java:490)
	at com.carrotsearch.randomizedtesting.RandomizedRunner.runSingleTest(RandomizedRunner.java:955)
	at com.carrotsearch.randomizedtesting.RandomizedRunner$5.evaluate(RandomizedRunner.java:840)
	at com.carrotsearch.randomizedtesting.RandomizedRunner$6.evaluate(RandomizedRunner.java:891)
	at com.carrotsearch.randomizedtesting.RandomizedRunner$7.evaluate(RandomizedRunner.java:902)
	at com.carrotsearch.randomizedtesting.rules.StatementAdapter.evaluate(StatementAdapter.java:36)
	at com.carrotsearch.randomizedtesting.rules.StatementAdapter.evaluate(StatementAdapter.java:36)
	at org.apache.lucene.tests.util.AbstractBeforeAfterRule$1.evaluate(AbstractBeforeAfterRule.java:43)
	at com.carrotsearch.randomizedtesting.rules.SystemPropertiesRestoreRule$1.evaluate(SystemPropertiesRestoreRule.java:80)
	at org.junit.rules.RunRules.evaluate(RunRules.java:20)
	at org.apache.lucene.tests.util.AbstractBeforeAfterRule$1.evaluate(AbstractBeforeAfterRule.java:43)
	at com.carrotsearch.randomizedtesting.rules.StatementAdapter.evaluate(StatementAdapter.java:36)
	at org.apache.lucene.tests.util.TestRuleStoreClassName$1.evaluate(TestRuleStoreClassName.java:38)
	at com.carrotsearch.randomizedtesting.rules.NoShadowingOrOverridesOnMethodsRule$1.evaluate(NoShadowingOrOverridesOnMethodsRule.java:40)
	at com.carrotsearch.randomizedtesting.rules.NoShadowingOrOverridesOnMethodsRule$1.evaluate(NoShadowingOrOverridesOnMethodsRule.java:40)
	at com.carrotsearch.randomizedtesting.rules.StatementAdapter.evaluate(StatementAdapter.java:36)
	at com.carrotsearch.randomizedtesting.rules.StatementAdapter.evaluate(StatementAdapter.java:36)
	at org.apache.lucene.tests.util.TestRuleAssertionsRequired$1.evaluate(TestRuleAssertionsRequired.java:53)
	at org.apache.lucene.tests.util.AbstractBeforeAfterRule$1.evaluate(AbstractBeforeAfterRule.java:43)
	at org.apache.lucene.tests.util.TestRuleMarkFailure$1.evaluate(TestRuleMarkFailure.java:44)
	at org.apache.lucene.tests.util.TestRuleIgnoreAfterMaxFailures$1.evaluate(TestRuleIgnoreAfterMaxFailures.java:60)
	at org.apache.lucene.tests.util.TestRuleIgnoreTestSuites$1.evaluate(TestRuleIgnoreTestSuites.java:47)
	at org.junit.rules.RunRules.evaluate(RunRules.java:20)
	at com.carrotsearch.randomizedtesting.rules.StatementAdapter.evaluate(StatementAdapter.java:36)
	at com.carrotsearch.randomizedtesting.ThreadLeakControl$StatementRunner.run(ThreadLeakControl.java:390)
	at com.carrotsearch.randomizedtesting.ThreadLeakControl.lambda$forkTimeoutingTask$0(ThreadLeakControl.java:850)
	at java.base/java.lang.Thread.run(Thread.java:829)
Caused by: java.lang.IllegalArgumentException: no float vector value is indexed for field 'vector'
	at org.apache.lucene.queries.function.valuesource.FloatKnnVectorFieldSource.getValues(FloatKnnVectorFieldSource.java:45)
	at org.apache.lucene.queries.function.valuesource.VectorSimilarityFunction.getValues(VectorSimilarityFunction.java:48)
	at org.apache.lucene.queries.function.valuesource.DualFloatFunction.getValues(DualFloatFunction.java:58)
	at org.apache.lucene.queries.function.FunctionQuery$AllScorer.<init>(FunctionQuery.java:115)
	at org.apache.lucene.queries.function.FunctionQuery$FunctionWeight.scorer(FunctionQuery.java:76)
	at org.apache.lucene.search.Weight.scorerSupplier(Weight.java:136)
	at org.apache.lucene.search.BooleanWeight.scorerSupplier(BooleanWeight.java:542)
	at org.apache.lucene.search.BooleanWeight.scorer(BooleanWeight.java:507)
	at org.apache.lucene.search.Weight.bulkScorer(Weight.java:166)
	at org.apache.lucene.search.BooleanWeight.bulkScorer(BooleanWeight.java:395)
	at org.apache.lucene.search.IndexSearcher.search(IndexSearcher.java:770)
	at org.apache.solr.search.SolrIndexSearcher.search(SolrIndexSearcher.java:720)
	at org.apache.lucene.search.IndexSearcher.search(IndexSearcher.java:551)
	at org.apache.solr.search.SolrIndexSearcher.buildAndRunCollectorChain(SolrIndexSearcher.java:275)
	at org.apache.solr.search.SolrIndexSearcher.getDocListNC(SolrIndexSearcher.java:1878)
	at org.apache.solr.search.SolrIndexSearcher.getDocListC(SolrIndexSearcher.java:1695)
	at org.apache.solr.search.SolrIndexSearcher.search(SolrIndexSearcher.java:710)
	at org.apache.solr.handler.component.QueryComponent.doProcessUngroupedSearch(QueryComponent.java:1660)
	at org.apache.solr.handler.component.QueryComponent.process(QueryComponent.java:421)
	at org.apache.solr.handler.component.SearchHandler.handleRequestBody(SearchHandler.java:425)
	at org.apache.solr.handler.RequestHandlerBase.handleRequest(RequestHandlerBase.java:224)
	at org.apache.solr.core.SolrCore.execute(SolrCore.java:2893)
	at org.apache.solr.util.TestHarness.query(TestHarness.java:348)
	at org.apache.solr.util.TestHarness.query(TestHarness.java:328)
	at org.apache.solr.SolrTestCaseJ4.assertQ(SolrTestCaseJ4.java:996)
	... 48 more


FAILED:  org.apache.solr.search.function.TestDenseVectorFunctionQuery.byteFieldVectors_shouldReturnFloatSimilarity

Error Message:
java.lang.RuntimeException: Exception during query

Stack Trace:
java.lang.RuntimeException: Exception during query
	at __randomizedtesting.SeedInfo.seed([D2F64F8150AC4953:22DD9F5C3EFF055A]:0)
	at org.apache.solr.SolrTestCaseJ4.assertQ(SolrTestCaseJ4.java:1024)
	at org.apache.solr.SolrTestCaseJ4.assertQ(SolrTestCaseJ4.java:982)
	at org.apache.solr.search.function.TestDenseVectorFunctionQuery.byteFieldVectors_shouldReturnFloatSimilarity(TestDenseVectorFunctionQuery.java:126)
	at java.base/jdk.internal.reflect.NativeMethodAccessorImpl.invoke0(Native Method)
	at java.base/jdk.internal.reflect.NativeMethodAccessorImpl.invoke(NativeMethodAccessorImpl.java:62)
	at java.base/jdk.internal.reflect.DelegatingMethodAccessorImpl.invoke(DelegatingMethodAccessorImpl.java:43)
	at java.base/java.lang.reflect.Method.invoke(Method.java:566)
	at com.carrotsearch.randomizedtesting.RandomizedRunner.invoke(RandomizedRunner.java:1758)
	at com.carrotsearch.randomizedtesting.RandomizedRunner$8.evaluate(RandomizedRunner.java:946)
	at com.carrotsearch.randomizedtesting.RandomizedRunner$9.evaluate(RandomizedRunner.java:982)
	at com.carrotsearch.randomizedtesting.RandomizedRunner$10.evaluate(RandomizedRunner.java:996)
	at com.carrotsearch.randomizedtesting.rules.SystemPropertiesRestoreRule$1.evaluate(SystemPropertiesRestoreRule.java:80)
	at org.junit.rules.RunRules.evaluate(RunRules.java:20)
	at org.apache.lucene.tests.util.TestRuleSetupTeardownChained$1.evaluate(TestRuleSetupTeardownChained.java:48)
	at org.apache.lucene.tests.util.AbstractBeforeAfterRule$1.evaluate(AbstractBeforeAfterRule.java:43)
	at org.apache.lucene.tests.util.TestRuleThreadAndTestName$1.evaluate(TestRuleThreadAndTestName.java:45)
	at org.apache.lucene.tests.util.TestRuleIgnoreAfterMaxFailures$1.evaluate(TestRuleIgnoreAfterMaxFailures.java:60)
	at org.apache.lucene.tests.util.TestRuleMarkFailure$1.evaluate(TestRuleMarkFailure.java:44)
	at org.junit.rules.RunRules.evaluate(RunRules.java:20)
	at com.carrotsearch.randomizedtesting.rules.StatementAdapter.evaluate(StatementAdapter.java:36)
	at com.carrotsearch.randomizedtesting.ThreadLeakControl$StatementRunner.run(ThreadLeakControl.java:390)
	at com.carrotsearch.randomizedtesting.ThreadLeakControl.forkTimeoutingTask(ThreadLeakControl.java:843)
	at com.carrotsearch.randomizedtesting.ThreadLeakControl$3.evaluate(ThreadLeakControl.java:490)
	at com.carrotsearch.randomizedtesting.RandomizedRunner.runSingleTest(RandomizedRunner.java:955)
	at com.carrotsearch.randomizedtesting.RandomizedRunner$5.evaluate(RandomizedRunner.java:840)
	at com.carrotsearch.randomizedtesting.RandomizedRunner$6.evaluate(RandomizedRunner.java:891)
	at com.carrotsearch.randomizedtesting.RandomizedRunner$7.evaluate(RandomizedRunner.java:902)
	at com.carrotsearch.randomizedtesting.rules.StatementAdapter.evaluate(StatementAdapter.java:36)
	at com.carrotsearch.randomizedtesting.rules.StatementAdapter.evaluate(StatementAdapter.java:36)
	at org.apache.lucene.tests.util.AbstractBeforeAfterRule$1.evaluate(AbstractBeforeAfterRule.java:43)
	at com.carrotsearch.randomizedtesting.rules.SystemPropertiesRestoreRule$1.evaluate(SystemPropertiesRestoreRule.java:80)
	at org.junit.rules.RunRules.evaluate(RunRules.java:20)
	at org.apache.lucene.tests.util.AbstractBeforeAfterRule$1.evaluate(AbstractBeforeAfterRule.java:43)
	at com.carrotsearch.randomizedtesting.rules.StatementAdapter.evaluate(StatementAdapter.java:36)
	at org.apache.lucene.tests.util.TestRuleStoreClassName$1.evaluate(TestRuleStoreClassName.java:38)
	at com.carrotsearch.randomizedtesting.rules.NoShadowingOrOverridesOnMethodsRule$1.evaluate(NoShadowingOrOverridesOnMethodsRule.java:40)
	at com.carrotsearch.randomizedtesting.rules.NoShadowingOrOverridesOnMethodsRule$1.evaluate(NoShadowingOrOverridesOnMethodsRule.java:40)
	at com.carrotsearch.randomizedtesting.rules.StatementAdapter.evaluate(StatementAdapter.java:36)
	at com.carrotsearch.randomizedtesting.rules.StatementAdapter.evaluate(StatementAdapter.java:36)
	at org.apache.lucene.tests.util.TestRuleAssertionsRequired$1.evaluate(TestRuleAssertionsRequired.java:53)
	at org.apache.lucene.tests.util.AbstractBeforeAfterRule$1.evaluate(AbstractBeforeAfterRule.java:43)
	at org.apache.lucene.tests.util.TestRuleMarkFailure$1.evaluate(TestRuleMarkFailure.java:44)
	at org.apache.lucene.tests.util.TestRuleIgnoreAfterMaxFailures$1.evaluate(TestRuleIgnoreAfterMaxFailures.java:60)
	at org.apache.lucene.tests.util.TestRuleIgnoreTestSuites$1.evaluate(TestRuleIgnoreTestSuites.java:47)
	at org.junit.rules.RunRules.evaluate(RunRules.java:20)
	at com.carrotsearch.randomizedtesting.rules.StatementAdapter.evaluate(StatementAdapter.java:36)
	at com.carrotsearch.randomizedtesting.ThreadLeakControl$StatementRunner.run(ThreadLeakControl.java:390)
	at com.carrotsearch.randomizedtesting.ThreadLeakControl.lambda$forkTimeoutingTask$0(ThreadLeakControl.java:850)
	at java.base/java.lang.Thread.run(Thread.java:829)
Caused by: java.lang.IllegalArgumentException: no byte vector value is indexed for field 'vector_byte_encoding'
	at org.apache.lucene.queries.function.valuesource.ByteKnnVectorFieldSource.getValues(ByteKnnVectorFieldSource.java:45)
	at org.apache.lucene.queries.function.valuesource.VectorSimilarityFunction.getValues(VectorSimilarityFunction.java:47)
	at org.apache.lucene.queries.function.FunctionQuery$AllScorer.<init>(FunctionQuery.java:115)
	at org.apache.lucene.queries.function.FunctionQuery$FunctionWeight.scorer(FunctionQuery.java:76)
	at org.apache.lucene.search.Weight.scorerSupplier(Weight.java:136)
	at org.apache.lucene.search.BooleanWeight.scorerSupplier(BooleanWeight.java:542)
	at org.apache.lucene.search.BooleanWeight.scorer(BooleanWeight.java:507)
	at org.apache.lucene.search.Weight.bulkScorer(Weight.java:166)
	at org.apache.lucene.search.BooleanWeight.bulkScorer(BooleanWeight.java:395)
	at org.apache.lucene.search.IndexSearcher.search(IndexSearcher.java:770)
	at org.apache.solr.search.SolrIndexSearcher.search(SolrIndexSearcher.java:720)
	at org.apache.lucene.search.IndexSearcher.search(IndexSearcher.java:551)
	at org.apache.solr.search.SolrIndexSearcher.buildAndRunCollectorChain(SolrIndexSearcher.java:275)
	at org.apache.solr.search.SolrIndexSearcher.getDocListNC(SolrIndexSearcher.java:1878)
	at org.apache.solr.search.SolrIndexSearcher.getDocListC(SolrIndexSearcher.java:1695)
	at org.apache.solr.search.SolrIndexSearcher.search(SolrIndexSearcher.java:710)
	at org.apache.solr.handler.component.QueryComponent.doProcessUngroupedSearch(QueryComponent.java:1660)
	at org.apache.solr.handler.component.QueryComponent.process(QueryComponent.java:421)
	at org.apache.solr.handler.component.SearchHandler.handleRequestBody(SearchHandler.java:425)
	at org.apache.solr.handler.RequestHandlerBase.handleRequest(RequestHandlerBase.java:224)
	at org.apache.solr.core.SolrCore.execute(SolrCore.java:2893)
	at org.apache.solr.util.TestHarness.query(TestHarness.java:348)
	at org.apache.solr.util.TestHarness.query(TestHarness.java:328)
	at org.apache.solr.SolrTestCaseJ4.assertQ(SolrTestCaseJ4.java:996)
	... 48 more


FAILED:  org.apache.solr.search.function.TestDenseVectorFunctionQuery.byteFieldVectors_missingFieldValue_shouldReturnSimilarityZero

Error Message:
java.lang.RuntimeException: Exception during query

Stack Trace:
java.lang.RuntimeException: Exception during query
	at __randomizedtesting.SeedInfo.seed([D2F64F8150AC4953:C960DA2C07CA7AF]:0)
	at org.apache.solr.SolrTestCaseJ4.assertQ(SolrTestCaseJ4.java:1024)
	at org.apache.solr.SolrTestCaseJ4.assertQ(SolrTestCaseJ4.java:982)
	at org.apache.solr.search.function.TestDenseVectorFunctionQuery.byteFieldVectors_missingFieldValue_shouldReturnSimilarityZero(TestDenseVectorFunctionQuery.java:157)
	at java.base/jdk.internal.reflect.NativeMethodAccessorImpl.invoke0(Native Method)
	at java.base/jdk.internal.reflect.NativeMethodAccessorImpl.invoke(NativeMethodAccessorImpl.java:62)
	at java.base/jdk.internal.reflect.DelegatingMethodAccessorImpl.invoke(DelegatingMethodAccessorImpl.java:43)
	at java.base/java.lang.reflect.Method.invoke(Method.java:566)
	at com.carrotsearch.randomizedtesting.RandomizedRunner.invoke(RandomizedRunner.java:1758)
	at com.carrotsearch.randomizedtesting.RandomizedRunner$8.evaluate(RandomizedRunner.java:946)
	at com.carrotsearch.randomizedtesting.RandomizedRunner$9.evaluate(RandomizedRunner.java:982)
	at com.carrotsearch.randomizedtesting.RandomizedRunner$10.evaluate(RandomizedRunner.java:996)
	at com.carrotsearch.randomizedtesting.rules.SystemPropertiesRestoreRule$1.evaluate(SystemPropertiesRestoreRule.java:80)
	at org.junit.rules.RunRules.evaluate(RunRules.java:20)
	at org.apache.lucene.tests.util.TestRuleSetupTeardownChained$1.evaluate(TestRuleSetupTeardownChained.java:48)
	at org.apache.lucene.tests.util.AbstractBeforeAfterRule$1.evaluate(AbstractBeforeAfterRule.java:43)
	at org.apache.lucene.tests.util.TestRuleThreadAndTestName$1.evaluate(TestRuleThreadAndTestName.java:45)
	at org.apache.lucene.tests.util.TestRuleIgnoreAfterMaxFailures$1.evaluate(TestRuleIgnoreAfterMaxFailures.java:60)
	at org.apache.lucene.tests.util.TestRuleMarkFailure$1.evaluate(TestRuleMarkFailure.java:44)
	at org.junit.rules.RunRules.evaluate(RunRules.java:20)
	at com.carrotsearch.randomizedtesting.rules.StatementAdapter.evaluate(StatementAdapter.java:36)
	at com.carrotsearch.randomizedtesting.ThreadLeakControl$StatementRunner.run(ThreadLeakControl.java:390)
	at com.carrotsearch.randomizedtesting.ThreadLeakControl.forkTimeoutingTask(ThreadLeakControl.java:843)
	at com.carrotsearch.randomizedtesting.ThreadLeakControl$3.evaluate(ThreadLeakControl.java:490)
	at com.carrotsearch.randomizedtesting.RandomizedRunner.runSingleTest(RandomizedRunner.java:955)
	at com.carrotsearch.randomizedtesting.RandomizedRunner$5.evaluate(RandomizedRunner.java:840)
	at com.carrotsearch.randomizedtesting.RandomizedRunner$6.evaluate(RandomizedRunner.java:891)
	at com.carrotsearch.randomizedtesting.RandomizedRunner$7.evaluate(RandomizedRunner.java:902)
	at com.carrotsearch.randomizedtesting.rules.StatementAdapter.evaluate(StatementAdapter.java:36)
	at com.carrotsearch.randomizedtesting.rules.StatementAdapter.evaluate(StatementAdapter.java:36)
	at org.apache.lucene.tests.util.AbstractBeforeAfterRule$1.evaluate(AbstractBeforeAfterRule.java:43)
	at com.carrotsearch.randomizedtesting.rules.SystemPropertiesRestoreRule$1.evaluate(SystemPropertiesRestoreRule.java:80)
	at org.junit.rules.RunRules.evaluate(RunRules.java:20)
	at org.apache.lucene.tests.util.AbstractBeforeAfterRule$1.evaluate(AbstractBeforeAfterRule.java:43)
	at com.carrotsearch.randomizedtesting.rules.StatementAdapter.evaluate(StatementAdapter.java:36)
	at org.apache.lucene.tests.util.TestRuleStoreClassName$1.evaluate(TestRuleStoreClassName.java:38)
	at com.carrotsearch.randomizedtesting.rules.NoShadowingOrOverridesOnMethodsRule$1.evaluate(NoShadowingOrOverridesOnMethodsRule.java:40)
	at com.carrotsearch.randomizedtesting.rules.NoShadowingOrOverridesOnMethodsRule$1.evaluate(NoShadowingOrOverridesOnMethodsRule.java:40)
	at com.carrotsearch.randomizedtesting.rules.StatementAdapter.evaluate(StatementAdapter.java:36)
	at com.carrotsearch.randomizedtesting.rules.StatementAdapter.evaluate(StatementAdapter.java:36)
	at org.apache.lucene.tests.util.TestRuleAssertionsRequired$1.evaluate(TestRuleAssertionsRequired.java:53)
	at org.apache.lucene.tests.util.AbstractBeforeAfterRule$1.evaluate(AbstractBeforeAfterRule.java:43)
	at org.apache.lucene.tests.util.TestRuleMarkFailure$1.evaluate(TestRuleMarkFailure.java:44)
	at org.apache.lucene.tests.util.TestRuleIgnoreAfterMaxFailures$1.evaluate(TestRuleIgnoreAfterMaxFailures.java:60)
	at org.apache.lucene.tests.util.TestRuleIgnoreTestSuites$1.evaluate(TestRuleIgnoreTestSuites.java:47)
	at org.junit.rules.RunRules.evaluate(RunRules.java:20)
	at com.carrotsearch.randomizedtesting.rules.StatementAdapter.evaluate(StatementAdapter.java:36)
	at com.carrotsearch.randomizedtesting.ThreadLeakControl$StatementRunner.run(ThreadLeakControl.java:390)
	at com.carrotsearch.randomizedtesting.ThreadLeakControl.lambda$forkTimeoutingTask$0(ThreadLeakControl.java:850)
	at java.base/java.lang.Thread.run(Thread.java:829)
Caused by: java.lang.IllegalArgumentException: no byte vector value is indexed for field 'vector_byte_encoding'
	at org.apache.lucene.queries.function.valuesource.ByteKnnVectorFieldSource.getValues(ByteKnnVectorFieldSource.java:45)
	at org.apache.lucene.queries.function.valuesource.VectorSimilarityFunction.getValues(VectorSimilarityFunction.java:48)
	at org.apache.lucene.queries.function.FunctionQuery$AllScorer.<init>(FunctionQuery.java:115)
	at org.apache.lucene.queries.function.FunctionQuery$FunctionWeight.scorer(FunctionQuery.java:76)
	at org.apache.lucene.search.Weight.scorerSupplier(Weight.java:136)
	at org.apache.lucene.search.BooleanWeight.scorerSupplier(BooleanWeight.java:542)
	at org.apache.lucene.search.BooleanWeight.scorer(BooleanWeight.java:507)
	at org.apache.lucene.search.Weight.bulkScorer(Weight.java:166)
	at org.apache.lucene.search.BooleanWeight.bulkScorer(BooleanWeight.java:395)
	at org.apache.lucene.search.IndexSearcher.search(IndexSearcher.java:770)
	at org.apache.solr.search.SolrIndexSearcher.search(SolrIndexSearcher.java:720)
	at org.apache.lucene.search.IndexSearcher.search(IndexSearcher.java:551)
	at org.apache.solr.search.SolrIndexSearcher.buildAndRunCollectorChain(SolrIndexSearcher.java:275)
	at org.apache.solr.search.SolrIndexSearcher.getDocListNC(SolrIndexSearcher.java:1878)
	at org.apache.solr.search.SolrIndexSearcher.getDocListC(SolrIndexSearcher.java:1695)
	at org.apache.solr.search.SolrIndexSearcher.search(SolrIndexSearcher.java:710)
	at org.apache.solr.handler.component.QueryComponent.doProcessUngroupedSearch(QueryComponent.java:1660)
	at org.apache.solr.handler.component.QueryComponent.process(QueryComponent.java:421)
	at org.apache.solr.handler.component.SearchHandler.handleRequestBody(SearchHandler.java:425)
	at org.apache.solr.handler.RequestHandlerBase.handleRequest(RequestHandlerBase.java:224)
	at org.apache.solr.core.SolrCore.execute(SolrCore.java:2893)
	at org.apache.solr.util.TestHarness.query(TestHarness.java:348)
	at org.apache.solr.util.TestHarness.query(TestHarness.java:328)
	at org.apache.solr.SolrTestCaseJ4.assertQ(SolrTestCaseJ4.java:996)
	... 48 more


FAILED:  org.apache.solr.search.function.TestDenseVectorFunctionQuery.floatFieldVectors_shouldReturnFloatSimilarity

Error Message:
java.lang.RuntimeException: Exception during query

Stack Trace:
java.lang.RuntimeException: Exception during query
	at __randomizedtesting.SeedInfo.seed([D2F64F8150AC4953:9C44D0EC32D7E977]:0)
	at org.apache.solr.SolrTestCaseJ4.assertQ(SolrTestCaseJ4.java:1024)
	at org.apache.solr.SolrTestCaseJ4.assertQ(SolrTestCaseJ4.java:982)
	at org.apache.solr.search.function.TestDenseVectorFunctionQuery.floatFieldVectors_shouldReturnFloatSimilarity(TestDenseVectorFunctionQuery.java:111)
	at java.base/jdk.internal.reflect.NativeMethodAccessorImpl.invoke0(Native Method)
	at java.base/jdk.internal.reflect.NativeMethodAccessorImpl.invoke(NativeMethodAccessorImpl.java:62)
	at java.base/jdk.internal.reflect.DelegatingMethodAccessorImpl.invoke(DelegatingMethodAccessorImpl.java:43)
	at java.base/java.lang.reflect.Method.invoke(Method.java:566)
	at com.carrotsearch.randomizedtesting.RandomizedRunner.invoke(RandomizedRunner.java:1758)
	at com.carrotsearch.randomizedtesting.RandomizedRunner$8.evaluate(RandomizedRunner.java:946)
	at com.carrotsearch.randomizedtesting.RandomizedRunner$9.evaluate(RandomizedRunner.java:982)
	at com.carrotsearch.randomizedtesting.RandomizedRunner$10.evaluate(RandomizedRunner.java:996)
	at com.carrotsearch.randomizedtesting.rules.SystemPropertiesRestoreRule$1.evaluate(SystemPropertiesRestoreRule.java:80)
	at org.junit.rules.RunRules.evaluate(RunRules.java:20)
	at org.apache.lucene.tests.util.TestRuleSetupTeardownChained$1.evaluate(TestRuleSetupTeardownChained.java:48)
	at org.apache.lucene.tests.util.AbstractBeforeAfterRule$1.evaluate(AbstractBeforeAfterRule.java:43)
	at org.apache.lucene.tests.util.TestRuleThreadAndTestName$1.evaluate(TestRuleThreadAndTestName.java:45)
	at org.apache.lucene.tests.util.TestRuleIgnoreAfterMaxFailures$1.evaluate(TestRuleIgnoreAfterMaxFailures.java:60)
	at org.apache.lucene.tests.util.TestRuleMarkFailure$1.evaluate(TestRuleMarkFailure.java:44)
	at org.junit.rules.RunRules.evaluate(RunRules.java:20)
	at com.carrotsearch.randomizedtesting.rules.StatementAdapter.evaluate(StatementAdapter.java:36)
	at com.carrotsearch.randomizedtesting.ThreadLeakControl$StatementRunner.run(ThreadLeakControl.java:390)
	at com.carrotsearch.randomizedtesting.ThreadLeakControl.forkTimeoutingTask(ThreadLeakControl.java:843)
	at com.carrotsearch.randomizedtesting.ThreadLeakControl$3.evaluate(ThreadLeakControl.java:490)
	at com.carrotsearch.randomizedtesting.RandomizedRunner.runSingleTest(RandomizedRunner.java:955)
	at com.carrotsearch.randomizedtesting.RandomizedRunner$5.evaluate(RandomizedRunner.java:840)
	at com.carrotsearch.randomizedtesting.RandomizedRunner$6.evaluate(RandomizedRunner.java:891)
	at com.carrotsearch.randomizedtesting.RandomizedRunner$7.evaluate(RandomizedRunner.java:902)
	at com.carrotsearch.randomizedtesting.rules.StatementAdapter.evaluate(StatementAdapter.java:36)
	at com.carrotsearch.randomizedtesting.rules.StatementAdapter.evaluate(StatementAdapter.java:36)
	at org.apache.lucene.tests.util.AbstractBeforeAfterRule$1.evaluate(AbstractBeforeAfterRule.java:43)
	at com.carrotsearch.randomizedtesting.rules.SystemPropertiesRestoreRule$1.evaluate(SystemPropertiesRestoreRule.java:80)
	at org.junit.rules.RunRules.evaluate(RunRules.java:20)
	at org.apache.lucene.tests.util.AbstractBeforeAfterRule$1.evaluate(AbstractBeforeAfterRule.java:43)
	at com.carrotsearch.randomizedtesting.rules.StatementAdapter.evaluate(StatementAdapter.java:36)
	at org.apache.lucene.tests.util.TestRuleStoreClassName$1.evaluate(TestRuleStoreClassName.java:38)
	at com.carrotsearch.randomizedtesting.rules.NoShadowingOrOverridesOnMethodsRule$1.evaluate(NoShadowingOrOverridesOnMethodsRule.java:40)
	at com.carrotsearch.randomizedtesting.rules.NoShadowingOrOverridesOnMethodsRule$1.evaluate(NoShadowingOrOverridesOnMethodsRule.java:40)
	at com.carrotsearch.randomizedtesting.rules.StatementAdapter.evaluate(StatementAdapter.java:36)
	at com.carrotsearch.randomizedtesting.rules.StatementAdapter.evaluate(StatementAdapter.java:36)
	at org.apache.lucene.tests.util.TestRuleAssertionsRequired$1.evaluate(TestRuleAssertionsRequired.java:53)
	at org.apache.lucene.tests.util.AbstractBeforeAfterRule$1.evaluate(AbstractBeforeAfterRule.java:43)
	at org.apache.lucene.tests.util.TestRuleMarkFailure$1.evaluate(TestRuleMarkFailure.java:44)
	at org.apache.lucene.tests.util.TestRuleIgnoreAfterMaxFailures$1.evaluate(TestRuleIgnoreAfterMaxFailures.java:60)
	at org.apache.lucene.tests.util.TestRuleIgnoreTestSuites$1.evaluate(TestRuleIgnoreTestSuites.java:47)
	at org.junit.rules.RunRules.evaluate(RunRules.java:20)
	at com.carrotsearch.randomizedtesting.rules.StatementAdapter.evaluate(StatementAdapter.java:36)
	at com.carrotsearch.randomizedtesting.ThreadLeakControl$StatementRunner.run(ThreadLeakControl.java:390)
	at com.carrotsearch.randomizedtesting.ThreadLeakControl.lambda$forkTimeoutingTask$0(ThreadLeakControl.java:850)
	at java.base/java.lang.Thread.run(Thread.java:829)
Caused by: java.lang.IllegalArgumentException: no float vector value is indexed for field 'vector2'
	at org.apache.lucene.queries.function.valuesource.FloatKnnVectorFieldSource.getValues(FloatKnnVectorFieldSource.java:45)
	at org.apache.lucene.queries.function.valuesource.VectorSimilarityFunction.getValues(VectorSimilarityFunction.java:48)
	at org.apache.lucene.queries.function.FunctionQuery$AllScorer.<init>(FunctionQuery.java:115)
	at org.apache.lucene.queries.function.FunctionQuery$FunctionWeight.scorer(FunctionQuery.java:76)
	at org.apache.lucene.search.Weight.scorerSupplier(Weight.java:136)
	at org.apache.lucene.search.BooleanWeight.scorerSupplier(BooleanWeight.java:542)
	at org.apache.lucene.search.BooleanWeight.scorer(BooleanWeight.java:507)
	at org.apache.lucene.search.Weight.bulkScorer(Weight.java:166)
	at org.apache.lucene.search.BooleanWeight.bulkScorer(BooleanWeight.java:395)
	at org.apache.lucene.search.IndexSearcher.search(IndexSearcher.java:770)
	at org.apache.solr.search.SolrIndexSearcher.search(SolrIndexSearcher.java:720)
	at org.apache.lucene.search.IndexSearcher.search(IndexSearcher.java:551)
	at org.apache.solr.search.SolrIndexSearcher.buildAndRunCollectorChain(SolrIndexSearcher.java:275)
	at org.apache.solr.search.SolrIndexSearcher.getDocListNC(SolrIndexSearcher.java:1878)
	at org.apache.solr.search.SolrIndexSearcher.getDocListC(SolrIndexSearcher.java:1695)
	at org.apache.solr.search.SolrIndexSearcher.search(SolrIndexSearcher.java:710)
	at org.apache.solr.handler.component.QueryComponent.doProcessUngroupedSearch(QueryComponent.java:1660)
	at org.apache.solr.handler.component.QueryComponent.process(QueryComponent.java:421)
	at org.apache.solr.handler.component.SearchHandler.handleRequestBody(SearchHandler.java:425)
	at org.apache.solr.handler.RequestHandlerBase.handleRequest(RequestHandlerBase.java:224)
	at org.apache.solr.core.SolrCore.execute(SolrCore.java:2893)
	at org.apache.solr.util.TestHarness.query(TestHarness.java:348)
	at org.apache.solr.util.TestHarness.query(TestHarness.java:328)
	at org.apache.solr.SolrTestCaseJ4.assertQ(SolrTestCaseJ4.java:996)
	... 48 more


FAILED:  org.apache.solr.search.function.TestDenseVectorFunctionQuery.floatFieldVectors_missingFieldValue_shouldReturnSimilarityZero

Error Message:
java.lang.RuntimeException: Exception during query

Stack Trace:
java.lang.RuntimeException: Exception during query
	at __randomizedtesting.SeedInfo.seed([D2F64F8150AC4953:46DE04210A51B045]:0)
	at org.apache.solr.SolrTestCaseJ4.assertQ(SolrTestCaseJ4.java:1024)
	at org.apache.solr.SolrTestCaseJ4.assertQ(SolrTestCaseJ4.java:982)
	at org.apache.solr.search.function.TestDenseVectorFunctionQuery.floatFieldVectors_missingFieldValue_shouldReturnSimilarityZero(TestDenseVectorFunctionQuery.java:173)
	at java.base/jdk.internal.reflect.NativeMethodAccessorImpl.invoke0(Native Method)
	at java.base/jdk.internal.reflect.NativeMethodAccessorImpl.invoke(NativeMethodAccessorImpl.java:62)
	at java.base/jdk.internal.reflect.DelegatingMethodAccessorImpl.invoke(DelegatingMethodAccessorImpl.java:43)
	at java.base/java.lang.reflect.Method.invoke(Method.java:566)
	at com.carrotsearch.randomizedtesting.RandomizedRunner.invoke(RandomizedRunner.java:1758)
	at com.carrotsearch.randomizedtesting.RandomizedRunner$8.evaluate(RandomizedRunner.java:946)
	at com.carrotsearch.randomizedtesting.RandomizedRunner$9.evaluate(RandomizedRunner.java:982)
	at com.carrotsearch.randomizedtesting.RandomizedRunner$10.evaluate(RandomizedRunner.java:996)
	at com.carrotsearch.randomizedtesting.rules.SystemPropertiesRestoreRule$1.evaluate(SystemPropertiesRestoreRule.java:80)
	at org.junit.rules.RunRules.evaluate(RunRules.java:20)
	at org.apache.lucene.tests.util.TestRuleSetupTeardownChained$1.evaluate(TestRuleSetupTeardownChained.java:48)
	at org.apache.lucene.tests.util.AbstractBeforeAfterRule$1.evaluate(AbstractBeforeAfterRule.java:43)
	at org.apache.lucene.tests.util.TestRuleThreadAndTestName$1.evaluate(TestRuleThreadAndTestName.java:45)
	at org.apache.lucene.tests.util.TestRuleIgnoreAfterMaxFailures$1.evaluate(TestRuleIgnoreAfterMaxFailures.java:60)
	at org.apache.lucene.tests.util.TestRuleMarkFailure$1.evaluate(TestRuleMarkFailure.java:44)
	at org.junit.rules.RunRules.evaluate(RunRules.java:20)
	at com.carrotsearch.randomizedtesting.rules.StatementAdapter.evaluate(StatementAdapter.java:36)
	at com.carrotsearch.randomizedtesting.ThreadLeakControl$StatementRunner.run(ThreadLeakControl.java:390)
	at com.carrotsearch.randomizedtesting.ThreadLeakControl.forkTimeoutingTask(ThreadLeakControl.java:843)
	at com.carrotsearch.randomizedtesting.ThreadLeakControl$3.evaluate(ThreadLeakControl.java:490)
	at com.carrotsearch.randomizedtesting.RandomizedRunner.runSingleTest(RandomizedRunner.java:955)
	at com.carrotsearch.randomizedtesting.RandomizedRunner$5.evaluate(RandomizedRunner.java:840)
	at com.carrotsearch.randomizedtesting.RandomizedRunner$6.evaluate(RandomizedRunner.java:891)
	at com.carrotsearch.randomizedtesting.RandomizedRunner$7.evaluate(RandomizedRunner.java:902)
	at com.carrotsearch.randomizedtesting.rules.StatementAdapter.evaluate(StatementAdapter.java:36)
	at com.carrotsearch.randomizedtesting.rules.StatementAdapter.evaluate(StatementAdapter.java:36)
	at org.apache.lucene.tests.util.AbstractBeforeAfterRule$1.evaluate(AbstractBeforeAfterRule.java:43)
	at com.carrotsearch.randomizedtesting.rules.SystemPropertiesRestoreRule$1.evaluate(SystemPropertiesRestoreRule.java:80)
	at org.junit.rules.RunRules.evaluate(RunRules.java:20)
	at org.apache.lucene.tests.util.AbstractBeforeAfterRule$1.evaluate(AbstractBeforeAfterRule.java:43)
	at com.carrotsearch.randomizedtesting.rules.StatementAdapter.evaluate(StatementAdapter.java:36)
	at org.apache.lucene.tests.util.TestRuleStoreClassName$1.evaluate(TestRuleStoreClassName.java:38)
	at com.carrotsearch.randomizedtesting.rules.NoShadowingOrOverridesOnMethodsRule$1.evaluate(NoShadowingOrOverridesOnMethodsRule.java:40)
	at com.carrotsearch.randomizedtesting.rules.NoShadowingOrOverridesOnMethodsRule$1.evaluate(NoShadowingOrOverridesOnMethodsRule.java:40)
	at com.carrotsearch.randomizedtesting.rules.StatementAdapter.evaluate(StatementAdapter.java:36)
	at com.carrotsearch.randomizedtesting.rules.StatementAdapter.evaluate(StatementAdapter.java:36)
	at org.apache.lucene.tests.util.TestRuleAssertionsRequired$1.evaluate(TestRuleAssertionsRequired.java:53)
	at org.apache.lucene.tests.util.AbstractBeforeAfterRule$1.evaluate(AbstractBeforeAfterRule.java:43)
	at org.apache.lucene.tests.util.TestRuleMarkFailure$1.evaluate(TestRuleMarkFailure.java:44)
	at org.apache.lucene.tests.util.TestRuleIgnoreAfterMaxFailures$1.evaluate(TestRuleIgnoreAfterMaxFailures.java:60)
	at org.apache.lucene.tests.util.TestRuleIgnoreTestSuites$1.evaluate(TestRuleIgnoreTestSuites.java:47)
	at org.junit.rules.RunRules.evaluate(RunRules.java:20)
	at com.carrotsearch.randomizedtesting.rules.StatementAdapter.evaluate(StatementAdapter.java:36)
	at com.carrotsearch.randomizedtesting.ThreadLeakControl$StatementRunner.run(ThreadLeakControl.java:390)
	at com.carrotsearch.randomizedtesting.ThreadLeakControl.lambda$forkTimeoutingTask$0(ThreadLeakControl.java:850)
	at java.base/java.lang.Thread.run(Thread.java:829)
Caused by: java.lang.IllegalArgumentException: no float vector value is indexed for field 'vector2'
	at org.apache.lucene.queries.function.valuesource.FloatKnnVectorFieldSource.getValues(FloatKnnVectorFieldSource.java:45)
	at org.apache.lucene.queries.function.valuesource.VectorSimilarityFunction.getValues(VectorSimilarityFunction.java:48)
	at org.apache.lucene.queries.function.FunctionQuery$AllScorer.<init>(FunctionQuery.java:115)
	at org.apache.lucene.queries.function.FunctionQuery$FunctionWeight.scorer(FunctionQuery.java:76)
	at org.apache.lucene.search.Weight.scorerSupplier(Weight.java:136)
	at org.apache.lucene.search.BooleanWeight.scorerSupplier(BooleanWeight.java:542)
	at org.apache.lucene.search.BooleanWeight.scorer(BooleanWeight.java:507)
	at org.apache.lucene.search.Weight.bulkScorer(Weight.java:166)
	at org.apache.lucene.search.BooleanWeight.bulkScorer(BooleanWeight.java:395)
	at org.apache.lucene.search.IndexSearcher.search(IndexSearcher.java:770)
	at org.apache.solr.search.SolrIndexSearcher.search(SolrIndexSearcher.java:720)
	at org.apache.lucene.search.IndexSearcher.search(IndexSearcher.java:551)
	at org.apache.solr.search.SolrIndexSearcher.buildAndRunCollectorChain(SolrIndexSearcher.java:275)
	at org.apache.solr.search.SolrIndexSearcher.getDocListNC(SolrIndexSearcher.java:1878)
	at org.apache.solr.search.SolrIndexSearcher.getDocListC(SolrIndexSearcher.java:1695)
	at org.apache.solr.search.SolrIndexSearcher.search(SolrIndexSearcher.java:710)
	at org.apache.solr.handler.component.QueryComponent.doProcessUngroupedSearch(QueryComponent.java:1660)
	at org.apache.solr.handler.component.QueryComponent.process(QueryComponent.java:421)
	at org.apache.solr.handler.component.SearchHandler.handleRequestBody(SearchHandler.java:425)
	at org.apache.solr.handler.RequestHandlerBase.handleRequest(RequestHandlerBase.java:224)
	at org.apache.solr.core.SolrCore.execute(SolrCore.java:2893)
	at org.apache.solr.util.TestHarness.query(TestHarness.java:348)
	at org.apache.solr.util.TestHarness.query(TestHarness.java:328)
	at org.apache.solr.SolrTestCaseJ4.assertQ(SolrTestCaseJ4.java:996)
	... 48 more




Build Log:
[...truncated 27994 lines...]
ERROR: The following test(s) have failed:
  - org.apache.solr.cloud.OverseerTest.testShardLeaderChange (:solr:core)
    Test output: /home/jenkins/jenkins-slave/workspace/Solr/Solr-NightlyTests-main/solr/core/build/test-results/test/outputs/OUTPUT-org.apache.solr.cloud.OverseerTest.txt
    Reproduce with: gradlew :solr:core:test --tests "org.apache.solr.cloud.OverseerTest.testShardLeaderChange" -Ptests.jvms=4 -Ptests.haltonfailure=false "-Ptests.jvmargs=-XX:TieredStopAtLevel=1 -XX:+UseParallelGC -XX:ActiveProcessorCount=1 -XX:ReservedCodeCacheSize=120m" -Ptests.seed=D2F64F8150AC4953 -Ptests.multiplier=2 -Ptests.nightly=true -Ptests.badapples=false -Ptests.file.encoding=ISO-8859-1 -Ptests.linedocsfile=/home/jenkins/jenkins-slave/workspace/Solr/Solr-NightlyTests-main/test-data/enwiki.random.lines.txt

  - org.apache.solr.core.TestSolrDeletionPolicy1.testNumCommitsConfigured (:solr:core)
    Test output: /home/jenkins/jenkins-slave/workspace/Solr/Solr-NightlyTests-main/solr/core/build/test-results/test/outputs/OUTPUT-org.apache.solr.core.TestSolrDeletionPolicy1.txt
    Reproduce with: gradlew :solr:core:test --tests "org.apache.solr.core.TestSolrDeletionPolicy1.testNumCommitsConfigured" -Ptests.jvms=4 -Ptests.haltonfailure=false "-Ptests.jvmargs=-XX:TieredStopAtLevel=1 -XX:+UseParallelGC -XX:ActiveProcessorCount=1 -XX:ReservedCodeCacheSize=120m" -Ptests.seed=D2F64F8150AC4953 -Ptests.multiplier=2 -Ptests.nightly=true -Ptests.badapples=false -Ptests.file.encoding=ISO-8859-1 -Ptests.linedocsfile=/home/jenkins/jenkins-slave/workspace/Solr/Solr-NightlyTests-main/test-data/enwiki.random.lines.txt

  - org.apache.solr.search.function.TestDenseVectorFunctionQuery.resultOfVectorFunction_canBeUsedAsFloatFunctionInput (:solr:core)
    Test output: /home/jenkins/jenkins-slave/workspace/Solr/Solr-NightlyTests-main/solr/core/build/test-results/test/outputs/OUTPUT-org.apache.solr.search.function.TestDenseVectorFunctionQuery.txt
    Reproduce with: gradlew :solr:core:test --tests "org.apache.solr.search.function.TestDenseVectorFunctionQuery.resultOfVectorFunction_canBeUsedAsFloatFunctionInput" -Ptests.jvms=4 -Ptests.haltonfailure=false "-Ptests.jvmargs=-XX:TieredStopAtLevel=1 -XX:+UseParallelGC -XX:ActiveProcessorCount=1 -XX:ReservedCodeCacheSize=120m" -Ptests.seed=D2F64F8150AC4953 -Ptests.multiplier=2 -Ptests.nightly=true -Ptests.badapples=false -Ptests.file.encoding=ISO-8859-1 -Ptests.linedocsfile=/home/jenkins/jenkins-slave/workspace/Solr/Solr-NightlyTests-main/test-data/enwiki.random.lines.txt

  - org.apache.solr.search.function.TestDenseVectorFunctionQuery.byteFieldVectors_shouldReturnFloatSimilarity (:solr:core)
    Test output: /home/jenkins/jenkins-slave/workspace/Solr/Solr-NightlyTests-main/solr/core/build/test-results/test/outputs/OUTPUT-org.apache.solr.search.function.TestDenseVectorFunctionQuery.txt
    Reproduce with: gradlew :solr:core:test --tests "org.apache.solr.search.function.TestDenseVectorFunctionQuery.byteFieldVectors_shouldReturnFloatSimilarity" -Ptests.jvms=4 -Ptests.haltonfailure=false "-Ptests.jvmargs=-XX:TieredStopAtLevel=1 -XX:+UseParallelGC -XX:ActiveProcessorCount=1 -XX:ReservedCodeCacheSize=120m" -Ptests.seed=D2F64F8150AC4953 -Ptests.multiplier=2 -Ptests.nightly=true -Ptests.badapples=false -Ptests.file.encoding=ISO-8859-1 -Ptests.linedocsfile=/home/jenkins/jenkins-slave/workspace/Solr/Solr-NightlyTests-main/test-data/enwiki.random.lines.txt

  - org.apache.solr.search.function.TestDenseVectorFunctionQuery.byteFieldVectors_missingFieldValue_shouldReturnSimilarityZero (:solr:core)
    Test output: /home/jenkins/jenkins-slave/workspace/Solr/Solr-NightlyTests-main/solr/core/build/test-results/test/outputs/OUTPUT-org.apache.solr.search.function.TestDenseVectorFunctionQuery.txt
    Reproduce with: gradlew :solr:core:test --tests "org.apache.solr.search.function.TestDenseVectorFunctionQuery.byteFieldVectors_missingFieldValue_shouldReturnSimilarityZero" -Ptests.jvms=4 -Ptests.haltonfailure=false "-Ptests.jvmargs=-XX:TieredStopAtLevel=1 -XX:+UseParallelGC -XX:ActiveProcessorCount=1 -XX:ReservedCodeCacheSize=120m" -Ptests.seed=D2F64F8150AC4953 -Ptests.multiplier=2 -Ptests.nightly=true -Ptests.badapples=false -Ptests.file.encoding=ISO-8859-1 -Ptests.linedocsfile=/home/jenkins/jenkins-slave/workspace/Solr/Solr-NightlyTests-main/test-data/enwiki.random.lines.txt

  - org.apache.solr.search.function.TestDenseVectorFunctionQuery.floatFieldVectors_shouldReturnFloatSimilarity (:solr:core)
    Test output: /home/jenkins/jenkins-slave/workspace/Solr/Solr-NightlyTests-main/solr/core/build/test-results/test/outputs/OUTPUT-org.apache.solr.search.function.TestDenseVectorFunctionQuery.txt
    Reproduce with: gradlew :solr:core:test --tests "org.apache.solr.search.function.TestDenseVectorFunctionQuery.floatFieldVectors_shouldReturnFloatSimilarity" -Ptests.jvms=4 -Ptests.haltonfailure=false "-Ptests.jvmargs=-XX:TieredStopAtLevel=1 -XX:+UseParallelGC -XX:ActiveProcessorCount=1 -XX:ReservedCodeCacheSize=120m" -Ptests.seed=D2F64F8150AC4953 -Ptests.multiplier=2 -Ptests.nightly=true -Ptests.badapples=false -Ptests.file.encoding=ISO-8859-1 -Ptests.linedocsfile=/home/jenkins/jenkins-slave/workspace/Solr/Solr-NightlyTests-main/test-data/enwiki.random.lines.txt

  - org.apache.solr.search.function.TestDenseVectorFunctionQuery.floatFieldVectors_missingFieldValue_shouldReturnSimilarityZero (:solr:core)
    Test output: /home/jenkins/jenkins-slave/workspace/Solr/Solr-NightlyTests-main/solr/core/build/test-results/test/outputs/OUTPUT-org.apache.solr.search.function.TestDenseVectorFunctionQuery.txt
    Reproduce with: gradlew :solr:core:test --tests "org.apache.solr.search.function.TestDenseVectorFunctionQuery.floatFieldVectors_missingFieldValue_shouldReturnSimilarityZero" -Ptests.jvms=4 -Ptests.haltonfailure=false "-Ptests.jvmargs=-XX:TieredStopAtLevel=1 -XX:+UseParallelGC -XX:ActiveProcessorCount=1 -XX:ReservedCodeCacheSize=120m" -Ptests.seed=D2F64F8150AC4953 -Ptests.multiplier=2 -Ptests.nightly=true -Ptests.badapples=false -Ptests.file.encoding=ISO-8859-1 -Ptests.linedocsfile=/home/jenkins/jenkins-slave/workspace/Solr/Solr-NightlyTests-main/test-data/enwiki.random.lines.txt


Deprecated Gradle features were used in this build, making it incompatible with Gradle 8.0.

You can use '--warning-mode all' to show the individual deprecation warnings and determine if they come from your own scripts or plugins.

See https://docs.gradle.org/7.6/userguide/command_line_interface.html#sec:command_line_warnings

BUILD SUCCESSFUL in 1h 34m 47s
128 actionable tasks: 128 executed

Publishing build scan...
https://ge.apache.org/s/na5mryxh24vfq

Build step 'Invoke Gradle script' changed build result to SUCCESS
Archiving artifacts
hudson.FilePath$ValidateAntFileMask$1Cancel
	at hudson.FilePath$ValidateAntFileMask$1.isCaseSensitive(FilePath.java:3300)
	at org.apache.tools.ant.DirectoryScanner.isIncluded(DirectoryScanner.java:1370)
	at org.apache.tools.ant.DirectoryScanner.scandir(DirectoryScanner.java:1241)
	at org.apache.tools.ant.DirectoryScanner.scandir(DirectoryScanner.java:1267)
	at org.apache.tools.ant.DirectoryScanner.scandir(DirectoryScanner.java:1267)
	at org.apache.tools.ant.DirectoryScanner.scandir(DirectoryScanner.java:1267)
	at org.apache.tools.ant.DirectoryScanner.scandir(DirectoryScanner.java:1267)
	at org.apache.tools.ant.DirectoryScanner.scandir(DirectoryScanner.java:1267)
	at org.apache.tools.ant.DirectoryScanner.scandir(DirectoryScanner.java:1267)
	at org.apache.tools.ant.DirectoryScanner.scandir(DirectoryScanner.java:1267)
	at org.apache.tools.ant.DirectoryScanner.scandir(DirectoryScanner.java:1194)
	at org.apache.tools.ant.DirectoryScanner.scandir(DirectoryScanner.java:1156)
	at org.apache.tools.ant.DirectoryScanner.checkIncludePatterns(DirectoryScanner.java:954)
	at org.apache.tools.ant.DirectoryScanner.scan(DirectoryScanner.java:912)
	at hudson.FilePath$ValidateAntFileMask.hasMatch(FilePath.java:3313)
Caused: hudson.FilePath$FileMaskNoMatchesFoundException: no matches found within 10000
	at hudson.FilePath$ValidateAntFileMask.hasMatch(FilePath.java:3318)
	at hudson.FilePath$ValidateAntFileMask.invoke(FilePath.java:3196)
	at hudson.FilePath$ValidateAntFileMask.invoke(FilePath.java:3174)
	at hudson.FilePath$FileCallableWrapper.call(FilePath.java:3578)
Also:   hudson.remoting.Channel$CallSiteStackTrace: Remote call to lucene-solr-1
		at hudson.remoting.Channel.attachCallSiteStackTrace(Channel.java:1784)
		at hudson.remoting.UserRequest$ExceptionResponse.retrieve(UserRequest.java:356)
		at hudson.remoting.Channel.call(Channel.java:1000)
		at hudson.FilePath.act(FilePath.java:1192)
		at hudson.FilePath.act(FilePath.java:1181)
		at hudson.FilePath.validateAntFileMask(FilePath.java:3171)
		at hudson.tasks.ArtifactArchiver.perform(ArtifactArchiver.java:271)
		at hudson.tasks.BuildStepCompatibilityLayer.perform(BuildStepCompatibilityLayer.java:80)
		at hudson.tasks.BuildStepMonitor$1.perform(BuildStepMonitor.java:20)
		at hudson.model.AbstractBuild$AbstractBuildExecution.perform(AbstractBuild.java:818)
		at hudson.model.AbstractBuild$AbstractBuildExecution.performAllBuildSteps(AbstractBuild.java:767)
		at hudson.model.Build$BuildExecution.post2(Build.java:179)
		at hudson.model.AbstractBuild$AbstractBuildExecution.post(AbstractBuild.java:711)
		at hudson.model.Run.execute(Run.java:1925)
		at hudson.model.FreeStyleBuild.run(FreeStyleBuild.java:44)
		at hudson.model.ResourceController.execute(ResourceController.java:101)
		at hudson.model.Executor.run(Executor.java:442)
Caused: hudson.FilePath$TunneledInterruptedException
	at hudson.FilePath$FileCallableWrapper.call(FilePath.java:3580)
	at hudson.remoting.UserRequest.perform(UserRequest.java:211)
	at hudson.remoting.UserRequest.perform(UserRequest.java:54)
	at hudson.remoting.Request$2.run(Request.java:377)
	at hudson.remoting.InterceptingExecutorService.lambda$wrap$0(InterceptingExecutorService.java:78)
	at java.base/java.util.concurrent.FutureTask.run(FutureTask.java:264)
	at java.base/java.util.concurrent.ThreadPoolExecutor.runWorker(ThreadPoolExecutor.java:1128)
	at java.base/java.util.concurrent.ThreadPoolExecutor$Worker.run(ThreadPoolExecutor.java:628)
	at java.base/java.lang.Thread.run(Thread.java:829)
Caused: java.lang.InterruptedException: hudson.FilePath$FileMaskNoMatchesFoundException: no matches found within 10000
	at hudson.FilePath.act(FilePath.java:1194)
	at hudson.FilePath.act(FilePath.java:1181)
	at hudson.FilePath.validateAntFileMask(FilePath.java:3171)
	at hudson.tasks.ArtifactArchiver.perform(ArtifactArchiver.java:271)
	at hudson.tasks.BuildStepCompatibilityLayer.perform(BuildStepCompatibilityLayer.java:80)
	at hudson.tasks.BuildStepMonitor$1.perform(BuildStepMonitor.java:20)
	at hudson.model.AbstractBuild$AbstractBuildExecution.perform(AbstractBuild.java:818)
	at hudson.model.AbstractBuild$AbstractBuildExecution.performAllBuildSteps(AbstractBuild.java:767)
	at hudson.model.Build$BuildExecution.post2(Build.java:179)
	at hudson.model.AbstractBuild$AbstractBuildExecution.post(AbstractBuild.java:711)
	at hudson.model.Run.execute(Run.java:1925)
	at hudson.model.FreeStyleBuild.run(FreeStyleBuild.java:44)
	at hudson.model.ResourceController.execute(ResourceController.java:101)
	at hudson.model.Executor.run(Executor.java:442)
No artifacts found that match the file pattern "**/*.events,heapdumps/**,**/hs_err_pid*". Configuration error?
Recording test results
[Checks API] No suitable checks publisher found.
Build step 'Publish JUnit test result report' changed build result to UNSTABLE
Email was triggered for: Unstable (Test Failures)
Sending email for trigger: Unstable (Test Failures)