You are viewing a plain text version of this content. The canonical link for it is here.
Posted to builds@beam.apache.org by Apache Jenkins Server <je...@builds.apache.org> on 2022/05/10 01:33:20 UTC
Build failed in Jenkins: beam_PostCommit_Go_VR_Flink #6137
See <https://ci-beam.apache.org/job/beam_PostCommit_Go_VR_Flink/6137/display/redirect?page=changes>
Changes:
[noreply] [BEAM-14169] Add Credentials rotation cron job for clusters (#17383)
[noreply] [BEAM-14347] Add generic registration for accumulators (#17579)
------------------------------------------
[...truncated 79.90 MB...]
"payload": "AQ==",
"labels": {
"PCOLLECTION": "n12"
}
}, {
"urn": "beam:metric:sampled_byte_size:v1",
"type": "beam:metrics:distribution_int64:v1",
"payload": "AQEBAQ==",
"labels": {
"PCOLLECTION": "n10"
}
}, {
"urn": "beam:metric:sampled_byte_size:v1",
"type": "beam:metrics:distribution_int64:v1",
"payload": "AQ8PDw==",
"labels": {
"PCOLLECTION": "n12"
}
}, {
"urn": "beam:metric:data_channel:read_index:v1",
"type": "beam:metrics:sum_int64:v1",
"payload": "AQ==",
"labels": {
"PTRANSFORM": "fn/read/n14:0"
}
}, {
"urn": "beam:metric:ptransform_execution_time:total_msecs:v1",
"type": "beam:metrics:sum_int64:v1",
"payload": "+CM=",
"labels": {
"PTRANSFORM": "passert.Equals/passert.failIfBadEntries"
}
}, {
"urn": "beam:metric:pardo_execution_time:start_bundle_msecs:v1",
"type": "beam:metrics:sum_int64:v1",
"payload": "+CM=",
"labels": {
"PTRANSFORM": "passert.Equals/passert.failIfBadEntries"
}
}, {
"urn": "beam:metric:pardo_execution_time:process_bundle_msecs:v1",
"type": "beam:metrics:sum_int64:v1",
"payload": "AA==",
"labels": {
"PTRANSFORM": "passert.Equals/passert.failIfBadEntries"
}
}, {
"urn": "beam:metric:pardo_execution_time:finish_bundle_msecs:v1",
"type": "beam:metrics:sum_int64:v1",
"payload": "AA==",
"labels": {
"PTRANSFORM": "passert.Equals/passert.failIfBadEntries"
}
}, {
"urn": "beam:metric:element_count:v1",
"type": "beam:metrics:sum_int64:v1",
"payload": "AQ==",
"labels": {
"PCOLLECTION": "n14"
}
}, {
"urn": "beam:metric:sampled_byte_size:v1",
"type": "beam:metrics:distribution_int64:v1",
"payload": "AQEBAQ==",
"labels": {
"PCOLLECTION": "n14"
}
}, {
"urn": "beam:metric:ptransform_execution_time:total_msecs:v1",
"type": "beam:metrics:sum_int64:v1",
"payload": "0EE=",
"labels": {
"PTRANSFORM": "beam.addFixedKeyFn"
}
}, {
"urn": "beam:metric:pardo_execution_time:start_bundle_msecs:v1",
"type": "beam:metrics:sum_int64:v1",
"payload": "AA==",
"labels": {
"PTRANSFORM": "beam.createFn"
}
}, {
"urn": "beam:metric:element_count:v1",
"type": "beam:metrics:sum_int64:v1",
"payload": "AQ==",
"labels": {
"PCOLLECTION": "n1"
}
}, {
"urn": "beam:metric:element_count:v1",
"type": "beam:metrics:sum_int64:v1",
"payload": "BA==",
"labels": {
"PCOLLECTION": "n3"
}
}, {
"urn": "beam:metric:ptransform_execution_time:total_msecs:v1",
"type": "beam:metrics:sum_int64:v1",
"payload": "AA==",
"labels": {
"PTRANSFORM": "beam.createFn"
}
}, {
"urn": "beam:metric:pardo_execution_time:finish_bundle_msecs:v1",
"type": "beam:metrics:sum_int64:v1",
"payload": "AA==",
"labels": {
"PTRANSFORM": "beam.addFixedKeyFn"
}
}, {
"urn": "beam:metric:element_count:v1",
"type": "beam:metrics:sum_int64:v1",
"payload": "BA==",
"labels": {
"PCOLLECTION": "n2"
}
}, {
"urn": "beam:metric:pardo_execution_time:process_bundle_msecs:v1",
"type": "beam:metrics:sum_int64:v1",
"payload": "AA==",
"labels": {
"PTRANSFORM": "beam.createFn"
}
}, {
"urn": "beam:metric:pardo_execution_time:start_bundle_msecs:v1",
"type": "beam:metrics:sum_int64:v1",
"payload": "0EE=",
"labels": {
"PTRANSFORM": "beam.addFixedKeyFn"
}
}, {
"urn": "beam:metric:pardo_execution_time:finish_bundle_msecs:v1",
"type": "beam:metrics:sum_int64:v1",
"payload": "AA==",
"labels": {
"PTRANSFORM": "beam.createFn"
}
}, {
"urn": "beam:metric:pardo_execution_time:process_bundle_msecs:v1",
"type": "beam:metrics:sum_int64:v1",
"payload": "AA==",
"labels": {
"PTRANSFORM": "beam.addFixedKeyFn"
}
}, {
"urn": "beam:metric:data_channel:read_index:v1",
"type": "beam:metrics:sum_int64:v1",
"payload": "AQ==",
"labels": {
"PTRANSFORM": "fn/read/n1:0"
}
}, {
"urn": "beam:metric:sampled_byte_size:v1",
"type": "beam:metrics:distribution_int64:v1",
"payload": "AQEBAQ==",
"labels": {
"PCOLLECTION": "n1"
}
}, {
"urn": "beam:metric:sampled_byte_size:v1",
"type": "beam:metrics:distribution_int64:v1",
"payload": "BEQREQ==",
"labels": {
"PCOLLECTION": "n3"
}
}, {
"urn": "beam:metric:sampled_byte_size:v1",
"type": "beam:metrics:distribution_int64:v1",
"payload": "BAgCAg==",
"labels": {
"PCOLLECTION": "n2"
}
}]
}
}
May 10, 2022 1:33:06 AM org.apache.beam.runners.jobsubmission.InMemoryJobService lambda$run$0
WARNING: Failed to remove job staging directory for token go-testemitpardoaftergbk_51dd4731-81e8-4eba-b937-2b0ab919dd4a.
java.io.FileNotFoundException: No files found for spec: /tmp/beam-artifact-staging/f7ec32e75d006dc8aeffb083b0df6fe826acef0172d41bbc1df1068e8e409efe/* in working directory <https://ci-beam.apache.org/job/beam_PostCommit_Go_VR_Flink/ws/src/.>
at org.apache.beam.sdk.io.LocalFileSystem.matchOne(LocalFileSystem.java:307)
at org.apache.beam.sdk.io.LocalFileSystem.match(LocalFileSystem.java:105)
at org.apache.beam.sdk.io.LocalFileSystem.match(LocalFileSystem.java:98)
at org.apache.beam.sdk.io.FileSystems.match(FileSystems.java:124)
at org.apache.beam.sdk.io.FileSystems.matchResources(FileSystems.java:217)
at org.apache.beam.runners.fnexecution.artifact.ArtifactStagingService$1.removeStagedArtifacts(ArtifactStagingService.java:180)
at org.apache.beam.runners.fnexecution.artifact.ArtifactStagingService.removeStagedArtifacts(ArtifactStagingService.java:115)
at org.apache.beam.runners.jobsubmission.JobServerDriver.lambda$createJobService$0(JobServerDriver.java:67)
at org.apache.beam.runners.jobsubmission.InMemoryJobService.lambda$run$0(InMemoryJobService.java:261)
at org.apache.beam.runners.jobsubmission.JobInvocation.setState(JobInvocation.java:249)
at org.apache.beam.runners.jobsubmission.JobInvocation.access$200(JobInvocation.java:51)
at org.apache.beam.runners.jobsubmission.JobInvocation$1.onSuccess(JobInvocation.java:115)
at org.apache.beam.runners.jobsubmission.JobInvocation$1.onSuccess(JobInvocation.java:101)
at org.apache.beam.vendor.guava.v26_0_jre.com.google.common.util.concurrent.Futures$CallbackListener.run(Futures.java:1058)
at java.util.concurrent.ThreadPoolExecutor.runWorker(ThreadPoolExecutor.java:1149)
at java.util.concurrent.ThreadPoolExecutor$Worker.run(ThreadPoolExecutor.java:624)
at java.lang.Thread.run(Thread.java:748)
May 10, 2022 1:33:06 AM org.apache.beam.runners.jobsubmission.InMemoryJobService getJobMetrics
INFO: Getting job metrics for go0testemitpardoaftergbk-jenkins-0510013232-cbabace8_cfaced68-38dc-4109-a7c8-d8e843c7dc0c
May 10, 2022 1:33:06 AM org.apache.beam.runners.jobsubmission.InMemoryJobService getJobMetrics
INFO: Finished getting job metrics for go0testemitpardoaftergbk-jenkins-0510013232-cbabace8_cfaced68-38dc-4109-a7c8-d8e843c7dc0c
2022/05/10 01:33:06 Job state: DONE
--- PASS: TestEmitParDoAfterGBK (44.06s)
PASS
ok github.com/apache/beam/sdks/v2/go/test/regression 507.110s
FAIL
May 10, 2022 1:33:07 AM org.apache.flink.runtime.resourcemanager.ResourceManager closeTaskManagerConnection
INFO: Closing TaskExecutor connection a8e0e6ae-4e4e-4fbd-99a0-422dc471e200 because: The TaskExecutor is shutting down.
$ TEST_EXIT_CODE=0
$ cd ../..
$ exit 1
May 10, 2022 1:33:07 AM org.apache.flink.runtime.taskexecutor.slot.TaskSlotTableImpl freeSlotInternal
INFO: Free slot TaskSlot(index:22, state:ALLOCATED, resource profile: ResourceProfile{taskHeapMemory=44.522gb (47804853381 bytes), taskOffHeapMemory=44.522gb (47804853381 bytes), managedMemory=402.990mb (422565398 bytes), networkMemory=89.043mb (93368854 bytes)}, allocationId: 4d5f5312e174c6f2347c7dc7e244cad5, jobId: 392b192d552c33391c732030a84b05c2).
$ exit 1
> Task :sdks:go:test:flinkValidatesRunner FAILED
FAILURE: Build failed with an exception.
* Where:
Build file '<https://ci-beam.apache.org/job/beam_PostCommit_Go_VR_Flink/ws/src/sdks/go/test/build.gradle'> line: 70
* What went wrong:
Execution failed for task ':sdks:go:test:flinkValidatesRunner'.
> Process 'command 'sh'' finished with non-zero exit value 1
* Try:
> Run with --stacktrace option to get the stack trace.
> Run with --info or --debug option to get more log output.
> Run with --scan to get full insights.
* Get more help at https://help.gradle.org
Deprecated Gradle features were used in this build, making it incompatible with Gradle 8.0.
You can use '--warning-mode all' to show the individual deprecation warnings and determine if they come from your own scripts or plugins.
See https://docs.gradle.org/7.4/userguide/command_line_interface.html#sec:command_line_warnings
Execution optimizations have been disabled for 2 invalid unit(s) of work during this build to ensure correctness.
Please consult deprecation warnings for more details.
BUILD FAILED in 44m 18s
168 actionable tasks: 114 executed, 47 from cache, 7 up-to-date
Publishing build scan...
https://gradle.com/s/6vo5hnfxeyhn6
Build step 'Invoke Gradle script' changed build result to FAILURE
Build step 'Invoke Gradle script' marked build as failure
---------------------------------------------------------------------
To unsubscribe, e-mail: builds-unsubscribe@beam.apache.org
For additional commands, e-mail: builds-help@beam.apache.org
Jenkins build is back to normal : beam_PostCommit_Go_VR_Flink #6138
Posted by Apache Jenkins Server <je...@builds.apache.org>.
See <https://ci-beam.apache.org/job/beam_PostCommit_Go_VR_Flink/6138/display/redirect>
---------------------------------------------------------------------
To unsubscribe, e-mail: builds-unsubscribe@beam.apache.org
For additional commands, e-mail: builds-help@beam.apache.org