You are viewing a plain text version of this content. The canonical link for it is here.
Posted to builds@beam.apache.org by Apache Jenkins Server <je...@builds.apache.org> on 2020/02/20 01:55:28 UTC

Build failed in Jenkins: beam_PostCommit_Python37 #1673

See <https://builds.apache.org/job/beam_PostCommit_Python37/1673/display/redirect?page=changes>

Changes:

[github] [BEAM-3545] Fix race condition w/plan metrics. (#10906)


------------------------------------------
[...truncated 2.79 MB...]
urllib3.connectionpool: DEBUG: https://www.googleapis.com:443 "GET /bigquery/v2/projects/apache-beam-testing/queries/0f7aa6bc-8de0-44ee-959c-8c3cfa2de7d8?maxResults=0&location=US HTTP/1.1" 200 None
urllib3.connectionpool: DEBUG: https://www.googleapis.com:443 "GET /bigquery/v2/projects/apache-beam-testing/datasets/_7357fab0f784d2a7327ddbe81cdd1f4ca7e429cd/tables/anon9f3402d587b160faedb59c1f22e12de06bb7ce9b/data HTTP/1.1" 200 None
apache_beam.io.gcp.tests.bigquery_matcher: INFO: Read from given query (SELECT fruit from `python_query_to_table_15821611516875.output_table`;), total rows 0
apache_beam.io.gcp.tests.bigquery_matcher: INFO: Generate checksum: da39a3ee5e6b4b0d3255bfef95601890afd80709
--------------------- >> end captured logging << ---------------------
<https://builds.apache.org/job/beam_PostCommit_Python37/ws/src/sdks/python/apache_beam/io/gcp/big_query_query_to_table_pipeline.py>:87: FutureWarning: _ReadFromBigQuery is experimental.
  kms_key=kms_key)
<https://builds.apache.org/job/beam_PostCommit_Python37/ws/src/sdks/python/apache_beam/io/gcp/bigquery.py>:1655: BeamDeprecationWarning: options is deprecated since First stable release. References to <pipeline>.options will not be supported
  temp_location = pcoll.pipeline.options.view_as(
<https://builds.apache.org/job/beam_PostCommit_Python37/ws/src/sdks/python/apache_beam/io/gcp/big_query_query_to_table_pipeline.py>:95: BeamDeprecationWarning: BigQuerySink is deprecated since 2.11.0. Use WriteToBigQuery instead.
  kms_key=kms_key))
<https://builds.apache.org/job/beam_PostCommit_Python37/ws/src/sdks/python/apache_beam/io/gcp/bigquery_io_read_pipeline.py>:84: FutureWarning: _ReadFromBigQuery is experimental.
  (options.view_as(GoogleCloudOptions).project, known_args.input_table))
<https://builds.apache.org/job/beam_PostCommit_Python37/ws/src/sdks/python/apache_beam/io/gcp/bigquery.py>:1655: BeamDeprecationWarning: options is deprecated since First stable release. References to <pipeline>.options will not be supported
  temp_location = pcoll.pipeline.options.view_as(
<https://builds.apache.org/job/beam_PostCommit_Python37/ws/src/sdks/python/apache_beam/io/gcp/bigquery_read_it_test.py>:275: FutureWarning: _ReadFromBigQuery is experimental.
  query=self.query, use_standard_sql=True, project=self.project))
<https://builds.apache.org/job/beam_PostCommit_Python37/ws/src/sdks/python/apache_beam/io/gcp/bigquery.py>:1655: BeamDeprecationWarning: options is deprecated since First stable release. References to <pipeline>.options will not be supported
  temp_location = pcoll.pipeline.options.view_as(
<https://builds.apache.org/job/beam_PostCommit_Python37/ws/src/sdks/python/apache_beam/io/gcp/bigquery_read_it_test.py>:162: FutureWarning: _ReadFromBigQuery is experimental.
  query=self.query, use_standard_sql=True, project=self.project))
<https://builds.apache.org/job/beam_PostCommit_Python37/ws/src/sdks/python/apache_beam/io/gcp/bigquery.py>:1655: BeamDeprecationWarning: options is deprecated since First stable release. References to <pipeline>.options will not be supported
  temp_location = pcoll.pipeline.options.view_as(
<https://builds.apache.org/job/beam_PostCommit_Python37/ws/src/sdks/python/apache_beam/io/gcp/bigquery.py>:1463: BeamDeprecationWarning: options is deprecated since First stable release. References to <pipeline>.options will not be supported
  self.table_reference.projectId = pcoll.pipeline.options.view_as(
<https://builds.apache.org/job/beam_PostCommit_Python37/ws/src/sdks/python/apache_beam/io/gcp/bigquery_file_loads.py>:818: BeamDeprecationWarning: options is deprecated since First stable release. References to <pipeline>.options will not be supported
  temp_location = p.options.view_as(GoogleCloudOptions).temp_location

----------------------------------------------------------------------
XML: nosetests-postCommitIT-direct-py37.xml
----------------------------------------------------------------------
XML: <https://builds.apache.org/job/beam_PostCommit_Python37/ws/src/sdks/python/nosetests.xml>
----------------------------------------------------------------------
Ran 19 tests in 53.663s

FAILED (SKIP=1, failures=1)

> Task :sdks:python:test-suites:direct:py37:postCommitIT FAILED

> Task :sdks:python:test-suites:dataflow:py37:postCommitIT
<https://builds.apache.org/job/beam_PostCommit_Python37/ws/src/sdks/python/apache_beam/io/gcp/bigquery.py>:1466: BeamDeprecationWarning: options is deprecated since First stable release. References to <pipeline>.options will not be supported
Worker logs: https://console.cloud.google.com/dataflow/jobsDetail/locations/us-central1/jobs/2020-02-19_17_07_37-8570156257266021500?project=apache-beam-testing
  experiments = p.options.view_as(DebugOptions).experiments or []
Worker logs: https://console.cloud.google.com/dataflow/jobsDetail/locations/us-central1/jobs/2020-02-19_17_22_20-12772859518641359739?project=apache-beam-testing
<https://builds.apache.org/job/beam_PostCommit_Python37/ws/src/sdks/python/apache_beam/io/gcp/bigquery.py>:1466: BeamDeprecationWarning: options is deprecated since First stable release. References to <pipeline>.options will not be supported
  experiments = p.options.view_as(DebugOptions).experiments or []
<https://builds.apache.org/job/beam_PostCommit_Python37/ws/src/sdks/python/apache_beam/io/gcp/bigquery_file_loads.py>:818: BeamDeprecationWarning: options is deprecated since First stable release. References to <pipeline>.options will not be supported
Worker logs: https://console.cloud.google.com/dataflow/jobsDetail/locations/us-central1/jobs/2020-02-19_17_31_39-5767240042220408903?project=apache-beam-testing
Worker logs: https://console.cloud.google.com/dataflow/jobsDetail/locations/us-central1/jobs/2020-02-19_17_39_14-6291264453927649835?project=apache-beam-testing
  temp_location = p.options.view_as(GoogleCloudOptions).temp_location
Worker logs: https://console.cloud.google.com/dataflow/jobsDetail/locations/us-central1/jobs/2020-02-19_17_45_47-14322369894278734657?project=apache-beam-testing
<https://builds.apache.org/job/beam_PostCommit_Python37/ws/src/sdks/python/apache_beam/io/gcp/bigquery.py>:1466: BeamDeprecationWarning: options is deprecated since First stable release. References to <pipeline>.options will not be supported
  experiments = p.options.view_as(DebugOptions).experiments or []
<https://builds.apache.org/job/beam_PostCommit_Python37/ws/src/sdks/python/apache_beam/io/gcp/bigquery_file_loads.py>:818: BeamDeprecationWarning: options is deprecated since First stable release. References to <pipeline>.options will not be supported
  temp_location = p.options.view_as(GoogleCloudOptions).temp_location
Worker logs: https://console.cloud.google.com/dataflow/jobsDetail/locations/us-central1/jobs/2020-02-19_17_07_31-13490617669846143025?project=apache-beam-testing
Worker logs: https://console.cloud.google.com/dataflow/jobsDetail/locations/us-central1/jobs/2020-02-19_17_24_30-18303823379585013629?project=apache-beam-testing
Worker logs: https://console.cloud.google.com/dataflow/jobsDetail/locations/us-central1/jobs/2020-02-19_17_31_24-7208052007653387364?project=apache-beam-testing
Worker logs: https://console.cloud.google.com/dataflow/jobsDetail/locations/us-central1/jobs/2020-02-19_17_38_05-2354102773125498986?project=apache-beam-testing
Worker logs: https://console.cloud.google.com/dataflow/jobsDetail/locations/us-central1/jobs/2020-02-19_17_45_59-7017781843850399431?project=apache-beam-testing
<https://builds.apache.org/job/beam_PostCommit_Python37/ws/src/sdks/python/apache_beam/runners/dataflow/dataflow_runner.py>:788: BeamDeprecationWarning: BigQuerySink is deprecated since 2.11.0. Use WriteToBigQuery instead.
  kms_key=transform.kms_key))
<https://builds.apache.org/job/beam_PostCommit_Python37/ws/src/sdks/python/apache_beam/io/gcp/bigquery_read_it_test.py>:162: FutureWarning: _ReadFromBigQuery is experimental.
  query=self.query, use_standard_sql=True, project=self.project))
<https://builds.apache.org/job/beam_PostCommit_Python37/ws/src/sdks/python/apache_beam/io/gcp/bigquery.py>:1655: BeamDeprecationWarning: options is deprecated since First stable release. References to <pipeline>.options will not be supported
  temp_location = pcoll.pipeline.options.view_as(
<https://builds.apache.org/job/beam_PostCommit_Python37/ws/src/sdks/python/apache_beam/io/gcp/bigquery.py>:1466: BeamDeprecationWarning: options is deprecated since First stable release. References to <pipeline>.options will not be supported
Worker logs: https://console.cloud.google.com/dataflow/jobsDetail/locations/us-central1/jobs/2020-02-19_17_07_31-3625396195695375022?project=apache-beam-testing
Worker logs: https://console.cloud.google.com/dataflow/jobsDetail/locations/us-central1/jobs/2020-02-19_17_19_50-1712839030979508576?project=apache-beam-testing
  experiments = p.options.view_as(DebugOptions).experiments or []
Worker logs: https://console.cloud.google.com/dataflow/jobsDetail/locations/us-central1/jobs/2020-02-19_17_27_08-3069736506226075485?project=apache-beam-testing
<https://builds.apache.org/job/beam_PostCommit_Python37/ws/src/sdks/python/apache_beam/io/gcp/big_query_query_to_table_pipeline.py>:87: FutureWarning: _ReadFromBigQuery is experimental.
  kms_key=kms_key)
Worker logs: https://console.cloud.google.com/dataflow/jobsDetail/locations/us-central1/jobs/2020-02-19_17_34_30-16038325525494892643?project=apache-beam-testing
<https://builds.apache.org/job/beam_PostCommit_Python37/ws/src/sdks/python/apache_beam/io/gcp/bigquery.py>:1655: BeamDeprecationWarning: options is deprecated since First stable release. References to <pipeline>.options will not be supported
  temp_location = pcoll.pipeline.options.view_as(
Worker logs: https://console.cloud.google.com/dataflow/jobsDetail/locations/us-central1/jobs/2020-02-19_17_41_36-15951942077780950006?project=apache-beam-testing
<https://builds.apache.org/job/beam_PostCommit_Python37/ws/src/sdks/python/apache_beam/runners/dataflow/dataflow_runner.py>:788: BeamDeprecationWarning: BigQuerySink is deprecated since 2.11.0. Use WriteToBigQuery instead.
  kms_key=transform.kms_key))
<https://builds.apache.org/job/beam_PostCommit_Python37/ws/src/sdks/python/apache_beam/io/gcp/big_query_query_to_table_pipeline.py>:87: FutureWarning: _ReadFromBigQuery is experimental.
  kms_key=kms_key)
Worker logs: https://console.cloud.google.com/dataflow/jobsDetail/locations/us-central1/jobs/2020-02-19_17_48_46-17103535746933454296?project=apache-beam-testing
<https://builds.apache.org/job/beam_PostCommit_Python37/ws/src/sdks/python/apache_beam/io/gcp/bigquery.py>:1655: BeamDeprecationWarning: options is deprecated since First stable release. References to <pipeline>.options will not be supported
  temp_location = pcoll.pipeline.options.view_as(
<https://builds.apache.org/job/beam_PostCommit_Python37/ws/src/sdks/python/apache_beam/runners/dataflow/dataflow_runner.py>:788: BeamDeprecationWarning: BigQuerySink is deprecated since 2.11.0. Use WriteToBigQuery instead.
  kms_key=transform.kms_key))
<https://builds.apache.org/job/beam_PostCommit_Python37/ws/src/sdks/python/apache_beam/io/gcp/big_query_query_to_table_pipeline.py>:95: BeamDeprecationWarning: BigQuerySink is deprecated since 2.11.0. Use WriteToBigQuery instead.
  kms_key=kms_key))
<https://builds.apache.org/job/beam_PostCommit_Python37/ws/src/sdks/python/apache_beam/io/gcp/big_query_query_to_table_pipeline.py>:87: FutureWarning: _ReadFromBigQuery is experimental.
  kms_key=kms_key)
<https://builds.apache.org/job/beam_PostCommit_Python37/ws/src/sdks/python/apache_beam/io/gcp/bigquery.py>:1655: BeamDeprecationWarning: options is deprecated since First stable release. References to <pipeline>.options will not be supported
  temp_location = pcoll.pipeline.options.view_as(
<https://builds.apache.org/job/beam_PostCommit_Python37/ws/src/sdks/python/apache_beam/runners/dataflow/dataflow_runner.py>:788: BeamDeprecationWarning: BigQuerySink is deprecated since 2.11.0. Use WriteToBigQuery instead.
  kms_key=transform.kms_key))
<https://builds.apache.org/job/beam_PostCommit_Python37/ws/src/sdks/python/apache_beam/io/gcp/big_query_query_to_table_pipeline.py>:95: BeamDeprecationWarning: BigQuerySink is deprecated since 2.11.0. Use WriteToBigQuery instead.
  kms_key=kms_key))
Worker logs: https://console.cloud.google.com/dataflow/jobsDetail/locations/us-central1/jobs/2020-02-19_17_07_28-8118427204334616854?project=apache-beam-testing
<https://builds.apache.org/job/beam_PostCommit_Python37/ws/src/sdks/python/apache_beam/io/gcp/bigquery_test.py>:823: BeamDeprecationWarning: options is deprecated since First stable release. References to <pipeline>.options will not be supported
  streaming = self.test_pipeline.options.view_as(StandardOptions).streaming
Worker logs: https://console.cloud.google.com/dataflow/jobsDetail/locations/us-central1/jobs/2020-02-19_17_26_07-17613781182948846946?project=apache-beam-testing
<https://builds.apache.org/job/beam_PostCommit_Python37/ws/src/sdks/python/apache_beam/io/gcp/bigquery.py>:1466: BeamDeprecationWarning: options is deprecated since First stable release. References to <pipeline>.options will not be supported
Worker logs: https://console.cloud.google.com/dataflow/jobsDetail/locations/us-central1/jobs/2020-02-19_17_33_47-15793023131471329532?project=apache-beam-testing
  experiments = p.options.view_as(DebugOptions).experiments or []
<https://builds.apache.org/job/beam_PostCommit_Python37/ws/src/sdks/python/apache_beam/io/gcp/bigquery.py>:1463: BeamDeprecationWarning: options is deprecated since First stable release. References to <pipeline>.options will not be supported
  self.table_reference.projectId = pcoll.pipeline.options.view_as(
Worker logs: https://console.cloud.google.com/dataflow/jobsDetail/locations/us-central1/jobs/2020-02-19_17_07_28-8534790448955655879?project=apache-beam-testing
<https://builds.apache.org/job/beam_PostCommit_Python37/ws/src/sdks/python/apache_beam/io/gcp/bigquery_read_it_test.py>:275: FutureWarning: _ReadFromBigQuery is experimental.
Worker logs: https://console.cloud.google.com/dataflow/jobsDetail/locations/us-central1/jobs/2020-02-19_17_15_12-14519572993049101561?project=apache-beam-testing
Worker logs: https://console.cloud.google.com/dataflow/jobsDetail/locations/us-central1/jobs/2020-02-19_17_23_17-5811192481123260227?project=apache-beam-testing
  query=self.query, use_standard_sql=True, project=self.project))
<https://builds.apache.org/job/beam_PostCommit_Python37/ws/src/sdks/python/apache_beam/io/gcp/bigquery.py>:1655: BeamDeprecationWarning: options is deprecated since First stable release. References to <pipeline>.options will not be supported
Worker logs: https://console.cloud.google.com/dataflow/jobsDetail/locations/us-central1/jobs/2020-02-19_17_30_32-12748970762833815421?project=apache-beam-testing
  temp_location = pcoll.pipeline.options.view_as(
Worker logs: https://console.cloud.google.com/dataflow/jobsDetail/locations/us-central1/jobs/2020-02-19_17_38_14-17918629912441042461?project=apache-beam-testing
Worker logs: https://console.cloud.google.com/dataflow/jobsDetail/locations/us-central1/jobs/2020-02-19_17_45_49-5632510368323838653?project=apache-beam-testing
Worker logs: https://console.cloud.google.com/dataflow/jobsDetail/locations/us-central1/jobs/2020-02-19_17_07_34-3705830970997041875?project=apache-beam-testing
Worker logs: https://console.cloud.google.com/dataflow/jobsDetail/locations/us-central1/jobs/2020-02-19_17_14_40-5122019255359559715?project=apache-beam-testing
<https://builds.apache.org/job/beam_PostCommit_Python37/ws/src/sdks/python/apache_beam/runners/dataflow/dataflow_runner.py>:788: BeamDeprecationWarning: BigQuerySink is deprecated since 2.11.0. Use WriteToBigQuery instead.
Worker logs: https://console.cloud.google.com/dataflow/jobsDetail/locations/us-central1/jobs/2020-02-19_17_23_02-1582466483783868636?project=apache-beam-testing
  kms_key=transform.kms_key))
Worker logs: https://console.cloud.google.com/dataflow/jobsDetail/locations/us-central1/jobs/2020-02-19_17_30_43-10770109146962389389?project=apache-beam-testing
<https://builds.apache.org/job/beam_PostCommit_Python37/ws/src/sdks/python/apache_beam/io/gcp/bigquery_io_read_pipeline.py>:84: FutureWarning: _ReadFromBigQuery is experimental.
  (options.view_as(GoogleCloudOptions).project, known_args.input_table))
Worker logs: https://console.cloud.google.com/dataflow/jobsDetail/locations/us-central1/jobs/2020-02-19_17_38_13-903178789861575239?project=apache-beam-testing
Worker logs: https://console.cloud.google.com/dataflow/jobsDetail/locations/us-central1/jobs/2020-02-19_17_45_17-13703715371771608305?project=apache-beam-testing
<https://builds.apache.org/job/beam_PostCommit_Python37/ws/src/sdks/python/apache_beam/io/gcp/bigquery.py>:1655: BeamDeprecationWarning: options is deprecated since First stable release. References to <pipeline>.options will not be supported
  temp_location = pcoll.pipeline.options.view_as(
<https://builds.apache.org/job/beam_PostCommit_Python37/ws/src/sdks/python/apache_beam/io/gcp/bigquery_io_read_pipeline.py>:84: FutureWarning: _ReadFromBigQuery is experimental.
  (options.view_as(GoogleCloudOptions).project, known_args.input_table))
<https://builds.apache.org/job/beam_PostCommit_Python37/ws/src/sdks/python/apache_beam/io/gcp/bigquery.py>:1655: BeamDeprecationWarning: options is deprecated since First stable release. References to <pipeline>.options will not be supported
  temp_location = pcoll.pipeline.options.view_as(
<https://builds.apache.org/job/beam_PostCommit_Python37/ws/src/sdks/python/apache_beam/io/fileio_test.py>:303: FutureWarning: MatchAll is experimental.
  | 'GetPath' >> beam.Map(lambda metadata: metadata.path))
<https://builds.apache.org/job/beam_PostCommit_Python37/ws/src/sdks/python/apache_beam/io/fileio_test.py>:316: FutureWarning: MatchAll is experimental.
  | 'Checksums' >> beam.Map(compute_hash))
<https://builds.apache.org/job/beam_PostCommit_Python37/ws/src/sdks/python/apache_beam/io/fileio_test.py>:316: FutureWarning: ReadMatches is experimental.
  | 'Checksums' >> beam.Map(compute_hash))
Worker logs: https://console.cloud.google.com/dataflow/jobsDetail/locations/us-central1/jobs/2020-02-19_17_07_31-7906311747201246617?project=apache-beam-testing
<https://builds.apache.org/job/beam_PostCommit_Python37/ws/src/sdks/python/apache_beam/io/avroio.py>:205: UserWarning: Due to a known issue in avro-python3 package, it is recommended to use fastavro with Beam Avro IO on Python 3 until BEAM-6522 is addressed.
  "Due to a known issue in avro-python3 package, it is "
<https://builds.apache.org/job/beam_PostCommit_Python37/ws/src/sdks/python/apache_beam/io/gcp/bigquery.py>:1466: BeamDeprecationWarning: options is deprecated since First stable release. References to <pipeline>.options will not be supported
Worker logs: https://console.cloud.google.com/dataflow/jobsDetail/locations/us-central1/jobs/2020-02-19_17_16_55-2253782802091279065?project=apache-beam-testing
Worker logs: https://console.cloud.google.com/dataflow/jobsDetail/locations/us-central1/jobs/2020-02-19_17_26_37-1906774012746584024?project=apache-beam-testing
  experiments = p.options.view_as(DebugOptions).experiments or []
Worker logs: https://console.cloud.google.com/dataflow/jobsDetail/locations/us-central1/jobs/2020-02-19_17_34_07-7674708479012894479?project=apache-beam-testing
<https://builds.apache.org/job/beam_PostCommit_Python37/ws/src/sdks/python/apache_beam/io/gcp/bigquery_file_loads.py>:818: BeamDeprecationWarning: options is deprecated since First stable release. References to <pipeline>.options will not be supported
Worker logs: https://console.cloud.google.com/dataflow/jobsDetail/locations/us-central1/jobs/2020-02-19_17_40_22-7135486692961956452?project=apache-beam-testing
  temp_location = p.options.view_as(GoogleCloudOptions).temp_location
Worker logs: https://console.cloud.google.com/dataflow/jobsDetail/locations/us-central1/jobs/2020-02-19_17_47_08-11832851589175523106?project=apache-beam-testing
<https://builds.apache.org/job/beam_PostCommit_Python37/ws/src/sdks/python/apache_beam/runners/dataflow/dataflow_runner.py>:788: BeamDeprecationWarning: BigQuerySink is deprecated since 2.11.0. Use WriteToBigQuery instead.
  kms_key=transform.kms_key))
<https://builds.apache.org/job/beam_PostCommit_Python37/ws/src/sdks/python/apache_beam/runners/dataflow/dataflow_runner.py>:788: BeamDeprecationWarning: BigQuerySink is deprecated since 2.11.0. Use WriteToBigQuery instead.
  kms_key=transform.kms_key))
<https://builds.apache.org/job/beam_PostCommit_Python37/ws/src/sdks/python/apache_beam/runners/dataflow/dataflow_runner.py>:788: BeamDeprecationWarning: BigQuerySink is deprecated since 2.11.0. Use WriteToBigQuery instead.
  kms_key=transform.kms_key))
Worker logs: https://console.cloud.google.com/dataflow/jobsDetail/locations/us-central1/jobs/2020-02-19_17_07_32-1799960839608162996?project=apache-beam-testing
Worker logs: https://console.cloud.google.com/dataflow/jobsDetail/locations/us-central1/jobs/2020-02-19_17_16_03-15292274749774529078?project=apache-beam-testing
Worker logs: https://console.cloud.google.com/dataflow/jobsDetail/locations/us-central1/jobs/2020-02-19_17_23_35-9063069623928321096?project=apache-beam-testing
Worker logs: https://console.cloud.google.com/dataflow/jobsDetail/locations/us-central1/jobs/2020-02-19_17_31_01-4438123193765786027?project=apache-beam-testing
Worker logs: https://console.cloud.google.com/dataflow/jobsDetail/locations/us-central1/jobs/2020-02-19_17_38_59-8691345479418307292?project=apache-beam-testing
Worker logs: https://console.cloud.google.com/dataflow/jobsDetail/locations/us-central1/jobs/2020-02-19_17_46_19-2916752988571414180?project=apache-beam-testing
test_datastore_wordcount_it (apache_beam.examples.cookbook.datastore_wordcount_it_test.DatastoreWordCountIT) ... SKIP: This test still needs to be fixed on Python 3TODO: BEAM-4543
test_bigquery_tornadoes_it (apache_beam.examples.cookbook.bigquery_tornadoes_it_test.BigqueryTornadoesIT) ... ok
test_autocomplete_it (apache_beam.examples.complete.autocomplete_test.AutocompleteTest) ... ok
test_streaming_wordcount_it (apache_beam.examples.streaming_wordcount_it_test.StreamingWordCountIT) ... ok
test_leader_board_it (apache_beam.examples.complete.game.leader_board_it_test.LeaderBoardIT) ... ok
test_game_stats_it (apache_beam.examples.complete.game.game_stats_it_test.GameStatsIT) ... ok
test_wordcount_fnapi_it (apache_beam.examples.wordcount_it_test.WordCountIT) ... ok
test_wordcount_it (apache_beam.examples.wordcount_it_test.WordCountIT) ... ok
test_hourly_team_score_it (apache_beam.examples.complete.game.hourly_team_score_it_test.HourlyTeamScoreIT) ... ok
test_user_score_it (apache_beam.examples.complete.game.user_score_it_test.UserScoreIT) ... ok
test_avro_it (apache_beam.examples.fastavro_it_test.FastavroIT) ... ok
test_multiple_destinations_transform (apache_beam.io.gcp.bigquery_test.BigQueryStreamingInsertTransformIntegrationTests) ... ok
test_value_provider_transform (apache_beam.io.gcp.bigquery_test.BigQueryStreamingInsertTransformIntegrationTests) ... ok
test_iobase_source (apache_beam.io.gcp.bigquery_read_it_test.ReadNewTypesTests) ... ok
test_native_source (apache_beam.io.gcp.bigquery_read_it_test.ReadNewTypesTests) ... ok
test_datastore_write_limit (apache_beam.io.gcp.datastore_write_it_test.DatastoreWriteIT) ... SKIP: This test still needs to be fixed on Python 3TODO: BEAM-4543
test_iobase_source (apache_beam.io.gcp.bigquery_read_it_test.ReadTests) ... ok
test_native_source (apache_beam.io.gcp.bigquery_read_it_test.ReadTests) ... ok
test_bigquery_read_1M_python (apache_beam.io.gcp.bigquery_io_read_it_test.BigqueryIOReadIT) ... ok
test_bigquery_read_custom_1M_python (apache_beam.io.gcp.bigquery_io_read_it_test.BigqueryIOReadIT) ... ok
test_copy (apache_beam.io.gcp.gcsio_integration_test.GcsIOIntegrationTest) ... ok
test_copy_batch (apache_beam.io.gcp.gcsio_integration_test.GcsIOIntegrationTest) ... ok
test_copy_batch_kms (apache_beam.io.gcp.gcsio_integration_test.GcsIOIntegrationTest) ... ok
test_copy_batch_rewrite_token (apache_beam.io.gcp.gcsio_integration_test.GcsIOIntegrationTest) ... ok
test_copy_kms (apache_beam.io.gcp.gcsio_integration_test.GcsIOIntegrationTest) ... ok
test_copy_rewrite_token (apache_beam.io.gcp.gcsio_integration_test.GcsIOIntegrationTest) ... ok
test_bqfl_streaming (apache_beam.io.gcp.bigquery_file_loads_test.BigQueryFileLoadsIT) ... SKIP: TestStream is not supported on TestDataflowRunner
test_multiple_destinations_transform (apache_beam.io.gcp.bigquery_file_loads_test.BigQueryFileLoadsIT) ... ok
test_one_job_fails_all_jobs_fail (apache_beam.io.gcp.bigquery_file_loads_test.BigQueryFileLoadsIT) ... ok
test_transform_on_gcs (apache_beam.io.fileio_test.MatchIntegrationTest) ... ok
test_parquetio_it (apache_beam.io.parquetio_it_test.TestParquetIT) ... ok
test_file_loads (apache_beam.io.gcp.bigquery_test.PubSubBigQueryIT) ... SKIP: https://issuetracker.google.com/issues/118375066
test_streaming_inserts (apache_beam.io.gcp.bigquery_test.PubSubBigQueryIT) ... ok
test_basic_execution (apache_beam.testing.test_stream_it_test.TestStreamIntegrationTests) ... SKIP: The "TestDataflowRunner", does not support the TestStream transform. Supported runners: ['DirectRunner', 'SwitchingDirectRunner']
Tests that the TestStream supports emitting to multiple PCollections. ... SKIP: The "TestDataflowRunner", does not support the TestStream transform. Supported runners: ['DirectRunner', 'SwitchingDirectRunner']
Tests that the TestStream can independently control output watermarks. ... SKIP: The "TestDataflowRunner", does not support the TestStream transform. Supported runners: ['DirectRunner', 'SwitchingDirectRunner']
test_job_python_from_python_it (apache_beam.transforms.external_test_it.ExternalTransformIT) ... ok
Runs streaming Dataflow job and verifies that user metrics are reported ... ok
test_streaming_data_only (apache_beam.io.gcp.pubsub_integration_test.PubSubIntegrationTest) ... ok
test_streaming_with_attributes (apache_beam.io.gcp.pubsub_integration_test.PubSubIntegrationTest) ... ok
test_metrics_fnapi_it (apache_beam.runners.dataflow.dataflow_exercise_metrics_pipeline_test.ExerciseMetricsPipelineTest) ... ok
test_metrics_it (apache_beam.runners.dataflow.dataflow_exercise_metrics_pipeline_test.ExerciseMetricsPipelineTest) ... ok
test_big_query_write (apache_beam.io.gcp.bigquery_write_it_test.BigQueryWriteIntegrationTests) ... ok
test_big_query_write_new_types (apache_beam.io.gcp.bigquery_write_it_test.BigQueryWriteIntegrationTests) ... ok
test_big_query_write_schema_autodetect (apache_beam.io.gcp.bigquery_write_it_test.BigQueryWriteIntegrationTests) ... SKIP: DataflowRunner does not support schema autodetection
test_big_query_write_without_schema (apache_beam.io.gcp.bigquery_write_it_test.BigQueryWriteIntegrationTests) ... ok
test_datastore_write_limit (apache_beam.io.gcp.datastore.v1new.datastore_write_it_test.DatastoreWriteIT) ... ok
test_big_query_legacy_sql (apache_beam.io.gcp.big_query_query_to_table_it_test.BigQueryQueryToTableIT) ... ok
test_big_query_new_types (apache_beam.io.gcp.big_query_query_to_table_it_test.BigQueryQueryToTableIT) ... ok
test_big_query_new_types_native (apache_beam.io.gcp.big_query_query_to_table_it_test.BigQueryQueryToTableIT) ... ok
test_big_query_standard_sql (apache_beam.io.gcp.big_query_query_to_table_it_test.BigQueryQueryToTableIT) ... ok
test_big_query_standard_sql_kms_key_native (apache_beam.io.gcp.big_query_query_to_table_it_test.BigQueryQueryToTableIT) ... ok

----------------------------------------------------------------------
XML: nosetests-postCommitIT-df-py37.xml
----------------------------------------------------------------------
XML: <https://builds.apache.org/job/beam_PostCommit_Python37/ws/src/sdks/python/nosetests.xml>
----------------------------------------------------------------------
Ran 52 tests in 2902.633s

OK (SKIP=8)

FAILURE: Build failed with an exception.

* Where:
Build file '<https://builds.apache.org/job/beam_PostCommit_Python37/ws/src/sdks/python/test-suites/direct/py37/build.gradle'> line: 51

* What went wrong:
Execution failed for task ':sdks:python:test-suites:direct:py37:postCommitIT'.
> Process 'command 'sh'' finished with non-zero exit value 1

* Try:
Run with --stacktrace option to get the stack trace. Run with --info or --debug option to get more log output. Run with --scan to get full insights.

* Get more help at https://help.gradle.org

Deprecated Gradle features were used in this build, making it incompatible with Gradle 6.0.
Use '--warning-mode all' to show the individual deprecation warnings.
See https://docs.gradle.org/5.2.1/userguide/command_line_interface.html#sec:command_line_warnings

BUILD FAILED in 49m 54s
85 actionable tasks: 64 executed, 21 from cache

Publishing build scan...
https://gradle.com/s/njroyhydfhedy

Build step 'Invoke Gradle script' changed build result to FAILURE
Build step 'Invoke Gradle script' marked build as failure

---------------------------------------------------------------------
To unsubscribe, e-mail: builds-unsubscribe@beam.apache.org
For additional commands, e-mail: builds-help@beam.apache.org


Jenkins build is back to normal : beam_PostCommit_Python37 #1676

Posted by Apache Jenkins Server <je...@builds.apache.org>.
See <https://builds.apache.org/job/beam_PostCommit_Python37/1676/display/redirect?page=changes>


---------------------------------------------------------------------
To unsubscribe, e-mail: builds-unsubscribe@beam.apache.org
For additional commands, e-mail: builds-help@beam.apache.org


Build failed in Jenkins: beam_PostCommit_Python37 #1675

Posted by Apache Jenkins Server <je...@builds.apache.org>.
See <https://builds.apache.org/job/beam_PostCommit_Python37/1675/display/redirect>

Changes:


------------------------------------------
[...truncated 2.78 MB...]
urllib3.connectionpool: DEBUG: https://www.googleapis.com:443 "GET /bigquery/v2/projects/apache-beam-testing/queries/82245741-6966-429f-937a-a1fa4576d0a1?maxResults=0&location=US HTTP/1.1" 200 None
urllib3.connectionpool: DEBUG: https://www.googleapis.com:443 "GET /bigquery/v2/projects/apache-beam-testing/datasets/_7357fab0f784d2a7327ddbe81cdd1f4ca7e429cd/tables/anonc3e5b077aa509cb2ed67de9a635353179db8b6bd/data HTTP/1.1" 200 None
apache_beam.io.gcp.tests.bigquery_matcher: INFO: Result of query is: []
apache_beam.io.gcp.bigquery_write_it_test: INFO: Deleting dataset python_write_to_table_15821789098417 in project apache-beam-testing
--------------------- >> end captured logging << ---------------------
<https://builds.apache.org/job/beam_PostCommit_Python37/ws/src/sdks/python/apache_beam/io/gcp/big_query_query_to_table_pipeline.py>:87: FutureWarning: _ReadFromBigQuery is experimental.
  kms_key=kms_key)
<https://builds.apache.org/job/beam_PostCommit_Python37/ws/src/sdks/python/apache_beam/io/gcp/bigquery.py>:1655: BeamDeprecationWarning: options is deprecated since First stable release. References to <pipeline>.options will not be supported
  temp_location = pcoll.pipeline.options.view_as(
<https://builds.apache.org/job/beam_PostCommit_Python37/ws/src/sdks/python/apache_beam/io/gcp/big_query_query_to_table_pipeline.py>:95: BeamDeprecationWarning: BigQuerySink is deprecated since 2.11.0. Use WriteToBigQuery instead.
  kms_key=kms_key))
<https://builds.apache.org/job/beam_PostCommit_Python37/ws/src/sdks/python/apache_beam/io/gcp/bigquery_io_read_pipeline.py>:84: FutureWarning: _ReadFromBigQuery is experimental.
  (options.view_as(GoogleCloudOptions).project, known_args.input_table))
<https://builds.apache.org/job/beam_PostCommit_Python37/ws/src/sdks/python/apache_beam/io/gcp/bigquery.py>:1655: BeamDeprecationWarning: options is deprecated since First stable release. References to <pipeline>.options will not be supported
  temp_location = pcoll.pipeline.options.view_as(
<https://builds.apache.org/job/beam_PostCommit_Python37/ws/src/sdks/python/apache_beam/io/gcp/bigquery_read_it_test.py>:275: FutureWarning: _ReadFromBigQuery is experimental.
  query=self.query, use_standard_sql=True, project=self.project))
<https://builds.apache.org/job/beam_PostCommit_Python37/ws/src/sdks/python/apache_beam/io/gcp/bigquery.py>:1655: BeamDeprecationWarning: options is deprecated since First stable release. References to <pipeline>.options will not be supported
  temp_location = pcoll.pipeline.options.view_as(
<https://builds.apache.org/job/beam_PostCommit_Python37/ws/src/sdks/python/apache_beam/io/gcp/bigquery_read_it_test.py>:162: FutureWarning: _ReadFromBigQuery is experimental.
  query=self.query, use_standard_sql=True, project=self.project))
<https://builds.apache.org/job/beam_PostCommit_Python37/ws/src/sdks/python/apache_beam/io/gcp/bigquery.py>:1655: BeamDeprecationWarning: options is deprecated since First stable release. References to <pipeline>.options will not be supported
  temp_location = pcoll.pipeline.options.view_as(
<https://builds.apache.org/job/beam_PostCommit_Python37/ws/src/sdks/python/apache_beam/io/gcp/bigquery.py>:1463: BeamDeprecationWarning: options is deprecated since First stable release. References to <pipeline>.options will not be supported
  self.table_reference.projectId = pcoll.pipeline.options.view_as(
<https://builds.apache.org/job/beam_PostCommit_Python37/ws/src/sdks/python/apache_beam/io/gcp/bigquery_file_loads.py>:818: BeamDeprecationWarning: options is deprecated since First stable release. References to <pipeline>.options will not be supported
  temp_location = p.options.view_as(GoogleCloudOptions).temp_location

----------------------------------------------------------------------
XML: nosetests-postCommitIT-direct-py37.xml
----------------------------------------------------------------------
XML: <https://builds.apache.org/job/beam_PostCommit_Python37/ws/src/sdks/python/nosetests.xml>
----------------------------------------------------------------------
Ran 19 tests in 54.534s

FAILED (SKIP=1, failures=1)

> Task :sdks:python:test-suites:direct:py37:postCommitIT FAILED

> Task :sdks:python:test-suites:dataflow:py37:postCommitIT
<https://builds.apache.org/job/beam_PostCommit_Python37/ws/src/sdks/python/apache_beam/io/gcp/bigquery.py>:1466: BeamDeprecationWarning: options is deprecated since First stable release. References to <pipeline>.options will not be supported
Worker logs: https://console.cloud.google.com/dataflow/jobsDetail/locations/us-central1/jobs/2020-02-19_22_04_28-7285299314916033332?project=apache-beam-testing
Worker logs: https://console.cloud.google.com/dataflow/jobsDetail/locations/us-central1/jobs/2020-02-19_22_19_01-13377932782547640291?project=apache-beam-testing
  experiments = p.options.view_as(DebugOptions).experiments or []
Worker logs: https://console.cloud.google.com/dataflow/jobsDetail/locations/us-central1/jobs/2020-02-19_22_28_07-5895867075406076686?project=apache-beam-testing
Worker logs: https://console.cloud.google.com/dataflow/jobsDetail/locations/us-central1/jobs/2020-02-19_22_36_14-2961912976006529864?project=apache-beam-testing
<https://builds.apache.org/job/beam_PostCommit_Python37/ws/src/sdks/python/apache_beam/io/gcp/bigquery.py>:1466: BeamDeprecationWarning: options is deprecated since First stable release. References to <pipeline>.options will not be supported
  experiments = p.options.view_as(DebugOptions).experiments or []
Worker logs: https://console.cloud.google.com/dataflow/jobsDetail/locations/us-central1/jobs/2020-02-19_22_44_15-15051240551018843820?project=apache-beam-testing
<https://builds.apache.org/job/beam_PostCommit_Python37/ws/src/sdks/python/apache_beam/io/gcp/bigquery_file_loads.py>:818: BeamDeprecationWarning: options is deprecated since First stable release. References to <pipeline>.options will not be supported
  temp_location = p.options.view_as(GoogleCloudOptions).temp_location
<https://builds.apache.org/job/beam_PostCommit_Python37/ws/src/sdks/python/apache_beam/io/gcp/bigquery.py>:1466: BeamDeprecationWarning: options is deprecated since First stable release. References to <pipeline>.options will not be supported
  experiments = p.options.view_as(DebugOptions).experiments or []
<https://builds.apache.org/job/beam_PostCommit_Python37/ws/src/sdks/python/apache_beam/io/gcp/bigquery_file_loads.py>:818: BeamDeprecationWarning: options is deprecated since First stable release. References to <pipeline>.options will not be supported
  temp_location = p.options.view_as(GoogleCloudOptions).temp_location
Worker logs: https://console.cloud.google.com/dataflow/jobsDetail/locations/us-central1/jobs/2020-02-19_22_04_24-7432872226950794641?project=apache-beam-testing
Worker logs: https://console.cloud.google.com/dataflow/jobsDetail/locations/us-central1/jobs/2020-02-19_22_23_43-10471776294014610721?project=apache-beam-testing
Worker logs: https://console.cloud.google.com/dataflow/jobsDetail/locations/us-central1/jobs/2020-02-19_22_31_04-16266167474634379255?project=apache-beam-testing
<https://builds.apache.org/job/beam_PostCommit_Python37/ws/src/sdks/python/apache_beam/runners/dataflow/dataflow_runner.py>:788: BeamDeprecationWarning: BigQuerySink is deprecated since 2.11.0. Use WriteToBigQuery instead.
  kms_key=transform.kms_key))
<https://builds.apache.org/job/beam_PostCommit_Python37/ws/src/sdks/python/apache_beam/io/gcp/bigquery_test.py>:823: BeamDeprecationWarning: options is deprecated since First stable release. References to <pipeline>.options will not be supported
  streaming = self.test_pipeline.options.view_as(StandardOptions).streaming
<https://builds.apache.org/job/beam_PostCommit_Python37/ws/src/sdks/python/apache_beam/io/gcp/bigquery.py>:1466: BeamDeprecationWarning: options is deprecated since First stable release. References to <pipeline>.options will not be supported
  experiments = p.options.view_as(DebugOptions).experiments or []
<https://builds.apache.org/job/beam_PostCommit_Python37/ws/src/sdks/python/apache_beam/io/gcp/bigquery.py>:1463: BeamDeprecationWarning: options is deprecated since First stable release. References to <pipeline>.options will not be supported
  self.table_reference.projectId = pcoll.pipeline.options.view_as(
Worker logs: https://console.cloud.google.com/dataflow/jobsDetail/locations/us-central1/jobs/2020-02-19_22_04_28-993984883974574018?project=apache-beam-testing
<https://builds.apache.org/job/beam_PostCommit_Python37/ws/src/sdks/python/apache_beam/io/gcp/bigquery.py>:1466: BeamDeprecationWarning: options is deprecated since First stable release. References to <pipeline>.options will not be supported
  experiments = p.options.view_as(DebugOptions).experiments or []
Worker logs: https://console.cloud.google.com/dataflow/jobsDetail/locations/us-central1/jobs/2020-02-19_22_16_47-7759886063241360089?project=apache-beam-testing
<https://builds.apache.org/job/beam_PostCommit_Python37/ws/src/sdks/python/apache_beam/io/gcp/big_query_query_to_table_pipeline.py>:87: FutureWarning: _ReadFromBigQuery is experimental.
  kms_key=kms_key)
Worker logs: https://console.cloud.google.com/dataflow/jobsDetail/locations/us-central1/jobs/2020-02-19_22_24_43-14884113019645511682?project=apache-beam-testing
Worker logs: https://console.cloud.google.com/dataflow/jobsDetail/locations/us-central1/jobs/2020-02-19_22_31_59-3019132851149478784?project=apache-beam-testing
Worker logs: https://console.cloud.google.com/dataflow/jobsDetail/locations/us-central1/jobs/2020-02-19_22_39_11-9675689678385673096?project=apache-beam-testing
Worker logs: https://console.cloud.google.com/dataflow/jobsDetail/locations/us-central1/jobs/2020-02-19_22_45_53-10818349902440659475?project=apache-beam-testing
<https://builds.apache.org/job/beam_PostCommit_Python37/ws/src/sdks/python/apache_beam/io/gcp/bigquery.py>:1655: BeamDeprecationWarning: options is deprecated since First stable release. References to <pipeline>.options will not be supported
  temp_location = pcoll.pipeline.options.view_as(
<https://builds.apache.org/job/beam_PostCommit_Python37/ws/src/sdks/python/apache_beam/runners/dataflow/dataflow_runner.py>:788: BeamDeprecationWarning: BigQuerySink is deprecated since 2.11.0. Use WriteToBigQuery instead.
  kms_key=transform.kms_key))
<https://builds.apache.org/job/beam_PostCommit_Python37/ws/src/sdks/python/apache_beam/io/gcp/big_query_query_to_table_pipeline.py>:87: FutureWarning: _ReadFromBigQuery is experimental.
  kms_key=kms_key)
<https://builds.apache.org/job/beam_PostCommit_Python37/ws/src/sdks/python/apache_beam/io/gcp/bigquery.py>:1655: BeamDeprecationWarning: options is deprecated since First stable release. References to <pipeline>.options will not be supported
  temp_location = pcoll.pipeline.options.view_as(
<https://builds.apache.org/job/beam_PostCommit_Python37/ws/src/sdks/python/apache_beam/runners/dataflow/dataflow_runner.py>:788: BeamDeprecationWarning: BigQuerySink is deprecated since 2.11.0. Use WriteToBigQuery instead.
  kms_key=transform.kms_key))
<https://builds.apache.org/job/beam_PostCommit_Python37/ws/src/sdks/python/apache_beam/io/gcp/big_query_query_to_table_pipeline.py>:95: BeamDeprecationWarning: BigQuerySink is deprecated since 2.11.0. Use WriteToBigQuery instead.
  kms_key=kms_key))
<https://builds.apache.org/job/beam_PostCommit_Python37/ws/src/sdks/python/apache_beam/io/gcp/big_query_query_to_table_pipeline.py>:87: FutureWarning: _ReadFromBigQuery is experimental.
  kms_key=kms_key)
<https://builds.apache.org/job/beam_PostCommit_Python37/ws/src/sdks/python/apache_beam/io/gcp/bigquery.py>:1655: BeamDeprecationWarning: options is deprecated since First stable release. References to <pipeline>.options will not be supported
  temp_location = pcoll.pipeline.options.view_as(
<https://builds.apache.org/job/beam_PostCommit_Python37/ws/src/sdks/python/apache_beam/runners/dataflow/dataflow_runner.py>:788: BeamDeprecationWarning: BigQuerySink is deprecated since 2.11.0. Use WriteToBigQuery instead.
  kms_key=transform.kms_key))
<https://builds.apache.org/job/beam_PostCommit_Python37/ws/src/sdks/python/apache_beam/io/gcp/big_query_query_to_table_pipeline.py>:95: BeamDeprecationWarning: BigQuerySink is deprecated since 2.11.0. Use WriteToBigQuery instead.
  kms_key=kms_key))
Worker logs: https://console.cloud.google.com/dataflow/jobsDetail/locations/us-central1/jobs/2020-02-19_22_04_25-620735167496781917?project=apache-beam-testing
Worker logs: https://console.cloud.google.com/dataflow/jobsDetail/locations/us-central1/jobs/2020-02-19_22_22_47-12969470859912256305?project=apache-beam-testing
Worker logs: https://console.cloud.google.com/dataflow/jobsDetail/locations/us-central1/jobs/2020-02-19_22_29_51-7536498319655481512?project=apache-beam-testing
<https://builds.apache.org/job/beam_PostCommit_Python37/ws/src/sdks/python/apache_beam/io/gcp/bigquery_read_it_test.py>:162: FutureWarning: _ReadFromBigQuery is experimental.
  query=self.query, use_standard_sql=True, project=self.project))
Worker logs: https://console.cloud.google.com/dataflow/jobsDetail/locations/us-central1/jobs/2020-02-19_22_36_50-11842808658669213976?project=apache-beam-testing
<https://builds.apache.org/job/beam_PostCommit_Python37/ws/src/sdks/python/apache_beam/io/gcp/bigquery.py>:1655: BeamDeprecationWarning: options is deprecated since First stable release. References to <pipeline>.options will not be supported
  temp_location = pcoll.pipeline.options.view_as(
Worker logs: https://console.cloud.google.com/dataflow/jobsDetail/locations/us-central1/jobs/2020-02-19_22_44_02-6980451844755637530?project=apache-beam-testing
Worker logs: https://console.cloud.google.com/dataflow/jobsDetail/locations/us-central1/jobs/2020-02-19_22_04_27-4084990104244130839?project=apache-beam-testing
Worker logs: https://console.cloud.google.com/dataflow/jobsDetail/locations/us-central1/jobs/2020-02-19_22_12_57-6871390912830356518?project=apache-beam-testing
<https://builds.apache.org/job/beam_PostCommit_Python37/ws/src/sdks/python/apache_beam/io/gcp/bigquery_read_it_test.py>:275: FutureWarning: _ReadFromBigQuery is experimental.
  query=self.query, use_standard_sql=True, project=self.project))
Worker logs: https://console.cloud.google.com/dataflow/jobsDetail/locations/us-central1/jobs/2020-02-19_22_21_03-1816541583825966252?project=apache-beam-testing
<https://builds.apache.org/job/beam_PostCommit_Python37/ws/src/sdks/python/apache_beam/io/gcp/bigquery.py>:1655: BeamDeprecationWarning: options is deprecated since First stable release. References to <pipeline>.options will not be supported
  temp_location = pcoll.pipeline.options.view_as(
Worker logs: https://console.cloud.google.com/dataflow/jobsDetail/locations/us-central1/jobs/2020-02-19_22_28_27-11127793518042384844?project=apache-beam-testing
<https://builds.apache.org/job/beam_PostCommit_Python37/ws/src/sdks/python/apache_beam/io/fileio_test.py>:303: FutureWarning: MatchAll is experimental.
  | 'GetPath' >> beam.Map(lambda metadata: metadata.path))
<https://builds.apache.org/job/beam_PostCommit_Python37/ws/src/sdks/python/apache_beam/io/fileio_test.py>:316: FutureWarning: MatchAll is experimental.
  | 'Checksums' >> beam.Map(compute_hash))
Worker logs: https://console.cloud.google.com/dataflow/jobsDetail/locations/us-central1/jobs/2020-02-19_22_35_32-9460345215950878174?project=apache-beam-testing
Worker logs: https://console.cloud.google.com/dataflow/jobsDetail/locations/us-central1/jobs/2020-02-19_22_42_47-11771567311575587621?project=apache-beam-testing
<https://builds.apache.org/job/beam_PostCommit_Python37/ws/src/sdks/python/apache_beam/io/fileio_test.py>:316: FutureWarning: ReadMatches is experimental.
  | 'Checksums' >> beam.Map(compute_hash))
Worker logs: https://console.cloud.google.com/dataflow/jobsDetail/locations/us-central1/jobs/2020-02-19_22_04_23-15216774876748155104?project=apache-beam-testing
Worker logs: https://console.cloud.google.com/dataflow/jobsDetail/locations/us-central1/jobs/2020-02-19_22_11_44-14127050734077732418?project=apache-beam-testing
Worker logs: https://console.cloud.google.com/dataflow/jobsDetail/locations/us-central1/jobs/2020-02-19_22_19_29-12150393628201390490?project=apache-beam-testing
Worker logs: https://console.cloud.google.com/dataflow/jobsDetail/locations/us-central1/jobs/2020-02-19_22_27_16-12845554130203582258?project=apache-beam-testing
Worker logs: https://console.cloud.google.com/dataflow/jobsDetail/locations/us-central1/jobs/2020-02-19_22_35_31-11802520867632084537?project=apache-beam-testing
Worker logs: https://console.cloud.google.com/dataflow/jobsDetail/locations/us-central1/jobs/2020-02-19_22_42_33-14276480681759239525?project=apache-beam-testing
<https://builds.apache.org/job/beam_PostCommit_Python37/ws/src/sdks/python/apache_beam/runners/dataflow/dataflow_runner.py>:788: BeamDeprecationWarning: BigQuerySink is deprecated since 2.11.0. Use WriteToBigQuery instead.
  kms_key=transform.kms_key))
<https://builds.apache.org/job/beam_PostCommit_Python37/ws/src/sdks/python/apache_beam/io/gcp/bigquery_io_read_pipeline.py>:84: FutureWarning: _ReadFromBigQuery is experimental.
  (options.view_as(GoogleCloudOptions).project, known_args.input_table))
<https://builds.apache.org/job/beam_PostCommit_Python37/ws/src/sdks/python/apache_beam/io/gcp/bigquery.py>:1655: BeamDeprecationWarning: options is deprecated since First stable release. References to <pipeline>.options will not be supported
  temp_location = pcoll.pipeline.options.view_as(
<https://builds.apache.org/job/beam_PostCommit_Python37/ws/src/sdks/python/apache_beam/io/gcp/bigquery_io_read_pipeline.py>:84: FutureWarning: _ReadFromBigQuery is experimental.
  (options.view_as(GoogleCloudOptions).project, known_args.input_table))
<https://builds.apache.org/job/beam_PostCommit_Python37/ws/src/sdks/python/apache_beam/io/gcp/bigquery.py>:1655: BeamDeprecationWarning: options is deprecated since First stable release. References to <pipeline>.options will not be supported
  temp_location = pcoll.pipeline.options.view_as(
Worker logs: https://console.cloud.google.com/dataflow/jobsDetail/locations/us-central1/jobs/2020-02-19_22_04_26-11045646242945968390?project=apache-beam-testing
<https://builds.apache.org/job/beam_PostCommit_Python37/ws/src/sdks/python/apache_beam/io/avroio.py>:205: UserWarning: Due to a known issue in avro-python3 package, it is recommended to use fastavro with Beam Avro IO on Python 3 until BEAM-6522 is addressed.
  "Due to a known issue in avro-python3 package, it is "
Worker logs: https://console.cloud.google.com/dataflow/jobsDetail/locations/us-central1/jobs/2020-02-19_22_13_25-7982512152476478105?project=apache-beam-testing
Worker logs: https://console.cloud.google.com/dataflow/jobsDetail/locations/us-central1/jobs/2020-02-19_22_23_52-15617183234664293563?project=apache-beam-testing
<https://builds.apache.org/job/beam_PostCommit_Python37/ws/src/sdks/python/apache_beam/io/gcp/bigquery.py>:1466: BeamDeprecationWarning: options is deprecated since First stable release. References to <pipeline>.options will not be supported
  experiments = p.options.view_as(DebugOptions).experiments or []
Worker logs: https://console.cloud.google.com/dataflow/jobsDetail/locations/us-central1/jobs/2020-02-19_22_32_06-10264515921695814806?project=apache-beam-testing
<https://builds.apache.org/job/beam_PostCommit_Python37/ws/src/sdks/python/apache_beam/io/gcp/bigquery_file_loads.py>:818: BeamDeprecationWarning: options is deprecated since First stable release. References to <pipeline>.options will not be supported
  temp_location = p.options.view_as(GoogleCloudOptions).temp_location
Worker logs: https://console.cloud.google.com/dataflow/jobsDetail/locations/us-central1/jobs/2020-02-19_22_39_01-3832718900173051767?project=apache-beam-testing
<https://builds.apache.org/job/beam_PostCommit_Python37/ws/src/sdks/python/apache_beam/runners/dataflow/dataflow_runner.py>:788: BeamDeprecationWarning: BigQuerySink is deprecated since 2.11.0. Use WriteToBigQuery instead.
  kms_key=transform.kms_key))
Worker logs: https://console.cloud.google.com/dataflow/jobsDetail/locations/us-central1/jobs/2020-02-19_22_45_43-11367964160143985468?project=apache-beam-testing
Worker logs: https://console.cloud.google.com/dataflow/jobsDetail/locations/us-central1/jobs/2020-02-19_22_04_26-9768822674801890780?project=apache-beam-testing
Worker logs: https://console.cloud.google.com/dataflow/jobsDetail/locations/us-central1/jobs/2020-02-19_22_13_45-10141553736397604956?project=apache-beam-testing
<https://builds.apache.org/job/beam_PostCommit_Python37/ws/src/sdks/python/apache_beam/runners/dataflow/dataflow_runner.py>:788: BeamDeprecationWarning: BigQuerySink is deprecated since 2.11.0. Use WriteToBigQuery instead.
  kms_key=transform.kms_key))
Worker logs: https://console.cloud.google.com/dataflow/jobsDetail/locations/us-central1/jobs/2020-02-19_22_20_19-2477919196608591066?project=apache-beam-testing
<https://builds.apache.org/job/beam_PostCommit_Python37/ws/src/sdks/python/apache_beam/runners/dataflow/dataflow_runner.py>:788: BeamDeprecationWarning: BigQuerySink is deprecated since 2.11.0. Use WriteToBigQuery instead.
  kms_key=transform.kms_key))
Worker logs: https://console.cloud.google.com/dataflow/jobsDetail/locations/us-central1/jobs/2020-02-19_22_27_44-8118316864820200581?project=apache-beam-testing
Worker logs: https://console.cloud.google.com/dataflow/jobsDetail/locations/us-central1/jobs/2020-02-19_22_34_58-2239809359655338440?project=apache-beam-testing
Worker logs: https://console.cloud.google.com/dataflow/jobsDetail/locations/us-central1/jobs/2020-02-19_22_41_27-12510614301774008755?project=apache-beam-testing
test_datastore_wordcount_it (apache_beam.examples.cookbook.datastore_wordcount_it_test.DatastoreWordCountIT) ... SKIP: This test still needs to be fixed on Python 3TODO: BEAM-4543
test_bigquery_tornadoes_it (apache_beam.examples.cookbook.bigquery_tornadoes_it_test.BigqueryTornadoesIT) ... ok
test_autocomplete_it (apache_beam.examples.complete.autocomplete_test.AutocompleteTest) ... ok
test_streaming_wordcount_it (apache_beam.examples.streaming_wordcount_it_test.StreamingWordCountIT) ... ok
test_leader_board_it (apache_beam.examples.complete.game.leader_board_it_test.LeaderBoardIT) ... ok
test_game_stats_it (apache_beam.examples.complete.game.game_stats_it_test.GameStatsIT) ... ok
test_wordcount_fnapi_it (apache_beam.examples.wordcount_it_test.WordCountIT) ... ok
test_wordcount_it (apache_beam.examples.wordcount_it_test.WordCountIT) ... ok
test_user_score_it (apache_beam.examples.complete.game.user_score_it_test.UserScoreIT) ... ok
test_hourly_team_score_it (apache_beam.examples.complete.game.hourly_team_score_it_test.HourlyTeamScoreIT) ... ok
test_avro_it (apache_beam.examples.fastavro_it_test.FastavroIT) ... ok
test_multiple_destinations_transform (apache_beam.io.gcp.bigquery_test.BigQueryStreamingInsertTransformIntegrationTests) ... ok
test_value_provider_transform (apache_beam.io.gcp.bigquery_test.BigQueryStreamingInsertTransformIntegrationTests) ... ok
test_bigquery_read_1M_python (apache_beam.io.gcp.bigquery_io_read_it_test.BigqueryIOReadIT) ... ok
test_bigquery_read_custom_1M_python (apache_beam.io.gcp.bigquery_io_read_it_test.BigqueryIOReadIT) ... ok
test_datastore_write_limit (apache_beam.io.gcp.datastore_write_it_test.DatastoreWriteIT) ... SKIP: This test still needs to be fixed on Python 3TODO: BEAM-4543
test_copy (apache_beam.io.gcp.gcsio_integration_test.GcsIOIntegrationTest) ... ok
test_copy_batch (apache_beam.io.gcp.gcsio_integration_test.GcsIOIntegrationTest) ... ok
test_copy_batch_kms (apache_beam.io.gcp.gcsio_integration_test.GcsIOIntegrationTest) ... ok
test_copy_batch_rewrite_token (apache_beam.io.gcp.gcsio_integration_test.GcsIOIntegrationTest) ... ok
test_copy_kms (apache_beam.io.gcp.gcsio_integration_test.GcsIOIntegrationTest) ... ok
test_copy_rewrite_token (apache_beam.io.gcp.gcsio_integration_test.GcsIOIntegrationTest) ... ok
test_iobase_source (apache_beam.io.gcp.bigquery_read_it_test.ReadNewTypesTests) ... ok
test_native_source (apache_beam.io.gcp.bigquery_read_it_test.ReadNewTypesTests) ... ok
test_bqfl_streaming (apache_beam.io.gcp.bigquery_file_loads_test.BigQueryFileLoadsIT) ... SKIP: TestStream is not supported on TestDataflowRunner
test_multiple_destinations_transform (apache_beam.io.gcp.bigquery_file_loads_test.BigQueryFileLoadsIT) ... ok
test_one_job_fails_all_jobs_fail (apache_beam.io.gcp.bigquery_file_loads_test.BigQueryFileLoadsIT) ... ok
test_iobase_source (apache_beam.io.gcp.bigquery_read_it_test.ReadTests) ... ok
test_native_source (apache_beam.io.gcp.bigquery_read_it_test.ReadTests) ... ok
test_transform_on_gcs (apache_beam.io.fileio_test.MatchIntegrationTest) ... ok
test_parquetio_it (apache_beam.io.parquetio_it_test.TestParquetIT) ... ok
test_datastore_write_limit (apache_beam.io.gcp.datastore.v1new.datastore_write_it_test.DatastoreWriteIT) ... ok
test_basic_execution (apache_beam.testing.test_stream_it_test.TestStreamIntegrationTests) ... SKIP: The "TestDataflowRunner", does not support the TestStream transform. Supported runners: ['DirectRunner', 'SwitchingDirectRunner']
Tests that the TestStream supports emitting to multiple PCollections. ... SKIP: The "TestDataflowRunner", does not support the TestStream transform. Supported runners: ['DirectRunner', 'SwitchingDirectRunner']
Tests that the TestStream can independently control output watermarks. ... SKIP: The "TestDataflowRunner", does not support the TestStream transform. Supported runners: ['DirectRunner', 'SwitchingDirectRunner']
test_file_loads (apache_beam.io.gcp.bigquery_test.PubSubBigQueryIT) ... SKIP: https://issuetracker.google.com/issues/118375066
test_streaming_inserts (apache_beam.io.gcp.bigquery_test.PubSubBigQueryIT) ... ok
test_streaming_data_only (apache_beam.io.gcp.pubsub_integration_test.PubSubIntegrationTest) ... ok
test_streaming_with_attributes (apache_beam.io.gcp.pubsub_integration_test.PubSubIntegrationTest) ... ok
Runs streaming Dataflow job and verifies that user metrics are reported ... ok
test_job_python_from_python_it (apache_beam.transforms.external_test_it.ExternalTransformIT) ... ok
test_metrics_fnapi_it (apache_beam.runners.dataflow.dataflow_exercise_metrics_pipeline_test.ExerciseMetricsPipelineTest) ... ok
test_metrics_it (apache_beam.runners.dataflow.dataflow_exercise_metrics_pipeline_test.ExerciseMetricsPipelineTest) ... ok
test_big_query_write (apache_beam.io.gcp.bigquery_write_it_test.BigQueryWriteIntegrationTests) ... ok
test_big_query_write_new_types (apache_beam.io.gcp.bigquery_write_it_test.BigQueryWriteIntegrationTests) ... ok
test_big_query_write_schema_autodetect (apache_beam.io.gcp.bigquery_write_it_test.BigQueryWriteIntegrationTests) ... SKIP: DataflowRunner does not support schema autodetection
test_big_query_write_without_schema (apache_beam.io.gcp.bigquery_write_it_test.BigQueryWriteIntegrationTests) ... ok
test_big_query_legacy_sql (apache_beam.io.gcp.big_query_query_to_table_it_test.BigQueryQueryToTableIT) ... ok
test_big_query_new_types (apache_beam.io.gcp.big_query_query_to_table_it_test.BigQueryQueryToTableIT) ... ok
test_big_query_new_types_native (apache_beam.io.gcp.big_query_query_to_table_it_test.BigQueryQueryToTableIT) ... ok
test_big_query_standard_sql (apache_beam.io.gcp.big_query_query_to_table_it_test.BigQueryQueryToTableIT) ... ok
test_big_query_standard_sql_kms_key_native (apache_beam.io.gcp.big_query_query_to_table_it_test.BigQueryQueryToTableIT) ... ok

----------------------------------------------------------------------
XML: nosetests-postCommitIT-df-py37.xml
----------------------------------------------------------------------
XML: <https://builds.apache.org/job/beam_PostCommit_Python37/ws/src/sdks/python/nosetests.xml>
----------------------------------------------------------------------
Ran 52 tests in 2915.415s

OK (SKIP=8)

FAILURE: Build failed with an exception.

* Where:
Build file '<https://builds.apache.org/job/beam_PostCommit_Python37/ws/src/sdks/python/test-suites/direct/py37/build.gradle'> line: 51

* What went wrong:
Execution failed for task ':sdks:python:test-suites:direct:py37:postCommitIT'.
> Process 'command 'sh'' finished with non-zero exit value 1

* Try:
Run with --stacktrace option to get the stack trace. Run with --info or --debug option to get more log output. Run with --scan to get full insights.

* Get more help at https://help.gradle.org

Deprecated Gradle features were used in this build, making it incompatible with Gradle 6.0.
Use '--warning-mode all' to show the individual deprecation warnings.
See https://docs.gradle.org/5.2.1/userguide/command_line_interface.html#sec:command_line_warnings

BUILD FAILED in 49m 52s
85 actionable tasks: 64 executed, 21 from cache

Publishing build scan...
https://gradle.com/s/d3h4zlizswd24

Build step 'Invoke Gradle script' changed build result to FAILURE
Build step 'Invoke Gradle script' marked build as failure

---------------------------------------------------------------------
To unsubscribe, e-mail: builds-unsubscribe@beam.apache.org
For additional commands, e-mail: builds-help@beam.apache.org


Build failed in Jenkins: beam_PostCommit_Python37 #1674

Posted by Apache Jenkins Server <je...@builds.apache.org>.
See <https://builds.apache.org/job/beam_PostCommit_Python37/1674/display/redirect?page=changes>

Changes:

[heejong] [BEAM-9338] add postcommit XVR spark badges


------------------------------------------
[...truncated 2.78 MB...]
	at java.lang.Thread.run(Thread.java:748)
<https://builds.apache.org/job/beam_PostCommit_Python37/ws/src/sdks/python/apache_beam/io/gcp/bigquery_read_it_test.py>:162: FutureWarning: _ReadFromBigQuery is experimental.
  query=self.query, use_standard_sql=True, project=self.project))
<https://builds.apache.org/job/beam_PostCommit_Python37/ws/src/sdks/python/apache_beam/io/gcp/bigquery.py>:1655: BeamDeprecationWarning: options is deprecated since First stable release. References to <pipeline>.options will not be supported
  temp_location = pcoll.pipeline.options.view_as(
Exception in thread read_grpc_client_inputs:
Traceback (most recent call last):
  File "/usr/lib/python3.7/threading.py", line 917, in _bootstrap_inner
    self.run()
  File "/usr/lib/python3.7/threading.py", line 865, in run
    self._target(*self._args, **self._kwargs)
  File "<https://builds.apache.org/job/beam_PostCommit_Python37/ws/src/sdks/python/apache_beam/runners/worker/data_plane.py",> line 434, in <lambda>
    target=lambda: self._read_inputs(elements_iterator),
  File "<https://builds.apache.org/job/beam_PostCommit_Python37/ws/src/sdks/python/apache_beam/runners/worker/data_plane.py",> line 419, in _read_inputs
    for elements in elements_iterator:
  File "<https://builds.apache.org/job/beam_PostCommit_Python37/ws/src/build/gradleenv/2022703441/lib/python3.7/site-packages/grpc/_channel.py",> line 416, in __next__
    return self._next()
  File "<https://builds.apache.org/job/beam_PostCommit_Python37/ws/src/build/gradleenv/2022703441/lib/python3.7/site-packages/grpc/_channel.py",> line 706, in _next
    raise self
grpc._channel._MultiThreadedRendezvous: <_MultiThreadedRendezvous of RPC that terminated with:
	status = StatusCode.CANCELLED
	details = "Multiplexer hanging up"
	debug_error_string = "{"created":"@1582167583.180654958","description":"Error received from peer ipv4:127.0.0.1:33201","file":"src/core/lib/surface/call.cc","file_line":1056,"grpc_message":"Multiplexer hanging up","grpc_status":1}"
>

ok
test_native_source (apache_beam.io.gcp.bigquery_read_it_test.ReadTests) ... SKIP: This test doesn't work on these runners: ['PortableRunner', 'FlinkRunner']

----------------------------------------------------------------------
XML: nosetests-postCommitIT-flink-py37.xml
----------------------------------------------------------------------
XML: <https://builds.apache.org/job/beam_PostCommit_Python37/ws/src/sdks/python/nosetests.xml>
----------------------------------------------------------------------
Ran 4 tests in 49.073s

OK (SKIP=2)

> Task :sdks:python:test-suites:portable:py37:postCommitPy37

> Task :sdks:python:test-suites:dataflow:py37:postCommitIT
Worker logs: https://console.cloud.google.com/dataflow/jobsDetail/locations/us-central1/jobs/2020-02-19_18_55_54-6213538262343033736?project=apache-beam-testing
<https://builds.apache.org/job/beam_PostCommit_Python37/ws/src/sdks/python/apache_beam/io/gcp/bigquery.py>:1466: BeamDeprecationWarning: options is deprecated since First stable release. References to <pipeline>.options will not be supported
  experiments = p.options.view_as(DebugOptions).experiments or []
Worker logs: https://console.cloud.google.com/dataflow/jobsDetail/locations/us-central1/jobs/2020-02-19_19_10_23-11254357292302087769?project=apache-beam-testing
<https://builds.apache.org/job/beam_PostCommit_Python37/ws/src/sdks/python/apache_beam/io/gcp/bigquery.py>:1466: BeamDeprecationWarning: options is deprecated since First stable release. References to <pipeline>.options will not be supported
  experiments = p.options.view_as(DebugOptions).experiments or []
Worker logs: https://console.cloud.google.com/dataflow/jobsDetail/locations/us-central1/jobs/2020-02-19_19_19_56-6985595070720515797?project=apache-beam-testing
Worker logs: https://console.cloud.google.com/dataflow/jobsDetail/locations/us-central1/jobs/2020-02-19_19_29_23-8507819766612317628?project=apache-beam-testing
<https://builds.apache.org/job/beam_PostCommit_Python37/ws/src/sdks/python/apache_beam/io/gcp/bigquery_file_loads.py>:818: BeamDeprecationWarning: options is deprecated since First stable release. References to <pipeline>.options will not be supported
  temp_location = p.options.view_as(GoogleCloudOptions).temp_location
Worker logs: https://console.cloud.google.com/dataflow/jobsDetail/locations/us-central1/jobs/2020-02-19_19_36_50-13346270858334296132?project=apache-beam-testing
<https://builds.apache.org/job/beam_PostCommit_Python37/ws/src/sdks/python/apache_beam/io/gcp/bigquery.py>:1466: BeamDeprecationWarning: options is deprecated since First stable release. References to <pipeline>.options will not be supported
  experiments = p.options.view_as(DebugOptions).experiments or []
<https://builds.apache.org/job/beam_PostCommit_Python37/ws/src/sdks/python/apache_beam/io/gcp/bigquery_file_loads.py>:818: BeamDeprecationWarning: options is deprecated since First stable release. References to <pipeline>.options will not be supported
  temp_location = p.options.view_as(GoogleCloudOptions).temp_location
Worker logs: https://console.cloud.google.com/dataflow/jobsDetail/locations/us-central1/jobs/2020-02-19_18_55_50-2843720077732676518?project=apache-beam-testing
<https://builds.apache.org/job/beam_PostCommit_Python37/ws/src/sdks/python/apache_beam/runners/dataflow/dataflow_runner.py>:788: BeamDeprecationWarning: BigQuerySink is deprecated since 2.11.0. Use WriteToBigQuery instead.
Worker logs: https://console.cloud.google.com/dataflow/jobsDetail/locations/us-central1/jobs/2020-02-19_19_17_18-7862691879039391531?project=apache-beam-testing
Worker logs: https://console.cloud.google.com/dataflow/jobsDetail/locations/us-central1/jobs/2020-02-19_19_24_49-478035551175702207?project=apache-beam-testing
  kms_key=transform.kms_key))
Worker logs: https://console.cloud.google.com/dataflow/jobsDetail/locations/us-central1/jobs/2020-02-19_19_32_32-6865606868831825623?project=apache-beam-testing
<https://builds.apache.org/job/beam_PostCommit_Python37/ws/src/sdks/python/apache_beam/io/gcp/bigquery.py>:1466: BeamDeprecationWarning: options is deprecated since First stable release. References to <pipeline>.options will not be supported
Worker logs: https://console.cloud.google.com/dataflow/jobsDetail/locations/us-central1/jobs/2020-02-19_19_39_15-509068768533137500?project=apache-beam-testing
  experiments = p.options.view_as(DebugOptions).experiments or []
<https://builds.apache.org/job/beam_PostCommit_Python37/ws/src/sdks/python/apache_beam/io/gcp/bigquery_file_loads.py>:818: BeamDeprecationWarning: options is deprecated since First stable release. References to <pipeline>.options will not be supported
  temp_location = p.options.view_as(GoogleCloudOptions).temp_location
<https://builds.apache.org/job/beam_PostCommit_Python37/ws/src/sdks/python/apache_beam/runners/dataflow/dataflow_runner.py>:788: BeamDeprecationWarning: BigQuerySink is deprecated since 2.11.0. Use WriteToBigQuery instead.
  kms_key=transform.kms_key))
<https://builds.apache.org/job/beam_PostCommit_Python37/ws/src/sdks/python/apache_beam/runners/dataflow/dataflow_runner.py>:788: BeamDeprecationWarning: BigQuerySink is deprecated since 2.11.0. Use WriteToBigQuery instead.
  kms_key=transform.kms_key))
<https://builds.apache.org/job/beam_PostCommit_Python37/ws/src/sdks/python/apache_beam/runners/dataflow/dataflow_runner.py>:788: BeamDeprecationWarning: BigQuerySink is deprecated since 2.11.0. Use WriteToBigQuery instead.
  kms_key=transform.kms_key))
Worker logs: https://console.cloud.google.com/dataflow/jobsDetail/locations/us-central1/jobs/2020-02-19_18_55_52-14887793104977768290?project=apache-beam-testing
Worker logs: https://console.cloud.google.com/dataflow/jobsDetail/locations/us-central1/jobs/2020-02-19_19_08_24-13594616432732986680?project=apache-beam-testing
<https://builds.apache.org/job/beam_PostCommit_Python37/ws/src/sdks/python/apache_beam/io/gcp/bigquery.py>:1466: BeamDeprecationWarning: options is deprecated since First stable release. References to <pipeline>.options will not be supported
  experiments = p.options.view_as(DebugOptions).experiments or []
Worker logs: https://console.cloud.google.com/dataflow/jobsDetail/locations/us-central1/jobs/2020-02-19_19_15_30-15261524258237999364?project=apache-beam-testing
<https://builds.apache.org/job/beam_PostCommit_Python37/ws/src/sdks/python/apache_beam/io/gcp/big_query_query_to_table_pipeline.py>:87: FutureWarning: _ReadFromBigQuery is experimental.
  kms_key=kms_key)
Worker logs: https://console.cloud.google.com/dataflow/jobsDetail/locations/us-central1/jobs/2020-02-19_19_23_37-2200209814483945874?project=apache-beam-testing
<https://builds.apache.org/job/beam_PostCommit_Python37/ws/src/sdks/python/apache_beam/io/gcp/bigquery.py>:1655: BeamDeprecationWarning: options is deprecated since First stable release. References to <pipeline>.options will not be supported
  temp_location = pcoll.pipeline.options.view_as(
<https://builds.apache.org/job/beam_PostCommit_Python37/ws/src/sdks/python/apache_beam/runners/dataflow/dataflow_runner.py>:788: BeamDeprecationWarning: BigQuerySink is deprecated since 2.11.0. Use WriteToBigQuery instead.
Worker logs: https://console.cloud.google.com/dataflow/jobsDetail/locations/us-central1/jobs/2020-02-19_19_30_16-8886068192296740241?project=apache-beam-testing
Worker logs: https://console.cloud.google.com/dataflow/jobsDetail/locations/us-central1/jobs/2020-02-19_19_37_32-8641221065119697187?project=apache-beam-testing
  kms_key=transform.kms_key))
<https://builds.apache.org/job/beam_PostCommit_Python37/ws/src/sdks/python/apache_beam/io/gcp/big_query_query_to_table_pipeline.py>:87: FutureWarning: _ReadFromBigQuery is experimental.
  kms_key=kms_key)
<https://builds.apache.org/job/beam_PostCommit_Python37/ws/src/sdks/python/apache_beam/io/gcp/bigquery.py>:1655: BeamDeprecationWarning: options is deprecated since First stable release. References to <pipeline>.options will not be supported
  temp_location = pcoll.pipeline.options.view_as(
<https://builds.apache.org/job/beam_PostCommit_Python37/ws/src/sdks/python/apache_beam/runners/dataflow/dataflow_runner.py>:788: BeamDeprecationWarning: BigQuerySink is deprecated since 2.11.0. Use WriteToBigQuery instead.
  kms_key=transform.kms_key))
<https://builds.apache.org/job/beam_PostCommit_Python37/ws/src/sdks/python/apache_beam/io/gcp/big_query_query_to_table_pipeline.py>:95: BeamDeprecationWarning: BigQuerySink is deprecated since 2.11.0. Use WriteToBigQuery instead.
  kms_key=kms_key))
<https://builds.apache.org/job/beam_PostCommit_Python37/ws/src/sdks/python/apache_beam/io/gcp/big_query_query_to_table_pipeline.py>:87: FutureWarning: _ReadFromBigQuery is experimental.
  kms_key=kms_key)
<https://builds.apache.org/job/beam_PostCommit_Python37/ws/src/sdks/python/apache_beam/io/gcp/bigquery.py>:1655: BeamDeprecationWarning: options is deprecated since First stable release. References to <pipeline>.options will not be supported
  temp_location = pcoll.pipeline.options.view_as(
<https://builds.apache.org/job/beam_PostCommit_Python37/ws/src/sdks/python/apache_beam/runners/dataflow/dataflow_runner.py>:788: BeamDeprecationWarning: BigQuerySink is deprecated since 2.11.0. Use WriteToBigQuery instead.
  kms_key=transform.kms_key))
<https://builds.apache.org/job/beam_PostCommit_Python37/ws/src/sdks/python/apache_beam/io/gcp/big_query_query_to_table_pipeline.py>:95: BeamDeprecationWarning: BigQuerySink is deprecated since 2.11.0. Use WriteToBigQuery instead.
  kms_key=kms_key))
Worker logs: https://console.cloud.google.com/dataflow/jobsDetail/locations/us-central1/jobs/2020-02-19_18_55_50-4991681624380530112?project=apache-beam-testing
<https://builds.apache.org/job/beam_PostCommit_Python37/ws/src/sdks/python/apache_beam/io/gcp/bigquery_read_it_test.py>:162: FutureWarning: _ReadFromBigQuery is experimental.
  query=self.query, use_standard_sql=True, project=self.project))
Worker logs: https://console.cloud.google.com/dataflow/jobsDetail/locations/us-central1/jobs/2020-02-19_19_12_23-11554441809395135601?project=apache-beam-testing
<https://builds.apache.org/job/beam_PostCommit_Python37/ws/src/sdks/python/apache_beam/io/gcp/bigquery.py>:1655: BeamDeprecationWarning: options is deprecated since First stable release. References to <pipeline>.options will not be supported
  temp_location = pcoll.pipeline.options.view_as(
Worker logs: https://console.cloud.google.com/dataflow/jobsDetail/locations/us-central1/jobs/2020-02-19_19_19_37-16838722733426296800?project=apache-beam-testing
Worker logs: https://console.cloud.google.com/dataflow/jobsDetail/locations/us-central1/jobs/2020-02-19_19_28_03-3336630725474119107?project=apache-beam-testing
Worker logs: https://console.cloud.google.com/dataflow/jobsDetail/locations/us-central1/jobs/2020-02-19_19_35_58-12522998087313645950?project=apache-beam-testing
Worker logs: https://console.cloud.google.com/dataflow/jobsDetail/locations/us-central1/jobs/2020-02-19_18_55_50-17386713649598141479?project=apache-beam-testing
<https://builds.apache.org/job/beam_PostCommit_Python37/ws/src/sdks/python/apache_beam/io/gcp/bigquery_read_it_test.py>:275: FutureWarning: _ReadFromBigQuery is experimental.
  query=self.query, use_standard_sql=True, project=self.project))
Worker logs: https://console.cloud.google.com/dataflow/jobsDetail/locations/us-central1/jobs/2020-02-19_19_03_55-8731939878770436433?project=apache-beam-testing
<https://builds.apache.org/job/beam_PostCommit_Python37/ws/src/sdks/python/apache_beam/io/gcp/bigquery.py>:1655: BeamDeprecationWarning: options is deprecated since First stable release. References to <pipeline>.options will not be supported
  temp_location = pcoll.pipeline.options.view_as(
Worker logs: https://console.cloud.google.com/dataflow/jobsDetail/locations/us-central1/jobs/2020-02-19_19_11_25-7634486132352021192?project=apache-beam-testing
Worker logs: https://console.cloud.google.com/dataflow/jobsDetail/locations/us-central1/jobs/2020-02-19_19_18_43-10818521201096967615?project=apache-beam-testing
Worker logs: https://console.cloud.google.com/dataflow/jobsDetail/locations/us-central1/jobs/2020-02-19_19_26_34-18361114015913276389?project=apache-beam-testing
Worker logs: https://console.cloud.google.com/dataflow/jobsDetail/locations/us-central1/jobs/2020-02-19_19_33_40-13949049255977509839?project=apache-beam-testing
Worker logs: https://console.cloud.google.com/dataflow/jobsDetail/locations/us-central1/jobs/2020-02-19_18_55_50-12933863333240900790?project=apache-beam-testing
<https://builds.apache.org/job/beam_PostCommit_Python37/ws/src/sdks/python/apache_beam/runners/dataflow/dataflow_runner.py>:788: BeamDeprecationWarning: BigQuerySink is deprecated since 2.11.0. Use WriteToBigQuery instead.
Worker logs: https://console.cloud.google.com/dataflow/jobsDetail/locations/us-central1/jobs/2020-02-19_19_03_31-4170365371392532306?project=apache-beam-testing
Worker logs: https://console.cloud.google.com/dataflow/jobsDetail/locations/us-central1/jobs/2020-02-19_19_11_24-12766330733000702677?project=apache-beam-testing
  kms_key=transform.kms_key))
Worker logs: https://console.cloud.google.com/dataflow/jobsDetail/locations/us-central1/jobs/2020-02-19_19_18_29-13515262907896723278?project=apache-beam-testing
<https://builds.apache.org/job/beam_PostCommit_Python37/ws/src/sdks/python/apache_beam/io/gcp/bigquery_io_read_pipeline.py>:84: FutureWarning: _ReadFromBigQuery is experimental.
Worker logs: https://console.cloud.google.com/dataflow/jobsDetail/locations/us-central1/jobs/2020-02-19_19_27_04-14366889031590942384?project=apache-beam-testing
Worker logs: https://console.cloud.google.com/dataflow/jobsDetail/locations/us-central1/jobs/2020-02-19_19_34_28-1225353745272222621?project=apache-beam-testing
  (options.view_as(GoogleCloudOptions).project, known_args.input_table))
<https://builds.apache.org/job/beam_PostCommit_Python37/ws/src/sdks/python/apache_beam/io/gcp/bigquery.py>:1655: BeamDeprecationWarning: options is deprecated since First stable release. References to <pipeline>.options will not be supported
  temp_location = pcoll.pipeline.options.view_as(
<https://builds.apache.org/job/beam_PostCommit_Python37/ws/src/sdks/python/apache_beam/io/gcp/bigquery_io_read_pipeline.py>:84: FutureWarning: _ReadFromBigQuery is experimental.
  (options.view_as(GoogleCloudOptions).project, known_args.input_table))
<https://builds.apache.org/job/beam_PostCommit_Python37/ws/src/sdks/python/apache_beam/io/gcp/bigquery.py>:1655: BeamDeprecationWarning: options is deprecated since First stable release. References to <pipeline>.options will not be supported
  temp_location = pcoll.pipeline.options.view_as(
<https://builds.apache.org/job/beam_PostCommit_Python37/ws/src/sdks/python/apache_beam/io/fileio_test.py>:303: FutureWarning: MatchAll is experimental.
  | 'GetPath' >> beam.Map(lambda metadata: metadata.path))
<https://builds.apache.org/job/beam_PostCommit_Python37/ws/src/sdks/python/apache_beam/io/fileio_test.py>:316: FutureWarning: MatchAll is experimental.
  | 'Checksums' >> beam.Map(compute_hash))
<https://builds.apache.org/job/beam_PostCommit_Python37/ws/src/sdks/python/apache_beam/io/fileio_test.py>:316: FutureWarning: ReadMatches is experimental.
  | 'Checksums' >> beam.Map(compute_hash))
Worker logs: https://console.cloud.google.com/dataflow/jobsDetail/locations/us-central1/jobs/2020-02-19_18_55_50-1197650819828327863?project=apache-beam-testing
Worker logs: https://console.cloud.google.com/dataflow/jobsDetail/locations/us-central1/jobs/2020-02-19_19_04_39-6445320085317192815?project=apache-beam-testing
Worker logs: https://console.cloud.google.com/dataflow/jobsDetail/locations/us-central1/jobs/2020-02-19_19_14_49-6518984539234916714?project=apache-beam-testing
Worker logs: https://console.cloud.google.com/dataflow/jobsDetail/locations/us-central1/jobs/2020-02-19_19_22_08-3146434802708383544?project=apache-beam-testing
<https://builds.apache.org/job/beam_PostCommit_Python37/ws/src/sdks/python/apache_beam/io/avroio.py>:205: UserWarning: Due to a known issue in avro-python3 package, it is recommended to use fastavro with Beam Avro IO on Python 3 until BEAM-6522 is addressed.
  "Due to a known issue in avro-python3 package, it is "
<https://builds.apache.org/job/beam_PostCommit_Python37/ws/src/sdks/python/apache_beam/io/gcp/bigquery_test.py>:823: BeamDeprecationWarning: options is deprecated since First stable release. References to <pipeline>.options will not be supported
  streaming = self.test_pipeline.options.view_as(StandardOptions).streaming
<https://builds.apache.org/job/beam_PostCommit_Python37/ws/src/sdks/python/apache_beam/io/gcp/bigquery.py>:1466: BeamDeprecationWarning: options is deprecated since First stable release. References to <pipeline>.options will not be supported
  experiments = p.options.view_as(DebugOptions).experiments or []
<https://builds.apache.org/job/beam_PostCommit_Python37/ws/src/sdks/python/apache_beam/io/gcp/bigquery.py>:1463: BeamDeprecationWarning: options is deprecated since First stable release. References to <pipeline>.options will not be supported
  self.table_reference.projectId = pcoll.pipeline.options.view_as(
Worker logs: https://console.cloud.google.com/dataflow/jobsDetail/locations/us-central1/jobs/2020-02-19_18_55_52-8771797254319707232?project=apache-beam-testing
Worker logs: https://console.cloud.google.com/dataflow/jobsDetail/locations/us-central1/jobs/2020-02-19_19_04_22-16970331907294860527?project=apache-beam-testing
Worker logs: https://console.cloud.google.com/dataflow/jobsDetail/locations/us-central1/jobs/2020-02-19_19_11_00-13882481424814610437?project=apache-beam-testing
Worker logs: https://console.cloud.google.com/dataflow/jobsDetail/locations/us-central1/jobs/2020-02-19_19_19_03-16478757486371006238?project=apache-beam-testing
Worker logs: https://console.cloud.google.com/dataflow/jobsDetail/locations/us-central1/jobs/2020-02-19_19_27_03-3425383084118160545?project=apache-beam-testing
Worker logs: https://console.cloud.google.com/dataflow/jobsDetail/locations/us-central1/jobs/2020-02-19_19_33_29-18307077742875730622?project=apache-beam-testing
test_datastore_wordcount_it (apache_beam.examples.cookbook.datastore_wordcount_it_test.DatastoreWordCountIT) ... SKIP: This test still needs to be fixed on Python 3TODO: BEAM-4543
test_bigquery_tornadoes_it (apache_beam.examples.cookbook.bigquery_tornadoes_it_test.BigqueryTornadoesIT) ... ok
test_autocomplete_it (apache_beam.examples.complete.autocomplete_test.AutocompleteTest) ... ok
test_streaming_wordcount_it (apache_beam.examples.streaming_wordcount_it_test.StreamingWordCountIT) ... ok
test_leader_board_it (apache_beam.examples.complete.game.leader_board_it_test.LeaderBoardIT) ... ok
test_game_stats_it (apache_beam.examples.complete.game.game_stats_it_test.GameStatsIT) ... ok
test_wordcount_fnapi_it (apache_beam.examples.wordcount_it_test.WordCountIT) ... ok
test_wordcount_it (apache_beam.examples.wordcount_it_test.WordCountIT) ... ok
test_user_score_it (apache_beam.examples.complete.game.user_score_it_test.UserScoreIT) ... ok
test_avro_it (apache_beam.examples.fastavro_it_test.FastavroIT) ... ok
test_hourly_team_score_it (apache_beam.examples.complete.game.hourly_team_score_it_test.HourlyTeamScoreIT) ... ok
test_multiple_destinations_transform (apache_beam.io.gcp.bigquery_test.BigQueryStreamingInsertTransformIntegrationTests) ... ok
test_value_provider_transform (apache_beam.io.gcp.bigquery_test.BigQueryStreamingInsertTransformIntegrationTests) ... ok
test_bigquery_read_1M_python (apache_beam.io.gcp.bigquery_io_read_it_test.BigqueryIOReadIT) ... ok
test_bigquery_read_custom_1M_python (apache_beam.io.gcp.bigquery_io_read_it_test.BigqueryIOReadIT) ... ok
test_datastore_write_limit (apache_beam.io.gcp.datastore_write_it_test.DatastoreWriteIT) ... SKIP: This test still needs to be fixed on Python 3TODO: BEAM-4543
test_iobase_source (apache_beam.io.gcp.bigquery_read_it_test.ReadNewTypesTests) ... ok
test_native_source (apache_beam.io.gcp.bigquery_read_it_test.ReadNewTypesTests) ... ok
test_copy (apache_beam.io.gcp.gcsio_integration_test.GcsIOIntegrationTest) ... ok
test_copy_batch (apache_beam.io.gcp.gcsio_integration_test.GcsIOIntegrationTest) ... ok
test_copy_batch_kms (apache_beam.io.gcp.gcsio_integration_test.GcsIOIntegrationTest) ... ok
test_copy_batch_rewrite_token (apache_beam.io.gcp.gcsio_integration_test.GcsIOIntegrationTest) ... ok
test_copy_kms (apache_beam.io.gcp.gcsio_integration_test.GcsIOIntegrationTest) ... ok
test_copy_rewrite_token (apache_beam.io.gcp.gcsio_integration_test.GcsIOIntegrationTest) ... ok
test_iobase_source (apache_beam.io.gcp.bigquery_read_it_test.ReadTests) ... ok
test_native_source (apache_beam.io.gcp.bigquery_read_it_test.ReadTests) ... ok
test_bqfl_streaming (apache_beam.io.gcp.bigquery_file_loads_test.BigQueryFileLoadsIT) ... SKIP: TestStream is not supported on TestDataflowRunner
test_multiple_destinations_transform (apache_beam.io.gcp.bigquery_file_loads_test.BigQueryFileLoadsIT) ... ok
test_one_job_fails_all_jobs_fail (apache_beam.io.gcp.bigquery_file_loads_test.BigQueryFileLoadsIT) ... ok
test_transform_on_gcs (apache_beam.io.fileio_test.MatchIntegrationTest) ... ok
test_parquetio_it (apache_beam.io.parquetio_it_test.TestParquetIT) ... ok
test_file_loads (apache_beam.io.gcp.bigquery_test.PubSubBigQueryIT) ... SKIP: https://issuetracker.google.com/issues/118375066
test_streaming_inserts (apache_beam.io.gcp.bigquery_test.PubSubBigQueryIT) ... ok
test_basic_execution (apache_beam.testing.test_stream_it_test.TestStreamIntegrationTests) ... SKIP: The "TestDataflowRunner", does not support the TestStream transform. Supported runners: ['DirectRunner', 'SwitchingDirectRunner']
Tests that the TestStream supports emitting to multiple PCollections. ... SKIP: The "TestDataflowRunner", does not support the TestStream transform. Supported runners: ['DirectRunner', 'SwitchingDirectRunner']
Tests that the TestStream can independently control output watermarks. ... SKIP: The "TestDataflowRunner", does not support the TestStream transform. Supported runners: ['DirectRunner', 'SwitchingDirectRunner']
test_datastore_write_limit (apache_beam.io.gcp.datastore.v1new.datastore_write_it_test.DatastoreWriteIT) ... ok
test_streaming_data_only (apache_beam.io.gcp.pubsub_integration_test.PubSubIntegrationTest) ... ok
test_streaming_with_attributes (apache_beam.io.gcp.pubsub_integration_test.PubSubIntegrationTest) ... ok
Runs streaming Dataflow job and verifies that user metrics are reported ... ok
test_job_python_from_python_it (apache_beam.transforms.external_test_it.ExternalTransformIT) ... ok
test_metrics_fnapi_it (apache_beam.runners.dataflow.dataflow_exercise_metrics_pipeline_test.ExerciseMetricsPipelineTest) ... ok
test_metrics_it (apache_beam.runners.dataflow.dataflow_exercise_metrics_pipeline_test.ExerciseMetricsPipelineTest) ... ok
test_big_query_legacy_sql (apache_beam.io.gcp.big_query_query_to_table_it_test.BigQueryQueryToTableIT) ... ok
test_big_query_new_types (apache_beam.io.gcp.big_query_query_to_table_it_test.BigQueryQueryToTableIT) ... ok
test_big_query_new_types_native (apache_beam.io.gcp.big_query_query_to_table_it_test.BigQueryQueryToTableIT) ... ok
test_big_query_standard_sql (apache_beam.io.gcp.big_query_query_to_table_it_test.BigQueryQueryToTableIT) ... ok
test_big_query_standard_sql_kms_key_native (apache_beam.io.gcp.big_query_query_to_table_it_test.BigQueryQueryToTableIT) ... ok
test_big_query_write (apache_beam.io.gcp.bigquery_write_it_test.BigQueryWriteIntegrationTests) ... ok
test_big_query_write_new_types (apache_beam.io.gcp.bigquery_write_it_test.BigQueryWriteIntegrationTests) ... ok
test_big_query_write_schema_autodetect (apache_beam.io.gcp.bigquery_write_it_test.BigQueryWriteIntegrationTests) ... SKIP: DataflowRunner does not support schema autodetection
test_big_query_write_without_schema (apache_beam.io.gcp.bigquery_write_it_test.BigQueryWriteIntegrationTests) ... ok

----------------------------------------------------------------------
XML: nosetests-postCommitIT-df-py37.xml
----------------------------------------------------------------------
XML: <https://builds.apache.org/job/beam_PostCommit_Python37/ws/src/sdks/python/nosetests.xml>
----------------------------------------------------------------------
Ran 52 tests in 3069.064s

OK (SKIP=8)

FAILURE: Build failed with an exception.

* Where:
Build file '<https://builds.apache.org/job/beam_PostCommit_Python37/ws/src/sdks/python/test-suites/direct/py37/build.gradle'> line: 51

* What went wrong:
Execution failed for task ':sdks:python:test-suites:direct:py37:postCommitIT'.
> Process 'command 'sh'' finished with non-zero exit value 1

* Try:
Run with --stacktrace option to get the stack trace. Run with --info or --debug option to get more log output. Run with --scan to get full insights.

* Get more help at https://help.gradle.org

Deprecated Gradle features were used in this build, making it incompatible with Gradle 6.0.
Use '--warning-mode all' to show the individual deprecation warnings.
See https://docs.gradle.org/5.2.1/userguide/command_line_interface.html#sec:command_line_warnings

BUILD FAILED in 52m 37s
85 actionable tasks: 64 executed, 21 from cache

Publishing build scan...
https://gradle.com/s/5u6lbt7igbjwc

Build step 'Invoke Gradle script' changed build result to FAILURE
Build step 'Invoke Gradle script' marked build as failure

---------------------------------------------------------------------
To unsubscribe, e-mail: builds-unsubscribe@beam.apache.org
For additional commands, e-mail: builds-help@beam.apache.org