You are viewing a plain text version of this content. The canonical link for it is here.
Posted to dev@zookeeper.apache.org by Apache Jenkins Server <je...@builds.apache.org> on 2016/03/14 13:22:07 UTC

ZooKeeper_branch35_openjdk7 - Build # 8 - Failure

See https://builds.apache.org/job/ZooKeeper_branch35_openjdk7/8/

###################################################################################
########################## LAST 60 LINES OF THE CONSOLE ###########################
[...truncated 377861 lines...]
    [junit] 2016-03-14 12:22:04,336 [myid:] - WARN  [LearnerHandler-/127.0.0.1:39247:LearnerHandler@619] - ******* GOODBYE /127.0.0.1:39247 ********
    [junit] 2016-03-14 12:22:04,338 [myid:] - INFO  [NIOServerCxnFactory.SelectorThread-0:NIOServerCnxnFactory$SelectorThread@420] - selector thread exitted run method
    [junit] 2016-03-14 12:22:04,338 [myid:] - INFO  [NIOServerCxnFactory.AcceptThread:/127.0.0.1:27521:NIOServerCnxnFactory$AcceptThread@219] - accept thread exitted run method
    [junit] 2016-03-14 12:22:04,337 [myid:] - WARN  [LearnerHandler-/127.0.0.1:39250:LearnerHandler@903] - Ignoring unexpected exception
    [junit] java.lang.InterruptedException
    [junit] 	at java.util.concurrent.locks.AbstractQueuedSynchronizer.acquireInterruptibly(AbstractQueuedSynchronizer.java:1219)
    [junit] 	at java.util.concurrent.locks.ReentrantLock.lockInterruptibly(ReentrantLock.java:340)
    [junit] 	at java.util.concurrent.LinkedBlockingQueue.put(LinkedBlockingQueue.java:338)
    [junit] 	at org.apache.zookeeper.server.quorum.LearnerHandler.shutdown(LearnerHandler.java:901)
    [junit] 	at org.apache.zookeeper.server.quorum.LearnerHandler.run(LearnerHandler.java:622)
    [junit] 2016-03-14 12:22:04,338 [myid:] - INFO  [NIOServerCxnFactory.SelectorThread-1:NIOServerCnxnFactory$SelectorThread@420] - selector thread exitted run method
    [junit] 2016-03-14 12:22:04,338 [myid:] - WARN  [LearnerHandler-/127.0.0.1:39247:LearnerHandler@903] - Ignoring unexpected exception
    [junit] java.lang.InterruptedException
    [junit] 	at java.util.concurrent.locks.AbstractQueuedSynchronizer.acquireInterruptibly(AbstractQueuedSynchronizer.java:1219)
    [junit] 	at java.util.concurrent.locks.ReentrantLock.lockInterruptibly(ReentrantLock.java:340)
    [junit] 	at java.util.concurrent.LinkedBlockingQueue.put(LinkedBlockingQueue.java:338)
    [junit] 	at org.apache.zookeeper.server.quorum.LearnerHandler.shutdown(LearnerHandler.java:901)
    [junit] 	at org.apache.zookeeper.server.quorum.LearnerHandler.run(LearnerHandler.java:622)
    [junit] 2016-03-14 12:22:04,338 [myid:] - INFO  [/127.0.0.1:27523:QuorumCnxManager$Listener@659] - Leaving listener
    [junit] 2016-03-14 12:22:04,338 [myid:] - INFO  [QuorumPeer[myid=5](plain=/127.0.0.1:27521)(secure=disabled):MBeanRegistry@128] - Unregister MBean [org.apache.ZooKeeperService:name0=ReplicatedServer_id5,name1=replica.5,name2=Leader]
    [junit] 2016-03-14 12:22:04,339 [myid:] - INFO  [main:QuorumUtil@254] - Shutting down leader election QuorumPeer[myid=5](plain=/127.0.0.1:27521)(secure=disabled)
    [junit] 2016-03-14 12:22:04,339 [myid:] - WARN  [QuorumPeer[myid=5](plain=/127.0.0.1:27521)(secure=disabled):QuorumPeer@1126] - Unexpected exception
    [junit] java.lang.InterruptedException
    [junit] 	at java.lang.Object.wait(Native Method)
    [junit] 	at org.apache.zookeeper.server.quorum.Leader.lead(Leader.java:559)
    [junit] 	at org.apache.zookeeper.server.quorum.QuorumPeer.run(QuorumPeer.java:1123)
    [junit] 2016-03-14 12:22:04,339 [myid:] - INFO  [QuorumPeer[myid=5](plain=/127.0.0.1:27521)(secure=disabled):Leader@613] - Shutting down
    [junit] 2016-03-14 12:22:04,339 [myid:] - INFO  [main:QuorumUtil@259] - Waiting for QuorumPeer[myid=5](plain=/127.0.0.1:27521)(secure=disabled) to exit thread
    [junit] 2016-03-14 12:22:04,339 [myid:] - WARN  [QuorumPeer[myid=5](plain=/127.0.0.1:27521)(secure=disabled):QuorumPeer@1157] - PeerState set to LOOKING
    [junit] 2016-03-14 12:22:04,339 [myid:] - WARN  [QuorumPeer[myid=5](plain=/127.0.0.1:27521)(secure=disabled):QuorumPeer@1139] - QuorumPeer main thread exited
    [junit] 2016-03-14 12:22:04,339 [myid:] - INFO  [QuorumPeer[myid=5](plain=/127.0.0.1:27521)(secure=disabled):MBeanRegistry@128] - Unregister MBean [org.apache.ZooKeeperService:name0=ReplicatedServer_id5]
    [junit] 2016-03-14 12:22:04,339 [myid:] - INFO  [QuorumPeer[myid=5](plain=/127.0.0.1:27521)(secure=disabled):MBeanRegistry@128] - Unregister MBean [org.apache.ZooKeeperService:name0=ReplicatedServer_id5,name1=replica.5]
    [junit] 2016-03-14 12:22:04,340 [myid:] - INFO  [QuorumPeer[myid=5](plain=/127.0.0.1:27521)(secure=disabled):MBeanRegistry@128] - Unregister MBean [org.apache.ZooKeeperService:name0=ReplicatedServer_id5,name1=replica.1]
    [junit] 2016-03-14 12:22:04,340 [myid:] - INFO  [QuorumPeer[myid=5](plain=/127.0.0.1:27521)(secure=disabled):MBeanRegistry@128] - Unregister MBean [org.apache.ZooKeeperService:name0=ReplicatedServer_id5,name1=replica.2]
    [junit] 2016-03-14 12:22:04,340 [myid:] - INFO  [QuorumPeer[myid=5](plain=/127.0.0.1:27521)(secure=disabled):MBeanRegistry@128] - Unregister MBean [org.apache.ZooKeeperService:name0=ReplicatedServer_id5,name1=replica.3]
    [junit] 2016-03-14 12:22:04,340 [myid:] - INFO  [main:FourLetterWordMain@85] - connecting to 127.0.0.1 27509
    [junit] 2016-03-14 12:22:04,340 [myid:] - INFO  [main:QuorumUtil@243] - 127.0.0.1:27509 is no longer accepting client connections
    [junit] 2016-03-14 12:22:04,340 [myid:] - INFO  [main:FourLetterWordMain@85] - connecting to 127.0.0.1 27512
    [junit] 2016-03-14 12:22:04,341 [myid:] - INFO  [main:QuorumUtil@243] - 127.0.0.1:27512 is no longer accepting client connections
    [junit] 2016-03-14 12:22:04,341 [myid:] - INFO  [main:FourLetterWordMain@85] - connecting to 127.0.0.1 27515
    [junit] 2016-03-14 12:22:04,341 [myid:] - INFO  [main:QuorumUtil@243] - 127.0.0.1:27515 is no longer accepting client connections
    [junit] 2016-03-14 12:22:04,341 [myid:] - INFO  [main:FourLetterWordMain@85] - connecting to 127.0.0.1 27518
    [junit] 2016-03-14 12:22:04,341 [myid:] - INFO  [main:QuorumUtil@243] - 127.0.0.1:27518 is no longer accepting client connections
    [junit] 2016-03-14 12:22:04,341 [myid:] - INFO  [main:FourLetterWordMain@85] - connecting to 127.0.0.1 27521
    [junit] 2016-03-14 12:22:04,342 [myid:] - INFO  [main:QuorumUtil@243] - 127.0.0.1:27521 is no longer accepting client connections
    [junit] 2016-03-14 12:22:04,343 [myid:] - INFO  [main:ZKTestCase$1@65] - SUCCEEDED testRemoveOneAsynchronous
    [junit] 2016-03-14 12:22:04,343 [myid:] - INFO  [main:ZKTestCase$1@60] - FINISHED testRemoveOneAsynchronous
    [junit] Tests run: 11, Failures: 0, Errors: 0, Skipped: 0, Time elapsed: 119.056 sec, Thread: 7, Class: org.apache.zookeeper.test.ReconfigTest

BUILD FAILED
/home/jenkins/jenkins-slave/workspace/ZooKeeper_branch35_openjdk7/branch-3.5/build.xml:1361: The following error occurred while executing this line:
/home/jenkins/jenkins-slave/workspace/ZooKeeper_branch35_openjdk7/branch-3.5/build.xml:1246: Tests failed!

Total time: 6 minutes 36 seconds
Build step 'Invoke Ant' marked build as failure
Archiving artifacts
Recording test results
Email was triggered for: Failure - Any
Sending email for trigger: Failure - Any



###################################################################################
############################## FAILED TESTS (if any) ##############################
1 tests failed.
FAILED:  org.apache.zookeeper.server.quorum.ReconfigRecoveryTest.testCurrentServersAreObserversInNextConfig

Error Message:
waiting for server 4 being up

Stack Trace:
junit.framework.AssertionFailedError: waiting for server 4 being up
	at org.apache.zookeeper.server.quorum.ReconfigRecoveryTest.testCurrentServersAreObserversInNextConfig(ReconfigRecoveryTest.java:217)
	at org.apache.zookeeper.JUnit4ZKTestRunner$LoggedInvokeMethod.evaluate(JUnit4ZKTestRunner.java:79)



ZooKeeper_branch35_openjdk7 - Build # 10 - Still Failing

Posted by Apache Jenkins Server <je...@builds.apache.org>.
See https://builds.apache.org/job/ZooKeeper_branch35_openjdk7/10/

###################################################################################
########################## LAST 60 LINES OF THE CONSOLE ###########################
[...truncated 386502 lines...]
    [junit] 2016-03-16 07:58:09,299 [myid:] - INFO  [main:MBeanRegistry@128] - Unregister MBean [org.apache.ZooKeeperService:name0=StandaloneServer_port11222]
    [junit] 2016-03-16 07:58:09,299 [myid:] - INFO  [main:FourLetterWordMain@85] - connecting to 127.0.0.1 11222
    [junit] 2016-03-16 07:58:09,299 [myid:] - INFO  [main:JMXEnv@146] - ensureOnly:[]
    [junit] 2016-03-16 07:58:09,303 [myid:] - INFO  [main:ClientBase@562] - fdcount after test is: 54 at start it was 43
    [junit] 2016-03-16 07:58:09,303 [myid:] - INFO  [main:ClientBase@564] - sleeping for 20 secs
    [junit] 2016-03-16 07:58:09,304 [myid:] - INFO  [main:ZKTestCase$1@65] - SUCCEEDED testQuota
    [junit] 2016-03-16 07:58:09,304 [myid:] - INFO  [main:ZKTestCase$1@60] - FINISHED testQuota
    [junit] Tests run: 1, Failures: 0, Errors: 0, Time elapsed: 0.812 sec

junit.run-concurrent:

junit.run:

test-core-java:

junit.run.nolog4j:

test-core-java-nolog4j:

call-test-cppunit:

init:

check-cppunit-makefile:

create-cppunit-makefile:

init:

check-cppunit-configure:

create-cppunit-configure:
    [mkdir] Created dir: /x1/jenkins/jenkins-slave/workspace/ZooKeeper_branch35_openjdk7/branch-3.5/build/test/test-cppunit
     [exec] checking for doxygen... no
     [exec] checking for perl... /usr/bin/perl
     [exec] checking for dot... no
     [exec] checking for a BSD-compatible install... /usr/bin/install -c
     [exec] checking whether build environment is sane... 
     [exec] yes
     [exec] checking for a thread-safe mkdir -p... /bin/mkdir -p
     [exec] checking for gawk... no
     [exec] checking for mawk... mawk
     [exec] checking whether make sets $(MAKE)... yes
     [exec] /bin/bash: /x1/jenkins/jenkins-slave/workspace/ZooKeeper_branch35_openjdk7/branch-3.5/src/c/missing: No such file or directory
     [exec] configure: WARNING: `missing' script is too old or missing
     [exec] /x1/jenkins/jenkins-slave/workspace/ZooKeeper_branch35_openjdk7/branch-3.5/src/c/configure: line 4907: syntax error near unexpected token `1.10.2'
     [exec] /x1/jenkins/jenkins-slave/workspace/ZooKeeper_branch35_openjdk7/branch-3.5/src/c/configure: line 4907: `   AM_PATH_CPPUNIT(1.10.2)'

BUILD FAILED
/x1/jenkins/jenkins-slave/workspace/ZooKeeper_branch35_openjdk7/branch-3.5/build.xml:1361: The following error occurred while executing this line:
/x1/jenkins/jenkins-slave/workspace/ZooKeeper_branch35_openjdk7/branch-3.5/build.xml:1320: The following error occurred while executing this line:
/x1/jenkins/jenkins-slave/workspace/ZooKeeper_branch35_openjdk7/branch-3.5/build.xml:1312: exec returned: 2

Total time: 62 minutes 16 seconds
Build step 'Invoke Ant' marked build as failure
Archiving artifacts
Recording test results
Email was triggered for: Failure - Any
Sending email for trigger: Failure - Any



###################################################################################
############################## FAILED TESTS (if any) ##############################
All tests passed

ZooKeeper_branch35_openjdk7 - Build # 9 - Still Failing

Posted by Apache Jenkins Server <je...@builds.apache.org>.
See https://builds.apache.org/job/ZooKeeper_branch35_openjdk7/9/

###################################################################################
########################## LAST 60 LINES OF THE CONSOLE ###########################
[...truncated 383033 lines...]
    [junit] 2016-03-15 12:42:10,661 [myid:] - INFO  [main:MBeanRegistry@128] - Unregister MBean [org.apache.ZooKeeperService:name0=StandaloneServer_port11222]
    [junit] 2016-03-15 12:42:10,661 [myid:] - INFO  [main:FourLetterWordMain@85] - connecting to 127.0.0.1 11222
    [junit] 2016-03-15 12:42:10,662 [myid:] - INFO  [main:JMXEnv@146] - ensureOnly:[]
    [junit] 2016-03-15 12:42:10,665 [myid:] - INFO  [main:ClientBase@562] - fdcount after test is: 54 at start it was 43
    [junit] 2016-03-15 12:42:10,666 [myid:] - INFO  [main:ClientBase@564] - sleeping for 20 secs
    [junit] 2016-03-15 12:42:10,666 [myid:] - INFO  [main:ZKTestCase$1@65] - SUCCEEDED testQuota
    [junit] 2016-03-15 12:42:10,667 [myid:] - INFO  [main:ZKTestCase$1@60] - FINISHED testQuota
    [junit] Tests run: 1, Failures: 0, Errors: 0, Time elapsed: 0.802 sec

junit.run-concurrent:

junit.run:

test-core-java:

junit.run.nolog4j:

test-core-java-nolog4j:

call-test-cppunit:

init:

check-cppunit-makefile:

create-cppunit-makefile:

init:

check-cppunit-configure:

create-cppunit-configure:
     [exec] configure.ac:37: warning: macro `AM_PATH_CPPUNIT' not found in library
     [exec] libtoolize: putting auxiliary files in `.'.
     [exec] libtoolize: copying file `./config.guess'
     [exec] libtoolize: copying file `./config.sub'
     [exec] libtoolize: copying file `./install-sh'
     [exec] libtoolize: copying file `./ltmain.sh'
     [exec] libtoolize: Consider adding `AC_CONFIG_MACRO_DIR([m4])' to configure.ac and
     [exec] libtoolize: rerunning libtoolize, to keep the correct libtool macros in-tree.
     [exec] libtoolize: Consider adding `-I m4' to ACLOCAL_AMFLAGS in Makefile.am.
     [exec] configure.ac:37: warning: macro `AM_PATH_CPPUNIT' not found in library
     [exec] configure.ac:37: error: possibly undefined macro: AM_PATH_CPPUNIT
     [exec]       If this token and others are legitimate, please use m4_pattern_allow.
     [exec]       See the Autoconf documentation.
     [exec] autoreconf: /usr/bin/autoconf failed with exit status: 1

BUILD FAILED
/x1/jenkins/jenkins-slave/workspace/ZooKeeper_branch35_openjdk7/branch-3.5/build.xml:1361: The following error occurred while executing this line:
/x1/jenkins/jenkins-slave/workspace/ZooKeeper_branch35_openjdk7/branch-3.5/build.xml:1320: The following error occurred while executing this line:
/x1/jenkins/jenkins-slave/workspace/ZooKeeper_branch35_openjdk7/branch-3.5/build.xml:1307: The following error occurred while executing this line:
/x1/jenkins/jenkins-slave/workspace/ZooKeeper_branch35_openjdk7/branch-3.5/build.xml:1299: exec returned: 1

Total time: 62 minutes 32 seconds
Build step 'Invoke Ant' marked build as failure
Archiving artifacts
Recording test results
Email was triggered for: Failure - Any
Sending email for trigger: Failure - Any



###################################################################################
############################## FAILED TESTS (if any) ##############################
All tests passed