You are viewing a plain text version of this content. The canonical link for it is here.
Posted to builds@beam.apache.org by Apache Jenkins Server <je...@builds.apache.org> on 2020/01/15 01:40:19 UTC

Build failed in Jenkins: beam_PostCommit_Go_VR_Spark #2075

See <https://builds.apache.org/job/beam_PostCommit_Go_VR_Spark/2075/display/redirect?page=changes>

Changes:

[kirillkozlov] Update data source for SQL performance tests


------------------------------------------
[...truncated 159.08 KB...]
  pcollections: <
    key: "n1"
    value: <
      unique_name: "n1"
      coder_id: "c0"
      is_bounded: BOUNDED
      windowing_strategy_id: "w0"
    >
  >
  pcollections: <
    key: "n2"
    value: <
      unique_name: "n2"
      coder_id: "c3"
      is_bounded: BOUNDED
      windowing_strategy_id: "w0"
    >
  >
  pcollections: <
    key: "n3"
    value: <
      unique_name: "n3"
      coder_id: "c0"
      is_bounded: BOUNDED
      windowing_strategy_id: "w0"
    >
  >
  pcollections: <
    key: "n4"
    value: <
      unique_name: "n4"
      coder_id: "c3"
      is_bounded: BOUNDED
      windowing_strategy_id: "w0"
    >
  >
  pcollections: <
    key: "n5"
    value: <
      unique_name: "n5"
      coder_id: "c0"
      is_bounded: BOUNDED
      windowing_strategy_id: "w0"
    >
  >
  pcollections: <
    key: "n6"
    value: <
      unique_name: "n6"
      coder_id: "c3"
      is_bounded: BOUNDED
      windowing_strategy_id: "w0"
    >
  >
  pcollections: <
    key: "n7"
    value: <
      unique_name: "n7"
      coder_id: "c3"
      is_bounded: BOUNDED
      windowing_strategy_id: "w0"
    >
  >
  pcollections: <
    key: "n8"
    value: <
      unique_name: "n8"
      coder_id: "c4"
      is_bounded: BOUNDED
      windowing_strategy_id: "w0"
    >
  >
  pcollections: <
    key: "n9"
    value: <
      unique_name: "n9"
      coder_id: "c6"
      is_bounded: BOUNDED
      windowing_strategy_id: "w0"
    >
  >
  windowing_strategies: <
    key: "w0"
    value: <
      window_fn: <
        urn: "beam:windowfn:global_windows:v0.1"
      >
      merge_status: NON_MERGING
      window_coder_id: "c1"
      trigger: <
        default: <
        >
      >
      accumulation_mode: DISCARDING
      output_time: END_OF_WINDOW
      closing_behavior: EMIT_IF_NONEMPTY
      OnTimeBehavior: FIRE_ALWAYS
      environment_id: "go"
    >
  >
  coders: <
    key: "c0"
    value: <
      spec: <
        urn: "beam:coder:bytes:v1"
      >
    >
  >
  coders: <
    key: "c1"
    value: <
      spec: <
        urn: "beam:coder:global_window:v1"
      >
    >
  >
  coders: <
    key: "c2"
    value: <
      spec: <
        urn: "beam:go:coder:custom:v1"
        payload: "Cgd2YXJpbnR6EgIIAhqFAQpxZ2l0aHViLmNvbS9hcGFjaGUvYmVhbS9zZGtzL2dvL3Rlc3QvdmVuZG9yL2dpdGh1Yi5jb20vYXBhY2hlL2JlYW0vc2Rrcy9nby9wa2cvYmVhbS9jb3JlL3J1bnRpbWUvY29kZXJ4LmVuY1ZhckludFoSEAgWIgQIGUAPKgYIFBICCAgikQEKcWdpdGh1Yi5jb20vYXBhY2hlL2JlYW0vc2Rrcy9nby90ZXN0L3ZlbmRvci9naXRodWIuY29tL2FwYWNoZS9iZWFtL3Nka3MvZ28vcGtnL2JlYW0vY29yZS9ydW50aW1lL2NvZGVyeC5kZWNWYXJJbnRaEhwIFiIECBlAAyIGCBQSAggIKgQIGUAPKgQIGUAB"
      >
    >
  >
  coders: <
    key: "c3"
    value: <
      spec: <
        urn: "beam:coder:length_prefix:v1"
      >
      component_coder_ids: "c2"
    >
  >
  coders: <
    key: "c4"
    value: <
      spec: <
        urn: "beam:coder:kv:v1"
      >
      component_coder_ids: "c3"
      component_coder_ids: "c3"
    >
  >
  coders: <
    key: "c5"
    value: <
      spec: <
        urn: "beam:coder:iterable:v1"
      >
      component_coder_ids: "c3"
    >
  >
  coders: <
    key: "c6"
    value: <
      spec: <
        urn: "beam:coder:kv:v1"
      >
      component_coder_ids: "c3"
      component_coder_ids: "c5"
    >
  >
  environments: <
    key: "go"
    value: <
      urn: "beam:env:docker:v1"
      payload: "\n<us.gcr.io/apache-beam-testing/jenkins/go_sdk:20200115-012532"
    >
  >
>
root_transform_ids: "e1"
root_transform_ids: "e2"
root_transform_ids: "e5"
root_transform_ids: "e6"
root_transform_ids: "e3"
root_transform_ids: "e4"
root_transform_ids: "e7"
root_transform_ids: "s1"
2020/01/15 01:40:13 Test flatten:flatten failed: 	connecting to job service:
failed to dial server at localhost:36543
	caused by:
context deadline exceeded
2020/01/15 01:40:13 Result: 7 tests failed

if [[ ! -z "$JOB_PORT" ]]; then
  # Shut down the job server
  kill %1 || echo "Failed to shut down job server"
fi

# Delete the container locally and remotely
docker rmi $CONTAINER:$TAG || echo "Failed to remove container"
Untagged: us.gcr.io/apache-beam-testing/jenkins/go_sdk:20200115-012532
Untagged: us.gcr.io/apache-beam-testing/jenkins/go_sdk@sha256:c8bc033afe14c3e90852d08f0683b3e678d099044ae063bd8204cbabfdb026b9
Deleted: sha256:c26b8295d9fba88a3daf303e7a345daa1a6cffa5007e5c740da57beaa1c82f55
Deleted: sha256:29c9ff93f03bf76aaeca11d360f174cf88e1d96afe817515cf34d48dd85010e5
Deleted: sha256:1f6b4e429efd05c5869551936da73e5eb28e6249ee0ac5724a42fde1283ea63f
Deleted: sha256:ef111211b95f7c348eacc87d82be857e9a475b4963a10feac73d4e50c542f717
Deleted: sha256:2f4e8a359b1984ced954c249bdfb06defeb8fa0e0fd5771a3e4a176b50b4205b
Deleted: sha256:1eac403be5beff1ab3dbcd051ad2a8bbf3e17a528cfc3bcf0609d91194b59a34
gcloud --quiet container images delete $CONTAINER:$TAG || echo "Failed to delete container"
Digests:
- us.gcr.io/apache-beam-testing/jenkins/go_sdk@sha256:c8bc033afe14c3e90852d08f0683b3e678d099044ae063bd8204cbabfdb026b9
  Associated tags:
 - 20200115-012532
Tags:
- us.gcr.io/apache-beam-testing/jenkins/go_sdk:20200115-012532
Deleted [us.gcr.io/apache-beam-testing/jenkins/go_sdk:20200115-012532].
Deleted [us.gcr.io/apache-beam-testing/jenkins/go_sdk@sha256:c8bc033afe14c3e90852d08f0683b3e678d099044ae063bd8204cbabfdb026b9].

# Clean up tempdir
rm -rf $TMPDIR

if [[ "$TEST_EXIT_CODE" -eq 0 ]]; then
  echo ">>> SUCCESS"
else
>>> FAILURE
  echo ">>> FAILURE"
fi
exit $TEST_EXIT_CODE

> Task :sdks:go:test:sparkValidatesRunner FAILED

FAILURE: Build failed with an exception.

* Where:
Build file '<https://builds.apache.org/job/beam_PostCommit_Go_VR_Spark/ws/src/sdks/go/test/build.gradle'> line: 75

* What went wrong:
Execution failed for task ':sdks:go:test:sparkValidatesRunner'.
> Process 'command 'sh'' finished with non-zero exit value 1

* Try:
Run with --stacktrace option to get the stack trace. Run with --info or --debug option to get more log output. Run with --scan to get full insights.

* Get more help at https://help.gradle.org

Deprecated Gradle features were used in this build, making it incompatible with Gradle 6.0.
Use '--warning-mode all' to show the individual deprecation warnings.
See https://docs.gradle.org/5.2.1/userguide/command_line_interface.html#sec:command_line_warnings

BUILD FAILED in 16m 51s
53 actionable tasks: 40 executed, 13 from cache

Publishing build scan...
https://gradle.com/s/5pk43ctumhwfi

Build step 'Invoke Gradle script' changed build result to FAILURE
Build step 'Invoke Gradle script' marked build as failure

---------------------------------------------------------------------
To unsubscribe, e-mail: builds-unsubscribe@beam.apache.org
For additional commands, e-mail: builds-help@beam.apache.org


Jenkins build is back to normal : beam_PostCommit_Go_VR_Spark #2076

Posted by Apache Jenkins Server <je...@builds.apache.org>.
See <https://builds.apache.org/job/beam_PostCommit_Go_VR_Spark/2076/display/redirect?page=changes>


---------------------------------------------------------------------
To unsubscribe, e-mail: builds-unsubscribe@beam.apache.org
For additional commands, e-mail: builds-help@beam.apache.org