You are viewing a plain text version of this content. The canonical link for it is here.
Posted to dev@poi.apache.org by Apache Jenkins Server <je...@builds.apache.org> on 2016/08/03 12:54:36 UTC
Build failed in Jenkins: POI-JDK8 #1191
See <https://builds.apache.org/job/POI-JDK8/1191/changes>
Changes:
[nick] Changelog update
[nick] Switch XSSF onto BaseFormulaEvaluator, reducing code duplication and fixing XSSFFormulaEvaluator.evaluateAll() to mirror HSSF and use any setup referenced workbooks (stackoverflow #38706562)
[nick] Refactor out some of the common FormulaEvaluator logic from HSSF to a base class (XSSF coming shortly)
[nick] Whitespace / indents
[nick] Whitespace / indents
[nick] Fix eclipse classpath - collections is in core lib
------------------------------------------
[...truncated 7324 lines...]
[findbugs] At edu.umd.cs.findbugs.classfile.engine.ClassParserUsingASM.parse(ClassParserUsingASM.java:110)
[findbugs] At edu.umd.cs.findbugs.classfile.engine.ClassParserUsingASM.parse(ClassParserUsingASM.java:587)
[findbugs] At edu.umd.cs.findbugs.classfile.engine.ClassInfoAnalysisEngine.analyze(ClassInfoAnalysisEngine.java:76)
[findbugs] At edu.umd.cs.findbugs.classfile.engine.ClassInfoAnalysisEngine.analyze(ClassInfoAnalysisEngine.java:38)
[findbugs] At edu.umd.cs.findbugs.classfile.impl.AnalysisCache.getClassAnalysis(AnalysisCache.java:268)
[findbugs] At edu.umd.cs.findbugs.FindBugs2.buildReferencedClassSet(FindBugs2.java:891)
[findbugs] At edu.umd.cs.findbugs.FindBugs2.execute(FindBugs2.java:222)
[findbugs] At edu.umd.cs.findbugs.FindBugs.runMain(FindBugs.java:393)
[findbugs] At edu.umd.cs.findbugs.FindBugs2.main(FindBugs2.java:1317)
[findbugs] Unable to get XClass for java/util/regex/Pattern
[findbugs] java.lang.ArrayIndexOutOfBoundsException: 1875
[findbugs] At org.objectweb.asm.ClassReader.readClass(Unknown Source)
[findbugs] At org.objectweb.asm.ClassReader.accept(Unknown Source)
[findbugs] At edu.umd.cs.findbugs.asm.FBClassReader.accept(FBClassReader.java:44)
[findbugs] At org.objectweb.asm.ClassReader.accept(Unknown Source)
[findbugs] At edu.umd.cs.findbugs.classfile.engine.ClassParserUsingASM.parse(ClassParserUsingASM.java:110)
[findbugs] At edu.umd.cs.findbugs.classfile.engine.ClassParserUsingASM.parse(ClassParserUsingASM.java:587)
[findbugs] At edu.umd.cs.findbugs.classfile.engine.ClassInfoAnalysisEngine.analyze(ClassInfoAnalysisEngine.java:76)
[findbugs] At edu.umd.cs.findbugs.classfile.engine.ClassInfoAnalysisEngine.analyze(ClassInfoAnalysisEngine.java:38)
[findbugs] At edu.umd.cs.findbugs.classfile.impl.AnalysisCache.getClassAnalysis(AnalysisCache.java:268)
[findbugs] At edu.umd.cs.findbugs.ba.XFactory.getXClass(XFactory.java:652)
[findbugs] At edu.umd.cs.findbugs.ba.AnalysisContext.setAppClassList(AnalysisContext.java:932)
[findbugs] At edu.umd.cs.findbugs.FindBugs2.setAppClassList(FindBugs2.java:997)
[findbugs] At edu.umd.cs.findbugs.FindBugs2.execute(FindBugs2.java:225)
[findbugs] At edu.umd.cs.findbugs.FindBugs.runMain(FindBugs.java:393)
[findbugs] At edu.umd.cs.findbugs.FindBugs2.main(FindBugs2.java:1317)
[findbugs] Couldn't get class info for java/util/function/Consumer
[findbugs] java.lang.ArrayIndexOutOfBoundsException: 28526
[findbugs] At org.objectweb.asm.ClassReader.readClass(Unknown Source)
[findbugs] At org.objectweb.asm.ClassReader.accept(Unknown Source)
[findbugs] At edu.umd.cs.findbugs.asm.FBClassReader.accept(FBClassReader.java:44)
[findbugs] At org.objectweb.asm.ClassReader.accept(Unknown Source)
[findbugs] At edu.umd.cs.findbugs.classfile.engine.ClassParserUsingASM.parse(ClassParserUsingASM.java:110)
[findbugs] At edu.umd.cs.findbugs.classfile.engine.ClassParserUsingASM.parse(ClassParserUsingASM.java:587)
[findbugs] At edu.umd.cs.findbugs.classfile.engine.ClassInfoAnalysisEngine.analyze(ClassInfoAnalysisEngine.java:76)
[findbugs] At edu.umd.cs.findbugs.classfile.engine.ClassInfoAnalysisEngine.analyze(ClassInfoAnalysisEngine.java:38)
[findbugs] At edu.umd.cs.findbugs.classfile.impl.AnalysisCache.getClassAnalysis(AnalysisCache.java:268)
[findbugs] At edu.umd.cs.findbugs.ba.XFactory.getXClass(XFactory.java:652)
[findbugs] At edu.umd.cs.findbugs.ba.AnalysisContext.setAppClassList(AnalysisContext.java:932)
[findbugs] At edu.umd.cs.findbugs.FindBugs2.setAppClassList(FindBugs2.java:997)
[findbugs] At edu.umd.cs.findbugs.FindBugs2.execute(FindBugs2.java:225)
[findbugs] At edu.umd.cs.findbugs.FindBugs.runMain(FindBugs.java:393)
[findbugs] At edu.umd.cs.findbugs.FindBugs2.main(FindBugs2.java:1317)
[findbugs] Couldn't get class info for java/util/function/Function
[findbugs] java.lang.ArrayIndexOutOfBoundsException: 6031
[findbugs] At org.objectweb.asm.ClassReader.<init>(Unknown Source)
[findbugs] At org.objectweb.asm.ClassReader.<init>(Unknown Source)
[findbugs] At edu.umd.cs.findbugs.asm.FBClassReader.<init>(FBClassReader.java:35)
[findbugs] At edu.umd.cs.findbugs.classfile.engine.asm.ClassReaderAnalysisEngine.analyze(ClassReaderAnalysisEngine.java:47)
[findbugs] At edu.umd.cs.findbugs.classfile.engine.asm.ClassReaderAnalysisEngine.analyze(ClassReaderAnalysisEngine.java:34)
[findbugs] At edu.umd.cs.findbugs.classfile.impl.AnalysisCache.getClassAnalysis(AnalysisCache.java:268)
[findbugs] At edu.umd.cs.findbugs.classfile.engine.ClassInfoAnalysisEngine.analyze(ClassInfoAnalysisEngine.java:72)
[findbugs] At edu.umd.cs.findbugs.classfile.engine.ClassInfoAnalysisEngine.analyze(ClassInfoAnalysisEngine.java:38)
[findbugs] At edu.umd.cs.findbugs.classfile.impl.AnalysisCache.getClassAnalysis(AnalysisCache.java:268)
[findbugs] At edu.umd.cs.findbugs.ba.XFactory.getXClass(XFactory.java:652)
[findbugs] At edu.umd.cs.findbugs.ba.AnalysisContext.setAppClassList(AnalysisContext.java:932)
[findbugs] At edu.umd.cs.findbugs.FindBugs2.setAppClassList(FindBugs2.java:997)
[findbugs] At edu.umd.cs.findbugs.FindBugs2.execute(FindBugs2.java:225)
[findbugs] At edu.umd.cs.findbugs.FindBugs.runMain(FindBugs.java:393)
[findbugs] At edu.umd.cs.findbugs.FindBugs2.main(FindBugs2.java:1317)
[findbugs] Couldn't get class info for java/util/function/BiConsumer
[findbugs] java.lang.ArrayIndexOutOfBoundsException: 26947
[findbugs] At org.objectweb.asm.ClassReader.readClass(Unknown Source)
[findbugs] At org.objectweb.asm.ClassReader.accept(Unknown Source)
[findbugs] At edu.umd.cs.findbugs.asm.FBClassReader.accept(FBClassReader.java:44)
[findbugs] At org.objectweb.asm.ClassReader.accept(Unknown Source)
[findbugs] At edu.umd.cs.findbugs.classfile.engine.ClassParserUsingASM.parse(ClassParserUsingASM.java:110)
[findbugs] At edu.umd.cs.findbugs.classfile.engine.ClassParserUsingASM.parse(ClassParserUsingASM.java:587)
[findbugs] At edu.umd.cs.findbugs.classfile.engine.ClassInfoAnalysisEngine.analyze(ClassInfoAnalysisEngine.java:76)
[findbugs] At edu.umd.cs.findbugs.classfile.engine.ClassInfoAnalysisEngine.analyze(ClassInfoAnalysisEngine.java:38)
[findbugs] At edu.umd.cs.findbugs.classfile.impl.AnalysisCache.getClassAnalysis(AnalysisCache.java:268)
[findbugs] At edu.umd.cs.findbugs.ba.XFactory.getXClass(XFactory.java:652)
[findbugs] At edu.umd.cs.findbugs.ba.AnalysisContext.setAppClassList(AnalysisContext.java:932)
[findbugs] At edu.umd.cs.findbugs.FindBugs2.setAppClassList(FindBugs2.java:997)
[findbugs] At edu.umd.cs.findbugs.FindBugs2.execute(FindBugs2.java:225)
[findbugs] At edu.umd.cs.findbugs.FindBugs.runMain(FindBugs.java:393)
[findbugs] At edu.umd.cs.findbugs.FindBugs2.main(FindBugs2.java:1317)
[findbugs] Couldn't get class info for java/util/function/BiFunction
[findbugs] java.lang.ArrayIndexOutOfBoundsException: 26950
[findbugs] At org.objectweb.asm.ClassReader.readClass(Unknown Source)
[findbugs] At org.objectweb.asm.ClassReader.accept(Unknown Source)
[findbugs] At edu.umd.cs.findbugs.asm.FBClassReader.accept(FBClassReader.java:44)
[findbugs] At org.objectweb.asm.ClassReader.accept(Unknown Source)
[findbugs] At edu.umd.cs.findbugs.classfile.engine.ClassParserUsingASM.parse(ClassParserUsingASM.java:110)
[findbugs] At edu.umd.cs.findbugs.classfile.engine.ClassParserUsingASM.parse(ClassParserUsingASM.java:587)
[findbugs] At edu.umd.cs.findbugs.classfile.engine.ClassInfoAnalysisEngine.analyze(ClassInfoAnalysisEngine.java:76)
[findbugs] At edu.umd.cs.findbugs.classfile.engine.ClassInfoAnalysisEngine.analyze(ClassInfoAnalysisEngine.java:38)
[findbugs] At edu.umd.cs.findbugs.classfile.impl.AnalysisCache.getClassAnalysis(AnalysisCache.java:268)
[findbugs] At edu.umd.cs.findbugs.ba.XFactory.getXClass(XFactory.java:652)
[findbugs] At edu.umd.cs.findbugs.ba.AnalysisContext.setAppClassList(AnalysisContext.java:932)
[findbugs] At edu.umd.cs.findbugs.FindBugs2.setAppClassList(FindBugs2.java:997)
[findbugs] At edu.umd.cs.findbugs.FindBugs2.execute(FindBugs2.java:225)
[findbugs] At edu.umd.cs.findbugs.FindBugs.runMain(FindBugs.java:393)
[findbugs] At edu.umd.cs.findbugs.FindBugs2.main(FindBugs2.java:1317)
[findbugs] Couldn't get class info for java/util/Map$Entry
[findbugs] java.lang.ArrayIndexOutOfBoundsException: 9216
[findbugs] At org.objectweb.asm.ClassReader.readClass(Unknown Source)
[findbugs] At org.objectweb.asm.ClassReader.accept(Unknown Source)
[findbugs] At edu.umd.cs.findbugs.asm.FBClassReader.accept(FBClassReader.java:44)
[findbugs] At org.objectweb.asm.ClassReader.accept(Unknown Source)
[findbugs] At edu.umd.cs.findbugs.classfile.engine.ClassParserUsingASM.parse(ClassParserUsingASM.java:110)
[findbugs] At edu.umd.cs.findbugs.classfile.engine.ClassParserUsingASM.parse(ClassParserUsingASM.java:587)
[findbugs] At edu.umd.cs.findbugs.classfile.engine.ClassInfoAnalysisEngine.analyze(ClassInfoAnalysisEngine.java:76)
[findbugs] At edu.umd.cs.findbugs.classfile.engine.ClassInfoAnalysisEngine.analyze(ClassInfoAnalysisEngine.java:38)
[findbugs] At edu.umd.cs.findbugs.classfile.impl.AnalysisCache.getClassAnalysis(AnalysisCache.java:268)
[findbugs] At edu.umd.cs.findbugs.ba.XFactory.getXClass(XFactory.java:652)
[findbugs] At edu.umd.cs.findbugs.ba.ch.Subtypes2.addInheritanceEdge(Subtypes2.java:1260)
[findbugs] At edu.umd.cs.findbugs.ba.ch.Subtypes2.addSupertypeEdges(Subtypes2.java:1233)
[findbugs] At edu.umd.cs.findbugs.ba.ch.Subtypes2.addClassAndGetClassVertex(Subtypes2.java:275)
[findbugs] At edu.umd.cs.findbugs.ba.ch.Subtypes2.addClass(Subtypes2.java:244)
[findbugs] At edu.umd.cs.findbugs.ba.AnalysisContext.setAppClassList(AnalysisContext.java:941)
[findbugs] At edu.umd.cs.findbugs.FindBugs2.setAppClassList(FindBugs2.java:997)
[findbugs] At edu.umd.cs.findbugs.FindBugs2.execute(FindBugs2.java:225)
[findbugs] At edu.umd.cs.findbugs.FindBugs.runMain(FindBugs.java:393)
[findbugs] At edu.umd.cs.findbugs.FindBugs2.main(FindBugs2.java:1317)
[findbugs] Couldn't get class info for java/util/BitSet
[findbugs] java.lang.ArrayIndexOutOfBoundsException
[findbugs] Couldn't get class info for java/util/concurrent/ConcurrentMap
[findbugs] java.lang.ArrayIndexOutOfBoundsException: 28526
[findbugs] At org.objectweb.asm.ClassReader.readClass(Unknown Source)
[findbugs] At org.objectweb.asm.ClassReader.accept(Unknown Source)
[findbugs] At edu.umd.cs.findbugs.asm.FBClassReader.accept(FBClassReader.java:44)
[findbugs] At org.objectweb.asm.ClassReader.accept(Unknown Source)
[findbugs] At edu.umd.cs.findbugs.classfile.engine.ClassParserUsingASM.parse(ClassParserUsingASM.java:110)
[findbugs] At edu.umd.cs.findbugs.classfile.engine.ClassParserUsingASM.parse(ClassParserUsingASM.java:587)
[findbugs] At edu.umd.cs.findbugs.classfile.engine.ClassInfoAnalysisEngine.analyze(ClassInfoAnalysisEngine.java:76)
[findbugs] At edu.umd.cs.findbugs.classfile.engine.ClassInfoAnalysisEngine.analyze(ClassInfoAnalysisEngine.java:38)
[findbugs] At edu.umd.cs.findbugs.classfile.impl.AnalysisCache.getClassAnalysis(AnalysisCache.java:268)
[findbugs] At edu.umd.cs.findbugs.ba.XFactory.getXClass(XFactory.java:652)
[findbugs] At edu.umd.cs.findbugs.ba.AnalysisContext.setAppClassList(AnalysisContext.java:932)
[findbugs] At edu.umd.cs.findbugs.FindBugs2.setAppClassList(FindBugs2.java:997)
[findbugs] At edu.umd.cs.findbugs.FindBugs2.execute(FindBugs2.java:225)
[findbugs] At edu.umd.cs.findbugs.FindBugs.runMain(FindBugs.java:393)
[findbugs] At edu.umd.cs.findbugs.FindBugs2.main(FindBugs2.java:1317)
[findbugs] Couldn't get class info for java/util/Comparator
[findbugs] java.lang.ArrayIndexOutOfBoundsException: 51966
[findbugs] At org.objectweb.asm.ClassReader.readUTF8(Unknown Source)
[findbugs] At org.objectweb.asm.ClassReader.readClass(Unknown Source)
[findbugs] At org.objectweb.asm.ClassReader.accept(Unknown Source)
[findbugs] At edu.umd.cs.findbugs.asm.FBClassReader.accept(FBClassReader.java:44)
[findbugs] At org.objectweb.asm.ClassReader.accept(Unknown Source)
[findbugs] At edu.umd.cs.findbugs.classfile.engine.ClassParserUsingASM.parse(ClassParserUsingASM.java:110)
[findbugs] At edu.umd.cs.findbugs.classfile.engine.ClassParserUsingASM.parse(ClassParserUsingASM.java:587)
[findbugs] At edu.umd.cs.findbugs.classfile.engine.ClassInfoAnalysisEngine.analyze(ClassInfoAnalysisEngine.java:76)
[findbugs] At edu.umd.cs.findbugs.classfile.engine.ClassInfoAnalysisEngine.analyze(ClassInfoAnalysisEngine.java:38)
[findbugs] At edu.umd.cs.findbugs.classfile.impl.AnalysisCache.getClassAnalysis(AnalysisCache.java:268)
[findbugs] At edu.umd.cs.findbugs.FindBugs2.buildReferencedClassSet(FindBugs2.java:891)
[findbugs] At edu.umd.cs.findbugs.FindBugs2.execute(FindBugs2.java:222)
[findbugs] At edu.umd.cs.findbugs.FindBugs.runMain(FindBugs.java:393)
[findbugs] At edu.umd.cs.findbugs.FindBugs2.main(FindBugs2.java:1317)
[findbugs] Couldn't get class info for java/util/Arrays
[findbugs] java.lang.ArrayIndexOutOfBoundsException: 35328
[findbugs] At org.objectweb.asm.ClassReader.accept(Unknown Source)
[findbugs] At edu.umd.cs.findbugs.asm.FBClassReader.accept(FBClassReader.java:44)
[findbugs] At org.objectweb.asm.ClassReader.accept(Unknown Source)
[findbugs] At edu.umd.cs.findbugs.classfile.engine.ClassParserUsingASM.parse(ClassParserUsingASM.java:110)
[findbugs] At edu.umd.cs.findbugs.classfile.engine.ClassParserUsingASM.parse(ClassParserUsingASM.java:587)
[findbugs] At edu.umd.cs.findbugs.classfile.engine.ClassInfoAnalysisEngine.analyze(ClassInfoAnalysisEngine.java:76)
[findbugs] At edu.umd.cs.findbugs.classfile.engine.ClassInfoAnalysisEngine.analyze(ClassInfoAnalysisEngine.java:38)
[findbugs] At edu.umd.cs.findbugs.classfile.impl.AnalysisCache.getClassAnalysis(AnalysisCache.java:268)
[findbugs] At edu.umd.cs.findbugs.ba.XFactory.getXClass(XFactory.java:652)
[findbugs] At edu.umd.cs.findbugs.ba.AnalysisContext.setAppClassList(AnalysisContext.java:932)
[findbugs] At edu.umd.cs.findbugs.FindBugs2.setAppClassList(FindBugs2.java:997)
[findbugs] At edu.umd.cs.findbugs.FindBugs2.execute(FindBugs2.java:225)
[findbugs] At edu.umd.cs.findbugs.FindBugs.runMain(FindBugs.java:393)
[findbugs] At edu.umd.cs.findbugs.FindBugs2.main(FindBugs2.java:1317)
[findbugs] Couldn't get class info for java/lang/CharSequence
[findbugs] java.lang.ArrayIndexOutOfBoundsException: 26721
[findbugs] At org.objectweb.asm.ClassReader.readClass(Unknown Source)
[findbugs] At org.objectweb.asm.ClassReader.accept(Unknown Source)
[findbugs] At edu.umd.cs.findbugs.asm.FBClassReader.accept(FBClassReader.java:44)
[findbugs] At org.objectweb.asm.ClassReader.accept(Unknown Source)
[findbugs] At edu.umd.cs.findbugs.classfile.engine.ClassParserUsingASM.parse(ClassParserUsingASM.java:110)
[findbugs] At edu.umd.cs.findbugs.classfile.engine.ClassParserUsingASM.parse(ClassParserUsingASM.java:587)
[findbugs] At edu.umd.cs.findbugs.classfile.engine.ClassInfoAnalysisEngine.analyze(ClassInfoAnalysisEngine.java:76)
[findbugs] At edu.umd.cs.findbugs.classfile.engine.ClassInfoAnalysisEngine.analyze(ClassInfoAnalysisEngine.java:38)
[findbugs] At edu.umd.cs.findbugs.classfile.impl.AnalysisCache.getClassAnalysis(AnalysisCache.java:268)
[findbugs] At edu.umd.cs.findbugs.ba.XFactory.getXClass(XFactory.java:652)
[findbugs] At edu.umd.cs.findbugs.ba.ch.Subtypes2.addInheritanceEdge(Subtypes2.java:1260)
[findbugs] At edu.umd.cs.findbugs.ba.ch.Subtypes2.addSupertypeEdges(Subtypes2.java:1233)
[findbugs] At edu.umd.cs.findbugs.ba.ch.Subtypes2.addClassAndGetClassVertex(Subtypes2.java:275)
[findbugs] At edu.umd.cs.findbugs.ba.ch.Subtypes2.addClass(Subtypes2.java:244)
[findbugs] At edu.umd.cs.findbugs.ba.AnalysisContext.setAppClassList(AnalysisContext.java:941)
[findbugs] At edu.umd.cs.findbugs.FindBugs2.setAppClassList(FindBugs2.java:997)
[findbugs] At edu.umd.cs.findbugs.FindBugs2.execute(FindBugs2.java:225)
[findbugs] At edu.umd.cs.findbugs.FindBugs.runMain(FindBugs.java:393)
[findbugs] At edu.umd.cs.findbugs.FindBugs2.main(FindBugs2.java:1317)
[findbugs] Couldn't get class info for java/util/TreeMap$EntrySpliterator
[findbugs] java.lang.ArrayIndexOutOfBoundsException: 27753
[findbugs] At org.objectweb.asm.ClassReader.readClass(Unknown Source)
[findbugs] At org.objectweb.asm.ClassReader.accept(Unknown Source)
[findbugs] At edu.umd.cs.findbugs.asm.FBClassReader.accept(FBClassReader.java:44)
[findbugs] At org.objectweb.asm.ClassReader.accept(Unknown Source)
[findbugs] At edu.umd.cs.findbugs.classfile.engine.ClassParserUsingASM.parse(ClassParserUsingASM.java:110)
[findbugs] At edu.umd.cs.findbugs.classfile.engine.ClassParserUsingASM.parse(ClassParserUsingASM.java:587)
[findbugs] At edu.umd.cs.findbugs.classfile.engine.ClassInfoAnalysisEngine.analyze(ClassInfoAnalysisEngine.java:76)
[findbugs] At edu.umd.cs.findbugs.classfile.engine.ClassInfoAnalysisEngine.analyze(ClassInfoAnalysisEngine.java:38)
[findbugs] At edu.umd.cs.findbugs.classfile.impl.AnalysisCache.getClassAnalysis(AnalysisCache.java:268)
[findbugs] At edu.umd.cs.findbugs.ba.XFactory.getXClass(XFactory.java:652)
[findbugs] At edu.umd.cs.findbugs.ba.AnalysisContext.setAppClassList(AnalysisContext.java:932)
[findbugs] At edu.umd.cs.findbugs.FindBugs2.setAppClassList(FindBugs2.java:997)
[findbugs] At edu.umd.cs.findbugs.FindBugs2.execute(FindBugs2.java:225)
[findbugs] At edu.umd.cs.findbugs.FindBugs.runMain(FindBugs.java:393)
[findbugs] At edu.umd.cs.findbugs.FindBugs2.main(FindBugs2.java:1317)
[findbugs] Couldn't get class info for java/util/regex/Pattern
[findbugs] java.lang.ArrayIndexOutOfBoundsException: 1875
[findbugs] At org.objectweb.asm.ClassReader.readClass(Unknown Source)
[findbugs] At org.objectweb.asm.ClassReader.accept(Unknown Source)
[findbugs] At edu.umd.cs.findbugs.asm.FBClassReader.accept(FBClassReader.java:44)
[findbugs] At org.objectweb.asm.ClassReader.accept(Unknown Source)
[findbugs] At edu.umd.cs.findbugs.classfile.engine.ClassParserUsingASM.parse(ClassParserUsingASM.java:110)
[findbugs] At edu.umd.cs.findbugs.classfile.engine.ClassParserUsingASM.parse(ClassParserUsingASM.java:587)
[findbugs] At edu.umd.cs.findbugs.classfile.engine.ClassInfoAnalysisEngine.analyze(ClassInfoAnalysisEngine.java:76)
[findbugs] At edu.umd.cs.findbugs.classfile.engine.ClassInfoAnalysisEngine.analyze(ClassInfoAnalysisEngine.java:38)
[findbugs] At edu.umd.cs.findbugs.classfile.impl.AnalysisCache.getClassAnalysis(AnalysisCache.java:268)
[findbugs] At edu.umd.cs.findbugs.ba.XFactory.getXClass(XFactory.java:652)
[findbugs] At edu.umd.cs.findbugs.ba.AnalysisContext.setAppClassList(AnalysisContext.java:932)
[findbugs] At edu.umd.cs.findbugs.FindBugs2.setAppClassList(FindBugs2.java:997)
[findbugs] At edu.umd.cs.findbugs.FindBugs2.execute(FindBugs2.java:225)
[findbugs] At edu.umd.cs.findbugs.FindBugs.runMain(FindBugs.java:393)
[findbugs] At edu.umd.cs.findbugs.FindBugs2.main(FindBugs2.java:1317)
[findbugs]
[findbugs] java.lang.ArrayIndexOutOfBoundsException: 35328
[findbugs] at org.objectweb.asm.ClassReader.accept(Unknown Source)
[findbugs] at edu.umd.cs.findbugs.asm.FBClassReader.accept(FBClassReader.java:44)
[findbugs] at org.objectweb.asm.ClassReader.accept(Unknown Source)
[findbugs] at edu.umd.cs.findbugs.classfile.engine.ClassParserUsingASM.parse(ClassParserUsingASM.java:110)
[findbugs] at edu.umd.cs.findbugs.classfile.engine.ClassParserUsingASM.parse(ClassParserUsingASM.java:587)
[findbugs] at edu.umd.cs.findbugs.classfile.engine.ClassInfoAnalysisEngine.analyze(ClassInfoAnalysisEngine.java:76)
[findbugs] at edu.umd.cs.findbugs.classfile.engine.ClassInfoAnalysisEngine.analyze(ClassInfoAnalysisEngine.java:38)
[findbugs] at edu.umd.cs.findbugs.classfile.impl.AnalysisCache.getClassAnalysis(AnalysisCache.java:268)
[findbugs] at edu.umd.cs.findbugs.ba.XFactory.getXClass(XFactory.java:652)
[findbugs] at edu.umd.cs.findbugs.ba.AnalysisContext.setAppClassList(AnalysisContext.java:932)
[findbugs] at edu.umd.cs.findbugs.FindBugs2.setAppClassList(FindBugs2.java:997)
[findbugs] at edu.umd.cs.findbugs.FindBugs2.execute(FindBugs2.java:225)
[findbugs] at edu.umd.cs.findbugs.FindBugs.runMain(FindBugs.java:393)
[findbugs] at edu.umd.cs.findbugs.FindBugs2.main(FindBugs2.java:1317)
[findbugs] Java Result: 4
BUILD FAILED
/x1/jenkins/jenkins-slave/workspace/POI-JDK8/build.xml:2161: Execution of findbugs failed.
Total time: 39 minutes 46 seconds
Build step 'Invoke Ant' marked build as failure
[FINDBUGS] Skipping publisher since build result is FAILURE
[WARNINGS] Skipping publisher since build result is FAILURE
Archiving artifacts
Compressed 145.62 MB of artifacts by 36.3% relative to #1190
Recording test results
---------------------------------------------------------------------
To unsubscribe, e-mail: dev-unsubscribe@poi.apache.org
For additional commands, e-mail: dev-help@poi.apache.org
Jenkins build is back to normal : POI-JDK8 #1192
Posted by Apache Jenkins Server <je...@builds.apache.org>.
See <https://builds.apache.org/job/POI-JDK8/1192/>
---------------------------------------------------------------------
To unsubscribe, e-mail: dev-unsubscribe@poi.apache.org
For additional commands, e-mail: dev-help@poi.apache.org