You are viewing a plain text version of this content. The canonical link for it is here.
Posted to builds@solr.apache.org by Policeman Jenkins Server <je...@thetaphi.de> on 2025/12/27 09:13:15 UTC
[JENKINS] Solr-main-Linux (64bit/hotspot/jdk-23.0.2) - Build # 29990 - Unstable!
Build: https://jenkins.thetaphi.de/job/Solr-main-Linux/29990/
Java: 64bit/hotspot/jdk-23.0.2 -XX:-UseCompressedOops -XX:+UseSerialGC
8 tests failed.
FAILED: org.apache.solr.search.vector.KnnQParserChildTest.classMethod
Error Message:
java.lang.AssertionError
Stack Trace:
java.lang.AssertionError
at org.apache.solr.util.RTimer.stop(RTimer.java:84)
at org.apache.solr.metrics.otel.instruments.AttributedLongTimer$MetricTimer.stop(AttributedLongTimer.java:64)
at org.apache.solr.update.SolrIndexWriter.updateMergeMetrics(SolrIndexWriter.java:315)
at org.apache.solr.update.SolrIndexWriter.merge(SolrIndexWriter.java:225)
at org.apache.lucene.index.IndexWriter$IndexWriterMergeSource.merge(IndexWriter.java:6601)
at org.apache.lucene.index.ConcurrentMergeScheduler.doMerge(ConcurrentMergeScheduler.java:668)
at org.apache.lucene.index.ConcurrentMergeScheduler$MergeThread.run(ConcurrentMergeScheduler.java:729)
FAILED: org.apache.solr.search.vector.KnnQParserChildTest.classMethod
Error Message:
java.lang.AssertionError
Stack Trace:
java.lang.AssertionError
at org.apache.solr.util.RTimer.stop(RTimer.java:84)
at org.apache.solr.metrics.otel.instruments.AttributedLongTimer$MetricTimer.stop(AttributedLongTimer.java:64)
at org.apache.solr.update.SolrIndexWriter.updateMergeMetrics(SolrIndexWriter.java:315)
at org.apache.solr.update.SolrIndexWriter.merge(SolrIndexWriter.java:225)
at org.apache.lucene.index.IndexWriter$IndexWriterMergeSource.merge(IndexWriter.java:6601)
at org.apache.lucene.index.ConcurrentMergeScheduler.doMerge(ConcurrentMergeScheduler.java:668)
at org.apache.lucene.index.ConcurrentMergeScheduler$MergeThread.run(ConcurrentMergeScheduler.java:729)
FAILED: org.apache.solr.search.vector.KnnQParserChildTest.classMethod
Error Message:
java.lang.AssertionError: Nodes are added in the incorrect order! Comparing NaN to [0.99964046, 0.999684, 0.99972475, 0.99973977, 0.999763, 0.9997643, 0.9997711, 0.9997831, 0.999794, 0.9998053, 0.99980783, 0.99980974, 0.99980974, 0.9998143, 0.9998385, 0.99983937, 0.9998483, 0.99985164, 0.99986136, 0.99989355, 0.9998944, 0.99990296, 0.99992406, 0.9999318, 0.99994093, 0.99994093, 0.99994093, 0.9999505, 0.9999633, 0.99996614, 0.99996847, 0.99997264, 0.9999741, 0.99997944, 0.9999867, 0.999987, 0.9999878, 0.99998975, 0.99999267, 0.9999931, 0.9999937, 0.9999954, 0.99999774, 0.99999785, 0.9999995, 0.9999999, 0.9999999]
Stack Trace:
java.lang.AssertionError: Nodes are added in the incorrect order! Comparing NaN to [0.99964046, 0.999684, 0.99972475, 0.99973977, 0.999763, 0.9997643, 0.9997711, 0.9997831, 0.999794, 0.9998053, 0.99980783, 0.99980974, 0.99980974, 0.9998143, 0.9998385, 0.99983937, 0.9998483, 0.99985164, 0.99986136, 0.99989355, 0.9998944, 0.99990296, 0.99992406, 0.9999318, 0.99994093, 0.99994093, 0.99994093, 0.9999505, 0.9999633, 0.99996614, 0.99996847, 0.99997264, 0.9999741, 0.99997944, 0.9999867, 0.999987, 0.9999878, 0.99998975, 0.99999267, 0.9999931, 0.9999937, 0.9999954, 0.99999774, 0.99999785, 0.9999995, 0.9999999, 0.9999999]
at org.apache.lucene.util.hnsw.NeighborArray.addInOrder(NeighborArray.java:80)
at org.apache.lucene.util.hnsw.HnswGraphBuilder.popToScratch(HnswGraphBuilder.java:420)
at org.apache.lucene.util.hnsw.HnswGraphBuilder.addGraphNodeInternal(HnswGraphBuilder.java:273)
at org.apache.lucene.util.hnsw.HnswGraphBuilder.addGraphNodeWithEps(HnswGraphBuilder.java:331)
at org.apache.lucene.util.hnsw.MergingHnswGraphBuilder.updateGraph(MergingHnswGraphBuilder.java:177)
at org.apache.lucene.util.hnsw.MergingHnswGraphBuilder.build(MergingHnswGraphBuilder.java:128)
at org.apache.lucene.util.hnsw.IncrementalHnswGraphMerger.merge(IncrementalHnswGraphMerger.java:197)
at org.apache.lucene.codecs.lucene99.Lucene99HnswVectorsWriter.mergeOneField(Lucene99HnswVectorsWriter.java:414)
at org.apache.lucene.codecs.perfield.PerFieldKnnVectorsFormat$FieldsWriter.mergeOneField(PerFieldKnnVectorsFormat.java:126)
at org.apache.lucene.codecs.KnnVectorsWriter.merge(KnnVectorsWriter.java:105)
at org.apache.lucene.index.SegmentMerger.mergeVectorValues(SegmentMerger.java:271)
at org.apache.lucene.index.SegmentMerger.mergeWithLogging(SegmentMerger.java:314)
at org.apache.lucene.index.SegmentMerger.merge(SegmentMerger.java:158)
at org.apache.lucene.index.IndexWriter.mergeMiddle(IndexWriter.java:5317)
at org.apache.lucene.index.IndexWriter.merge(IndexWriter.java:4778)
at org.apache.solr.update.SolrIndexWriter.merge(SolrIndexWriter.java:219)
at org.apache.lucene.index.IndexWriter$IndexWriterMergeSource.merge(IndexWriter.java:6601)
at org.apache.lucene.index.ConcurrentMergeScheduler.doMerge(ConcurrentMergeScheduler.java:668)
at org.apache.lucene.index.ConcurrentMergeScheduler$MergeThread.run(ConcurrentMergeScheduler.java:729)
FAILED: org.apache.solr.search.vector.KnnQParserChildTest.classMethod
Error Message:
java.lang.AssertionError: Nodes are added in the incorrect order! Comparing NaN to [0.99964046, 0.999684, 0.99972475, 0.99973977, 0.999763, 0.9997643, 0.9997711, 0.9997831, 0.999794, 0.9998053, 0.99980783, 0.99980974, 0.99980974, 0.9998143, 0.9998385, 0.99983937, 0.9998483, 0.99985164, 0.99986136, 0.99989355, 0.9998944, 0.99990296, 0.99992406, 0.9999318, 0.99994093, 0.99994093, 0.99994093, 0.9999505, 0.9999633, 0.99996614, 0.99996847, 0.99997264, 0.9999741, 0.99997944, 0.9999867, 0.999987, 0.9999878, 0.99998975, 0.99999267, 0.9999931, 0.9999937, 0.9999954, 0.99999774, 0.99999785, 0.9999995, 0.9999999, 0.9999999]
Stack Trace:
java.lang.AssertionError: Nodes are added in the incorrect order! Comparing NaN to [0.99964046, 0.999684, 0.99972475, 0.99973977, 0.999763, 0.9997643, 0.9997711, 0.9997831, 0.999794, 0.9998053, 0.99980783, 0.99980974, 0.99980974, 0.9998143, 0.9998385, 0.99983937, 0.9998483, 0.99985164, 0.99986136, 0.99989355, 0.9998944, 0.99990296, 0.99992406, 0.9999318, 0.99994093, 0.99994093, 0.99994093, 0.9999505, 0.9999633, 0.99996614, 0.99996847, 0.99997264, 0.9999741, 0.99997944, 0.9999867, 0.999987, 0.9999878, 0.99998975, 0.99999267, 0.9999931, 0.9999937, 0.9999954, 0.99999774, 0.99999785, 0.9999995, 0.9999999, 0.9999999]
at org.apache.lucene.util.hnsw.NeighborArray.addInOrder(NeighborArray.java:80)
at org.apache.lucene.util.hnsw.HnswGraphBuilder.popToScratch(HnswGraphBuilder.java:420)
at org.apache.lucene.util.hnsw.HnswGraphBuilder.addGraphNodeInternal(HnswGraphBuilder.java:273)
at org.apache.lucene.util.hnsw.HnswGraphBuilder.addGraphNodeWithEps(HnswGraphBuilder.java:331)
at org.apache.lucene.util.hnsw.MergingHnswGraphBuilder.updateGraph(MergingHnswGraphBuilder.java:177)
at org.apache.lucene.util.hnsw.MergingHnswGraphBuilder.build(MergingHnswGraphBuilder.java:128)
at org.apache.lucene.util.hnsw.IncrementalHnswGraphMerger.merge(IncrementalHnswGraphMerger.java:197)
at org.apache.lucene.codecs.lucene99.Lucene99HnswVectorsWriter.mergeOneField(Lucene99HnswVectorsWriter.java:414)
at org.apache.lucene.codecs.perfield.PerFieldKnnVectorsFormat$FieldsWriter.mergeOneField(PerFieldKnnVectorsFormat.java:126)
at org.apache.lucene.codecs.KnnVectorsWriter.merge(KnnVectorsWriter.java:105)
at org.apache.lucene.index.SegmentMerger.mergeVectorValues(SegmentMerger.java:271)
at org.apache.lucene.index.SegmentMerger.mergeWithLogging(SegmentMerger.java:314)
at org.apache.lucene.index.SegmentMerger.merge(SegmentMerger.java:158)
at org.apache.lucene.index.IndexWriter.mergeMiddle(IndexWriter.java:5317)
at org.apache.lucene.index.IndexWriter.merge(IndexWriter.java:4778)
at org.apache.solr.update.SolrIndexWriter.merge(SolrIndexWriter.java:219)
at org.apache.lucene.index.IndexWriter$IndexWriterMergeSource.merge(IndexWriter.java:6601)
at org.apache.lucene.index.ConcurrentMergeScheduler.doMerge(ConcurrentMergeScheduler.java:668)
at org.apache.lucene.index.ConcurrentMergeScheduler$MergeThread.run(ConcurrentMergeScheduler.java:729)
FAILED: org.apache.solr.search.vector.KnnQParserChildTest.classMethod
Error Message:
java.lang.AssertionError
Stack Trace:
java.lang.AssertionError
at org.apache.solr.util.RTimer.stop(RTimer.java:84)
at org.apache.solr.metrics.otel.instruments.AttributedLongTimer$MetricTimer.stop(AttributedLongTimer.java:64)
at org.apache.solr.update.SolrIndexWriter.updateMergeMetrics(SolrIndexWriter.java:315)
at org.apache.solr.update.SolrIndexWriter.merge(SolrIndexWriter.java:225)
at org.apache.lucene.index.IndexWriter$IndexWriterMergeSource.merge(IndexWriter.java:6601)
at org.apache.lucene.index.ConcurrentMergeScheduler.doMerge(ConcurrentMergeScheduler.java:668)
at org.apache.lucene.index.ConcurrentMergeScheduler$MergeThread.run(ConcurrentMergeScheduler.java:729)
FAILED: org.apache.solr.search.vector.KnnQParserChildTest.classMethod
Error Message:
java.lang.AssertionError: Nodes are added in the incorrect order! Comparing NaN to [0.99964046, 0.999684, 0.99972475, 0.99973977, 0.999763, 0.9997643, 0.9997711, 0.9997831, 0.999794, 0.9998053, 0.99980783, 0.99980974, 0.99980974, 0.9998143, 0.9998385, 0.99983937, 0.9998483, 0.99985164, 0.99986136, 0.99989355, 0.9998944, 0.99990296, 0.99992406, 0.9999318, 0.99994093, 0.99994093, 0.99994093, 0.9999505, 0.9999633, 0.99996614, 0.99996847, 0.99997264, 0.9999741, 0.99997944, 0.9999867, 0.999987, 0.9999878, 0.99998975, 0.99999267, 0.9999931, 0.9999937, 0.9999954, 0.99999774, 0.99999785, 0.9999995, 0.9999999, 0.9999999]
Stack Trace:
java.lang.AssertionError: Nodes are added in the incorrect order! Comparing NaN to [0.99964046, 0.999684, 0.99972475, 0.99973977, 0.999763, 0.9997643, 0.9997711, 0.9997831, 0.999794, 0.9998053, 0.99980783, 0.99980974, 0.99980974, 0.9998143, 0.9998385, 0.99983937, 0.9998483, 0.99985164, 0.99986136, 0.99989355, 0.9998944, 0.99990296, 0.99992406, 0.9999318, 0.99994093, 0.99994093, 0.99994093, 0.9999505, 0.9999633, 0.99996614, 0.99996847, 0.99997264, 0.9999741, 0.99997944, 0.9999867, 0.999987, 0.9999878, 0.99998975, 0.99999267, 0.9999931, 0.9999937, 0.9999954, 0.99999774, 0.99999785, 0.9999995, 0.9999999, 0.9999999]
at org.apache.lucene.util.hnsw.NeighborArray.addInOrder(NeighborArray.java:80)
at org.apache.lucene.util.hnsw.HnswGraphBuilder.popToScratch(HnswGraphBuilder.java:420)
at org.apache.lucene.util.hnsw.HnswGraphBuilder.addGraphNodeInternal(HnswGraphBuilder.java:273)
at org.apache.lucene.util.hnsw.HnswGraphBuilder.addGraphNodeWithEps(HnswGraphBuilder.java:331)
at org.apache.lucene.util.hnsw.MergingHnswGraphBuilder.updateGraph(MergingHnswGraphBuilder.java:177)
at org.apache.lucene.util.hnsw.MergingHnswGraphBuilder.build(MergingHnswGraphBuilder.java:128)
at org.apache.lucene.util.hnsw.IncrementalHnswGraphMerger.merge(IncrementalHnswGraphMerger.java:197)
at org.apache.lucene.codecs.lucene99.Lucene99HnswVectorsWriter.mergeOneField(Lucene99HnswVectorsWriter.java:414)
at org.apache.lucene.codecs.perfield.PerFieldKnnVectorsFormat$FieldsWriter.mergeOneField(PerFieldKnnVectorsFormat.java:126)
at org.apache.lucene.codecs.KnnVectorsWriter.merge(KnnVectorsWriter.java:105)
at org.apache.lucene.index.SegmentMerger.mergeVectorValues(SegmentMerger.java:271)
at org.apache.lucene.index.SegmentMerger.mergeWithLogging(SegmentMerger.java:314)
at org.apache.lucene.index.SegmentMerger.merge(SegmentMerger.java:158)
at org.apache.lucene.index.IndexWriter.mergeMiddle(IndexWriter.java:5317)
at org.apache.lucene.index.IndexWriter.merge(IndexWriter.java:4778)
at org.apache.solr.update.SolrIndexWriter.merge(SolrIndexWriter.java:219)
at org.apache.lucene.index.IndexWriter$IndexWriterMergeSource.merge(IndexWriter.java:6601)
at org.apache.lucene.index.ConcurrentMergeScheduler.doMerge(ConcurrentMergeScheduler.java:668)
at org.apache.lucene.index.ConcurrentMergeScheduler$MergeThread.run(ConcurrentMergeScheduler.java:729)
FAILED: org.apache.solr.search.vector.KnnQParserChildTest.classMethod
Error Message:
java.lang.AssertionError: Nodes are added in the incorrect order! Comparing NaN to [0.99964046, 0.999684, 0.99972475, 0.99973977, 0.999763, 0.9997643, 0.9997711, 0.9997831, 0.999794, 0.9998053, 0.99980783, 0.99980974, 0.99980974, 0.9998143, 0.9998385, 0.99983937, 0.9998483, 0.99985164, 0.99986136, 0.99989355, 0.9998944, 0.99990296, 0.99992406, 0.9999318, 0.99994093, 0.99994093, 0.99994093, 0.9999505, 0.9999633, 0.99996614, 0.99996847, 0.99997264, 0.9999741, 0.99997944, 0.9999867, 0.999987, 0.9999878, 0.99998975, 0.99999267, 0.9999931, 0.9999937, 0.9999954, 0.99999774, 0.99999785, 0.9999995, 0.9999999, 0.9999999]
Stack Trace:
java.lang.AssertionError: Nodes are added in the incorrect order! Comparing NaN to [0.99964046, 0.999684, 0.99972475, 0.99973977, 0.999763, 0.9997643, 0.9997711, 0.9997831, 0.999794, 0.9998053, 0.99980783, 0.99980974, 0.99980974, 0.9998143, 0.9998385, 0.99983937, 0.9998483, 0.99985164, 0.99986136, 0.99989355, 0.9998944, 0.99990296, 0.99992406, 0.9999318, 0.99994093, 0.99994093, 0.99994093, 0.9999505, 0.9999633, 0.99996614, 0.99996847, 0.99997264, 0.9999741, 0.99997944, 0.9999867, 0.999987, 0.9999878, 0.99998975, 0.99999267, 0.9999931, 0.9999937, 0.9999954, 0.99999774, 0.99999785, 0.9999995, 0.9999999, 0.9999999]
at org.apache.lucene.util.hnsw.NeighborArray.addInOrder(NeighborArray.java:80)
at org.apache.lucene.util.hnsw.HnswGraphBuilder.popToScratch(HnswGraphBuilder.java:420)
at org.apache.lucene.util.hnsw.HnswGraphBuilder.addGraphNodeInternal(HnswGraphBuilder.java:273)
at org.apache.lucene.util.hnsw.HnswGraphBuilder.addGraphNodeWithEps(HnswGraphBuilder.java:331)
at org.apache.lucene.util.hnsw.MergingHnswGraphBuilder.updateGraph(MergingHnswGraphBuilder.java:177)
at org.apache.lucene.util.hnsw.MergingHnswGraphBuilder.build(MergingHnswGraphBuilder.java:128)
at org.apache.lucene.util.hnsw.IncrementalHnswGraphMerger.merge(IncrementalHnswGraphMerger.java:197)
at org.apache.lucene.codecs.lucene99.Lucene99HnswVectorsWriter.mergeOneField(Lucene99HnswVectorsWriter.java:414)
at org.apache.lucene.codecs.perfield.PerFieldKnnVectorsFormat$FieldsWriter.mergeOneField(PerFieldKnnVectorsFormat.java:126)
at org.apache.lucene.codecs.KnnVectorsWriter.merge(KnnVectorsWriter.java:105)
at org.apache.lucene.index.SegmentMerger.mergeVectorValues(SegmentMerger.java:271)
at org.apache.lucene.index.SegmentMerger.mergeWithLogging(SegmentMerger.java:314)
at org.apache.lucene.index.SegmentMerger.merge(SegmentMerger.java:158)
at org.apache.lucene.index.IndexWriter.mergeMiddle(IndexWriter.java:5317)
at org.apache.lucene.index.IndexWriter.merge(IndexWriter.java:4778)
at org.apache.solr.update.SolrIndexWriter.merge(SolrIndexWriter.java:219)
at org.apache.lucene.index.IndexWriter$IndexWriterMergeSource.merge(IndexWriter.java:6601)
at org.apache.lucene.index.ConcurrentMergeScheduler.doMerge(ConcurrentMergeScheduler.java:668)
at org.apache.lucene.index.ConcurrentMergeScheduler$MergeThread.run(ConcurrentMergeScheduler.java:729)
FAILED: org.apache.solr.search.vector.KnnQParserChildTest.classMethod
Error Message:
java.lang.AssertionError
Stack Trace:
java.lang.AssertionError
at org.apache.solr.util.RTimer.stop(RTimer.java:84)
at org.apache.solr.metrics.otel.instruments.AttributedLongTimer$MetricTimer.stop(AttributedLongTimer.java:64)
at org.apache.solr.update.SolrIndexWriter.updateMergeMetrics(SolrIndexWriter.java:315)
at org.apache.solr.update.SolrIndexWriter.merge(SolrIndexWriter.java:225)
at org.apache.lucene.index.IndexWriter$IndexWriterMergeSource.merge(IndexWriter.java:6601)
at org.apache.lucene.index.ConcurrentMergeScheduler.doMerge(ConcurrentMergeScheduler.java:668)
at org.apache.lucene.index.ConcurrentMergeScheduler$MergeThread.run(ConcurrentMergeScheduler.java:729)
[JENKINS] Solr-main-Linux (64bit/hotspot/jdk-24) - Build # 29995 - Still Unstable!
Posted by Policeman Jenkins Server <je...@thetaphi.de>.
Build: https://jenkins.thetaphi.de/job/Solr-main-Linux/29995/
Java: 64bit/hotspot/jdk-24 -XX:-UseCompressedOops -XX:+UseSerialGC
8 tests failed.
FAILED: org.apache.solr.search.vector.KnnQParserChildTest.classMethod
Error Message:
java.lang.AssertionError: Nodes are added in the incorrect order! Comparing NaN to [NaN]
Stack Trace:
java.lang.AssertionError: Nodes are added in the incorrect order! Comparing NaN to [NaN]
at org.apache.lucene.util.hnsw.NeighborArray.addInOrder(NeighborArray.java:80)
at org.apache.lucene.util.hnsw.HnswGraphBuilder.popToScratch(HnswGraphBuilder.java:420)
at org.apache.lucene.util.hnsw.HnswGraphBuilder.addGraphNodeInternal(HnswGraphBuilder.java:273)
at org.apache.lucene.util.hnsw.HnswGraphBuilder.addGraphNodeWithEps(HnswGraphBuilder.java:331)
at org.apache.lucene.util.hnsw.MergingHnswGraphBuilder.updateGraph(MergingHnswGraphBuilder.java:177)
at org.apache.lucene.util.hnsw.MergingHnswGraphBuilder.build(MergingHnswGraphBuilder.java:128)
at org.apache.lucene.util.hnsw.IncrementalHnswGraphMerger.merge(IncrementalHnswGraphMerger.java:197)
at org.apache.lucene.codecs.lucene99.Lucene99HnswVectorsWriter.mergeOneField(Lucene99HnswVectorsWriter.java:414)
at org.apache.lucene.codecs.perfield.PerFieldKnnVectorsFormat$FieldsWriter.mergeOneField(PerFieldKnnVectorsFormat.java:126)
at org.apache.lucene.codecs.KnnVectorsWriter.merge(KnnVectorsWriter.java:105)
at org.apache.lucene.index.SegmentMerger.mergeVectorValues(SegmentMerger.java:271)
at org.apache.lucene.index.SegmentMerger.mergeWithLogging(SegmentMerger.java:314)
at org.apache.lucene.index.SegmentMerger.merge(SegmentMerger.java:158)
at org.apache.lucene.index.IndexWriter.mergeMiddle(IndexWriter.java:5317)
at org.apache.lucene.index.IndexWriter.merge(IndexWriter.java:4778)
at org.apache.solr.update.SolrIndexWriter.merge(SolrIndexWriter.java:219)
at org.apache.lucene.index.IndexWriter$IndexWriterMergeSource.merge(IndexWriter.java:6601)
at org.apache.lucene.index.ConcurrentMergeScheduler.doMerge(ConcurrentMergeScheduler.java:668)
at org.apache.lucene.index.ConcurrentMergeScheduler$MergeThread.run(ConcurrentMergeScheduler.java:729)
FAILED: org.apache.solr.search.vector.KnnQParserChildTest.classMethod
Error Message:
java.lang.AssertionError: Nodes are added in the incorrect order! Comparing NaN to [NaN]
Stack Trace:
java.lang.AssertionError: Nodes are added in the incorrect order! Comparing NaN to [NaN]
at org.apache.lucene.util.hnsw.NeighborArray.addInOrder(NeighborArray.java:80)
at org.apache.lucene.util.hnsw.HnswGraphBuilder.popToScratch(HnswGraphBuilder.java:420)
at org.apache.lucene.util.hnsw.HnswGraphBuilder.addGraphNodeInternal(HnswGraphBuilder.java:273)
at org.apache.lucene.util.hnsw.HnswGraphBuilder.addGraphNodeWithEps(HnswGraphBuilder.java:331)
at org.apache.lucene.util.hnsw.MergingHnswGraphBuilder.updateGraph(MergingHnswGraphBuilder.java:177)
at org.apache.lucene.util.hnsw.MergingHnswGraphBuilder.build(MergingHnswGraphBuilder.java:128)
at org.apache.lucene.util.hnsw.IncrementalHnswGraphMerger.merge(IncrementalHnswGraphMerger.java:197)
at org.apache.lucene.codecs.lucene99.Lucene99HnswVectorsWriter.mergeOneField(Lucene99HnswVectorsWriter.java:414)
at org.apache.lucene.codecs.perfield.PerFieldKnnVectorsFormat$FieldsWriter.mergeOneField(PerFieldKnnVectorsFormat.java:126)
at org.apache.lucene.codecs.KnnVectorsWriter.merge(KnnVectorsWriter.java:105)
at org.apache.lucene.index.SegmentMerger.mergeVectorValues(SegmentMerger.java:271)
at org.apache.lucene.index.SegmentMerger.mergeWithLogging(SegmentMerger.java:314)
at org.apache.lucene.index.SegmentMerger.merge(SegmentMerger.java:158)
at org.apache.lucene.index.IndexWriter.mergeMiddle(IndexWriter.java:5317)
at org.apache.lucene.index.IndexWriter.merge(IndexWriter.java:4778)
at org.apache.solr.update.SolrIndexWriter.merge(SolrIndexWriter.java:219)
at org.apache.lucene.index.IndexWriter$IndexWriterMergeSource.merge(IndexWriter.java:6601)
at org.apache.lucene.index.ConcurrentMergeScheduler.doMerge(ConcurrentMergeScheduler.java:668)
at org.apache.lucene.index.ConcurrentMergeScheduler$MergeThread.run(ConcurrentMergeScheduler.java:729)
FAILED: org.apache.solr.search.vector.KnnQParserChildTest.classMethod
Error Message:
java.lang.AssertionError: Nodes are added in the incorrect order! Comparing NaN to [NaN]
Stack Trace:
java.lang.AssertionError: Nodes are added in the incorrect order! Comparing NaN to [NaN]
at org.apache.lucene.util.hnsw.NeighborArray.addInOrder(NeighborArray.java:80)
at org.apache.lucene.util.hnsw.HnswGraphBuilder.popToScratch(HnswGraphBuilder.java:420)
at org.apache.lucene.util.hnsw.HnswGraphBuilder.addGraphNodeInternal(HnswGraphBuilder.java:273)
at org.apache.lucene.util.hnsw.HnswGraphBuilder.addGraphNodeWithEps(HnswGraphBuilder.java:331)
at org.apache.lucene.util.hnsw.MergingHnswGraphBuilder.updateGraph(MergingHnswGraphBuilder.java:177)
at org.apache.lucene.util.hnsw.MergingHnswGraphBuilder.build(MergingHnswGraphBuilder.java:128)
at org.apache.lucene.util.hnsw.IncrementalHnswGraphMerger.merge(IncrementalHnswGraphMerger.java:197)
at org.apache.lucene.codecs.lucene99.Lucene99HnswVectorsWriter.mergeOneField(Lucene99HnswVectorsWriter.java:414)
at org.apache.lucene.codecs.perfield.PerFieldKnnVectorsFormat$FieldsWriter.mergeOneField(PerFieldKnnVectorsFormat.java:126)
at org.apache.lucene.codecs.KnnVectorsWriter.merge(KnnVectorsWriter.java:105)
at org.apache.lucene.index.SegmentMerger.mergeVectorValues(SegmentMerger.java:271)
at org.apache.lucene.index.SegmentMerger.mergeWithLogging(SegmentMerger.java:314)
at org.apache.lucene.index.SegmentMerger.merge(SegmentMerger.java:158)
at org.apache.lucene.index.IndexWriter.mergeMiddle(IndexWriter.java:5317)
at org.apache.lucene.index.IndexWriter.merge(IndexWriter.java:4778)
at org.apache.solr.update.SolrIndexWriter.merge(SolrIndexWriter.java:219)
at org.apache.lucene.index.IndexWriter$IndexWriterMergeSource.merge(IndexWriter.java:6601)
at org.apache.lucene.index.ConcurrentMergeScheduler.doMerge(ConcurrentMergeScheduler.java:668)
at org.apache.lucene.index.ConcurrentMergeScheduler$MergeThread.run(ConcurrentMergeScheduler.java:729)
FAILED: org.apache.solr.search.vector.KnnQParserChildTest.classMethod
Error Message:
java.lang.AssertionError
Stack Trace:
java.lang.AssertionError
at org.apache.solr.util.RTimer.stop(RTimer.java:84)
at org.apache.solr.metrics.otel.instruments.AttributedLongTimer$MetricTimer.stop(AttributedLongTimer.java:64)
at org.apache.solr.update.SolrIndexWriter.updateMergeMetrics(SolrIndexWriter.java:315)
at org.apache.solr.update.SolrIndexWriter.merge(SolrIndexWriter.java:225)
at org.apache.lucene.index.IndexWriter$IndexWriterMergeSource.merge(IndexWriter.java:6601)
at org.apache.lucene.index.ConcurrentMergeScheduler.doMerge(ConcurrentMergeScheduler.java:668)
at org.apache.lucene.index.ConcurrentMergeScheduler$MergeThread.run(ConcurrentMergeScheduler.java:729)
FAILED: org.apache.solr.search.vector.KnnQParserChildTest.classMethod
Error Message:
java.lang.AssertionError: Nodes are added in the incorrect order! Comparing NaN to [NaN]
Stack Trace:
java.lang.AssertionError: Nodes are added in the incorrect order! Comparing NaN to [NaN]
at org.apache.lucene.util.hnsw.NeighborArray.addInOrder(NeighborArray.java:80)
at org.apache.lucene.util.hnsw.HnswGraphBuilder.popToScratch(HnswGraphBuilder.java:420)
at org.apache.lucene.util.hnsw.HnswGraphBuilder.addGraphNodeInternal(HnswGraphBuilder.java:273)
at org.apache.lucene.util.hnsw.HnswGraphBuilder.addGraphNodeWithEps(HnswGraphBuilder.java:331)
at org.apache.lucene.util.hnsw.MergingHnswGraphBuilder.updateGraph(MergingHnswGraphBuilder.java:177)
at org.apache.lucene.util.hnsw.MergingHnswGraphBuilder.build(MergingHnswGraphBuilder.java:128)
at org.apache.lucene.util.hnsw.IncrementalHnswGraphMerger.merge(IncrementalHnswGraphMerger.java:197)
at org.apache.lucene.codecs.lucene99.Lucene99HnswVectorsWriter.mergeOneField(Lucene99HnswVectorsWriter.java:414)
at org.apache.lucene.codecs.perfield.PerFieldKnnVectorsFormat$FieldsWriter.mergeOneField(PerFieldKnnVectorsFormat.java:126)
at org.apache.lucene.codecs.KnnVectorsWriter.merge(KnnVectorsWriter.java:105)
at org.apache.lucene.index.SegmentMerger.mergeVectorValues(SegmentMerger.java:271)
at org.apache.lucene.index.SegmentMerger.mergeWithLogging(SegmentMerger.java:314)
at org.apache.lucene.index.SegmentMerger.merge(SegmentMerger.java:158)
at org.apache.lucene.index.IndexWriter.mergeMiddle(IndexWriter.java:5317)
at org.apache.lucene.index.IndexWriter.merge(IndexWriter.java:4778)
at org.apache.solr.update.SolrIndexWriter.merge(SolrIndexWriter.java:219)
at org.apache.lucene.index.IndexWriter$IndexWriterMergeSource.merge(IndexWriter.java:6601)
at org.apache.lucene.index.ConcurrentMergeScheduler.doMerge(ConcurrentMergeScheduler.java:668)
at org.apache.lucene.index.ConcurrentMergeScheduler$MergeThread.run(ConcurrentMergeScheduler.java:729)
FAILED: org.apache.solr.search.vector.KnnQParserChildTest.classMethod
Error Message:
java.lang.AssertionError
Stack Trace:
java.lang.AssertionError
at org.apache.solr.util.RTimer.stop(RTimer.java:84)
at org.apache.solr.metrics.otel.instruments.AttributedLongTimer$MetricTimer.stop(AttributedLongTimer.java:64)
at org.apache.solr.update.SolrIndexWriter.updateMergeMetrics(SolrIndexWriter.java:315)
at org.apache.solr.update.SolrIndexWriter.merge(SolrIndexWriter.java:225)
at org.apache.lucene.index.IndexWriter$IndexWriterMergeSource.merge(IndexWriter.java:6601)
at org.apache.lucene.index.ConcurrentMergeScheduler.doMerge(ConcurrentMergeScheduler.java:668)
at org.apache.lucene.index.ConcurrentMergeScheduler$MergeThread.run(ConcurrentMergeScheduler.java:729)
FAILED: org.apache.solr.search.vector.KnnQParserChildTest.classMethod
Error Message:
java.lang.AssertionError
Stack Trace:
java.lang.AssertionError
at org.apache.solr.util.RTimer.stop(RTimer.java:84)
at org.apache.solr.metrics.otel.instruments.AttributedLongTimer$MetricTimer.stop(AttributedLongTimer.java:64)
at org.apache.solr.update.SolrIndexWriter.updateMergeMetrics(SolrIndexWriter.java:315)
at org.apache.solr.update.SolrIndexWriter.merge(SolrIndexWriter.java:225)
at org.apache.lucene.index.IndexWriter$IndexWriterMergeSource.merge(IndexWriter.java:6601)
at org.apache.lucene.index.ConcurrentMergeScheduler.doMerge(ConcurrentMergeScheduler.java:668)
at org.apache.lucene.index.ConcurrentMergeScheduler$MergeThread.run(ConcurrentMergeScheduler.java:729)
FAILED: org.apache.solr.search.vector.KnnQParserChildTest.classMethod
Error Message:
java.lang.AssertionError
Stack Trace:
java.lang.AssertionError
at org.apache.solr.util.RTimer.stop(RTimer.java:84)
at org.apache.solr.metrics.otel.instruments.AttributedLongTimer$MetricTimer.stop(AttributedLongTimer.java:64)
at org.apache.solr.update.SolrIndexWriter.updateMergeMetrics(SolrIndexWriter.java:315)
at org.apache.solr.update.SolrIndexWriter.merge(SolrIndexWriter.java:225)
at org.apache.lucene.index.IndexWriter$IndexWriterMergeSource.merge(IndexWriter.java:6601)
at org.apache.lucene.index.ConcurrentMergeScheduler.doMerge(ConcurrentMergeScheduler.java:668)
at org.apache.lucene.index.ConcurrentMergeScheduler$MergeThread.run(ConcurrentMergeScheduler.java:729)
[JENKINS] Solr-main-Linux (64bit/hotspot/jdk-25) - Build # 29994 - Still Unstable!
Posted by Policeman Jenkins Server <je...@thetaphi.de>.
Build: https://jenkins.thetaphi.de/job/Solr-main-Linux/29994/
Java: 64bit/hotspot/jdk-25 -XX:-UseCompressedOops -XX:+UseG1GC
8 tests failed.
FAILED: org.apache.solr.search.vector.KnnQParserChildTest.classMethod
Error Message:
java.lang.AssertionError
Stack Trace:
java.lang.AssertionError
at org.apache.solr.util.RTimer.stop(RTimer.java:84)
at org.apache.solr.metrics.otel.instruments.AttributedLongTimer$MetricTimer.stop(AttributedLongTimer.java:64)
at org.apache.solr.update.SolrIndexWriter.updateMergeMetrics(SolrIndexWriter.java:315)
at org.apache.solr.update.SolrIndexWriter.merge(SolrIndexWriter.java:225)
at org.apache.lucene.index.IndexWriter$IndexWriterMergeSource.merge(IndexWriter.java:6601)
at org.apache.lucene.index.ConcurrentMergeScheduler.doMerge(ConcurrentMergeScheduler.java:668)
at org.apache.lucene.index.ConcurrentMergeScheduler$MergeThread.run(ConcurrentMergeScheduler.java:729)
FAILED: org.apache.solr.search.vector.KnnQParserChildTest.classMethod
Error Message:
java.lang.AssertionError
Stack Trace:
java.lang.AssertionError
at org.apache.solr.util.RTimer.stop(RTimer.java:84)
at org.apache.solr.metrics.otel.instruments.AttributedLongTimer$MetricTimer.stop(AttributedLongTimer.java:64)
at org.apache.solr.update.SolrIndexWriter.updateMergeMetrics(SolrIndexWriter.java:315)
at org.apache.solr.update.SolrIndexWriter.merge(SolrIndexWriter.java:225)
at org.apache.lucene.index.IndexWriter$IndexWriterMergeSource.merge(IndexWriter.java:6601)
at org.apache.lucene.index.ConcurrentMergeScheduler.doMerge(ConcurrentMergeScheduler.java:668)
at org.apache.lucene.index.ConcurrentMergeScheduler$MergeThread.run(ConcurrentMergeScheduler.java:729)
FAILED: org.apache.solr.search.vector.KnnQParserChildTest.classMethod
Error Message:
java.lang.AssertionError
Stack Trace:
java.lang.AssertionError
at org.apache.solr.util.RTimer.stop(RTimer.java:84)
at org.apache.solr.metrics.otel.instruments.AttributedLongTimer$MetricTimer.stop(AttributedLongTimer.java:64)
at org.apache.solr.update.SolrIndexWriter.updateMergeMetrics(SolrIndexWriter.java:315)
at org.apache.solr.update.SolrIndexWriter.merge(SolrIndexWriter.java:225)
at org.apache.lucene.index.IndexWriter$IndexWriterMergeSource.merge(IndexWriter.java:6601)
at org.apache.lucene.index.ConcurrentMergeScheduler.doMerge(ConcurrentMergeScheduler.java:668)
at org.apache.lucene.index.ConcurrentMergeScheduler$MergeThread.run(ConcurrentMergeScheduler.java:729)
FAILED: org.apache.solr.search.vector.KnnQParserChildTest.classMethod
Error Message:
java.lang.AssertionError
Stack Trace:
java.lang.AssertionError
at org.apache.solr.util.RTimer.stop(RTimer.java:84)
at org.apache.solr.metrics.otel.instruments.AttributedLongTimer$MetricTimer.stop(AttributedLongTimer.java:64)
at org.apache.solr.update.SolrIndexWriter.updateMergeMetrics(SolrIndexWriter.java:315)
at org.apache.solr.update.SolrIndexWriter.merge(SolrIndexWriter.java:225)
at org.apache.lucene.index.IndexWriter$IndexWriterMergeSource.merge(IndexWriter.java:6601)
at org.apache.lucene.index.ConcurrentMergeScheduler.doMerge(ConcurrentMergeScheduler.java:668)
at org.apache.lucene.index.ConcurrentMergeScheduler$MergeThread.run(ConcurrentMergeScheduler.java:729)
FAILED: org.apache.solr.search.vector.KnnQParserChildTest.classMethod
Error Message:
java.lang.AssertionError: Nodes are added in the incorrect order! Comparing NaN to [NaN]
Stack Trace:
java.lang.AssertionError: Nodes are added in the incorrect order! Comparing NaN to [NaN]
at org.apache.lucene.util.hnsw.NeighborArray.addInOrder(NeighborArray.java:80)
at org.apache.lucene.util.hnsw.HnswGraphBuilder.popToScratch(HnswGraphBuilder.java:420)
at org.apache.lucene.util.hnsw.HnswGraphBuilder.addGraphNodeInternal(HnswGraphBuilder.java:273)
at org.apache.lucene.util.hnsw.HnswGraphBuilder.addGraphNodeWithEps(HnswGraphBuilder.java:331)
at org.apache.lucene.util.hnsw.MergingHnswGraphBuilder.updateGraph(MergingHnswGraphBuilder.java:177)
at org.apache.lucene.util.hnsw.MergingHnswGraphBuilder.build(MergingHnswGraphBuilder.java:128)
at org.apache.lucene.util.hnsw.IncrementalHnswGraphMerger.merge(IncrementalHnswGraphMerger.java:197)
at org.apache.lucene.codecs.lucene99.Lucene99HnswVectorsWriter.mergeOneField(Lucene99HnswVectorsWriter.java:414)
at org.apache.lucene.codecs.perfield.PerFieldKnnVectorsFormat$FieldsWriter.mergeOneField(PerFieldKnnVectorsFormat.java:126)
at org.apache.lucene.codecs.KnnVectorsWriter.merge(KnnVectorsWriter.java:105)
at org.apache.lucene.index.SegmentMerger.mergeVectorValues(SegmentMerger.java:271)
at org.apache.lucene.index.SegmentMerger.mergeWithLogging(SegmentMerger.java:314)
at org.apache.lucene.index.SegmentMerger.merge(SegmentMerger.java:158)
at org.apache.lucene.index.IndexWriter.mergeMiddle(IndexWriter.java:5317)
at org.apache.lucene.index.IndexWriter.merge(IndexWriter.java:4778)
at org.apache.solr.update.SolrIndexWriter.merge(SolrIndexWriter.java:219)
at org.apache.lucene.index.IndexWriter$IndexWriterMergeSource.merge(IndexWriter.java:6601)
at org.apache.lucene.index.ConcurrentMergeScheduler.doMerge(ConcurrentMergeScheduler.java:668)
at org.apache.lucene.index.ConcurrentMergeScheduler$MergeThread.run(ConcurrentMergeScheduler.java:729)
FAILED: org.apache.solr.search.vector.KnnQParserChildTest.classMethod
Error Message:
java.lang.AssertionError: Nodes are added in the incorrect order! Comparing NaN to [NaN]
Stack Trace:
java.lang.AssertionError: Nodes are added in the incorrect order! Comparing NaN to [NaN]
at org.apache.lucene.util.hnsw.NeighborArray.addInOrder(NeighborArray.java:80)
at org.apache.lucene.util.hnsw.HnswGraphBuilder.popToScratch(HnswGraphBuilder.java:420)
at org.apache.lucene.util.hnsw.HnswGraphBuilder.addGraphNodeInternal(HnswGraphBuilder.java:273)
at org.apache.lucene.util.hnsw.HnswGraphBuilder.addGraphNodeWithEps(HnswGraphBuilder.java:331)
at org.apache.lucene.util.hnsw.MergingHnswGraphBuilder.updateGraph(MergingHnswGraphBuilder.java:177)
at org.apache.lucene.util.hnsw.MergingHnswGraphBuilder.build(MergingHnswGraphBuilder.java:128)
at org.apache.lucene.util.hnsw.IncrementalHnswGraphMerger.merge(IncrementalHnswGraphMerger.java:197)
at org.apache.lucene.codecs.lucene99.Lucene99HnswVectorsWriter.mergeOneField(Lucene99HnswVectorsWriter.java:414)
at org.apache.lucene.codecs.perfield.PerFieldKnnVectorsFormat$FieldsWriter.mergeOneField(PerFieldKnnVectorsFormat.java:126)
at org.apache.lucene.codecs.KnnVectorsWriter.merge(KnnVectorsWriter.java:105)
at org.apache.lucene.index.SegmentMerger.mergeVectorValues(SegmentMerger.java:271)
at org.apache.lucene.index.SegmentMerger.mergeWithLogging(SegmentMerger.java:314)
at org.apache.lucene.index.SegmentMerger.merge(SegmentMerger.java:158)
at org.apache.lucene.index.IndexWriter.mergeMiddle(IndexWriter.java:5317)
at org.apache.lucene.index.IndexWriter.merge(IndexWriter.java:4778)
at org.apache.solr.update.SolrIndexWriter.merge(SolrIndexWriter.java:219)
at org.apache.lucene.index.IndexWriter$IndexWriterMergeSource.merge(IndexWriter.java:6601)
at org.apache.lucene.index.ConcurrentMergeScheduler.doMerge(ConcurrentMergeScheduler.java:668)
at org.apache.lucene.index.ConcurrentMergeScheduler$MergeThread.run(ConcurrentMergeScheduler.java:729)
FAILED: org.apache.solr.search.vector.KnnQParserChildTest.classMethod
Error Message:
java.lang.AssertionError: Nodes are added in the incorrect order! Comparing NaN to [NaN]
Stack Trace:
java.lang.AssertionError: Nodes are added in the incorrect order! Comparing NaN to [NaN]
at org.apache.lucene.util.hnsw.NeighborArray.addInOrder(NeighborArray.java:80)
at org.apache.lucene.util.hnsw.HnswGraphBuilder.popToScratch(HnswGraphBuilder.java:420)
at org.apache.lucene.util.hnsw.HnswGraphBuilder.addGraphNodeInternal(HnswGraphBuilder.java:273)
at org.apache.lucene.util.hnsw.HnswGraphBuilder.addGraphNodeWithEps(HnswGraphBuilder.java:331)
at org.apache.lucene.util.hnsw.MergingHnswGraphBuilder.updateGraph(MergingHnswGraphBuilder.java:177)
at org.apache.lucene.util.hnsw.MergingHnswGraphBuilder.build(MergingHnswGraphBuilder.java:128)
at org.apache.lucene.util.hnsw.IncrementalHnswGraphMerger.merge(IncrementalHnswGraphMerger.java:197)
at org.apache.lucene.codecs.lucene99.Lucene99HnswVectorsWriter.mergeOneField(Lucene99HnswVectorsWriter.java:414)
at org.apache.lucene.codecs.perfield.PerFieldKnnVectorsFormat$FieldsWriter.mergeOneField(PerFieldKnnVectorsFormat.java:126)
at org.apache.lucene.codecs.KnnVectorsWriter.merge(KnnVectorsWriter.java:105)
at org.apache.lucene.index.SegmentMerger.mergeVectorValues(SegmentMerger.java:271)
at org.apache.lucene.index.SegmentMerger.mergeWithLogging(SegmentMerger.java:314)
at org.apache.lucene.index.SegmentMerger.merge(SegmentMerger.java:158)
at org.apache.lucene.index.IndexWriter.mergeMiddle(IndexWriter.java:5317)
at org.apache.lucene.index.IndexWriter.merge(IndexWriter.java:4778)
at org.apache.solr.update.SolrIndexWriter.merge(SolrIndexWriter.java:219)
at org.apache.lucene.index.IndexWriter$IndexWriterMergeSource.merge(IndexWriter.java:6601)
at org.apache.lucene.index.ConcurrentMergeScheduler.doMerge(ConcurrentMergeScheduler.java:668)
at org.apache.lucene.index.ConcurrentMergeScheduler$MergeThread.run(ConcurrentMergeScheduler.java:729)
FAILED: org.apache.solr.search.vector.KnnQParserChildTest.classMethod
Error Message:
java.lang.AssertionError: Nodes are added in the incorrect order! Comparing NaN to [NaN]
Stack Trace:
java.lang.AssertionError: Nodes are added in the incorrect order! Comparing NaN to [NaN]
at org.apache.lucene.util.hnsw.NeighborArray.addInOrder(NeighborArray.java:80)
at org.apache.lucene.util.hnsw.HnswGraphBuilder.popToScratch(HnswGraphBuilder.java:420)
at org.apache.lucene.util.hnsw.HnswGraphBuilder.addGraphNodeInternal(HnswGraphBuilder.java:273)
at org.apache.lucene.util.hnsw.HnswGraphBuilder.addGraphNodeWithEps(HnswGraphBuilder.java:331)
at org.apache.lucene.util.hnsw.MergingHnswGraphBuilder.updateGraph(MergingHnswGraphBuilder.java:177)
at org.apache.lucene.util.hnsw.MergingHnswGraphBuilder.build(MergingHnswGraphBuilder.java:128)
at org.apache.lucene.util.hnsw.IncrementalHnswGraphMerger.merge(IncrementalHnswGraphMerger.java:197)
at org.apache.lucene.codecs.lucene99.Lucene99HnswVectorsWriter.mergeOneField(Lucene99HnswVectorsWriter.java:414)
at org.apache.lucene.codecs.perfield.PerFieldKnnVectorsFormat$FieldsWriter.mergeOneField(PerFieldKnnVectorsFormat.java:126)
at org.apache.lucene.codecs.KnnVectorsWriter.merge(KnnVectorsWriter.java:105)
at org.apache.lucene.index.SegmentMerger.mergeVectorValues(SegmentMerger.java:271)
at org.apache.lucene.index.SegmentMerger.mergeWithLogging(SegmentMerger.java:314)
at org.apache.lucene.index.SegmentMerger.merge(SegmentMerger.java:158)
at org.apache.lucene.index.IndexWriter.mergeMiddle(IndexWriter.java:5317)
at org.apache.lucene.index.IndexWriter.merge(IndexWriter.java:4778)
at org.apache.solr.update.SolrIndexWriter.merge(SolrIndexWriter.java:219)
at org.apache.lucene.index.IndexWriter$IndexWriterMergeSource.merge(IndexWriter.java:6601)
at org.apache.lucene.index.ConcurrentMergeScheduler.doMerge(ConcurrentMergeScheduler.java:668)
at org.apache.lucene.index.ConcurrentMergeScheduler$MergeThread.run(ConcurrentMergeScheduler.java:729)
[JENKINS-EA] Solr-main-Linux (64bit/hotspot/jdk-26-ea+27) - Build # 29993 - Still Unstable!
Posted by Policeman Jenkins Server <je...@thetaphi.de>.
Build: https://jenkins.thetaphi.de/job/Solr-main-Linux/29993/
Java: 64bit/hotspot/jdk-26-ea+27 -XX:+UseCompressedOops -XX:+UseSerialGC
1 tests failed.
FAILED: org.apache.solr.gcs.GCSIncrementalBackupTest.testSimple
Error Message:
org.apache.solr.common.SolrException: Could not find a healthy node to handle the request.
Stack Trace:
org.apache.solr.common.SolrException: Could not find a healthy node to handle the request.
at __randomizedtesting.SeedInfo.seed([A01879874CC3C332:98AB5D796B3017E3]:0)
at app//org.apache.solr.client.solrj.impl.CloudSolrClient.sendRequest(CloudSolrClient.java:1564)
at app//org.apache.solr.client.solrj.impl.CloudSolrClient.requestWithRetryOnStaleState(CloudSolrClient.java:1206)
at app//org.apache.solr.client.solrj.impl.CloudSolrClient.requestWithRetryOnStaleState(CloudSolrClient.java:1391)
at app//org.apache.solr.client.solrj.impl.CloudSolrClient.requestWithRetryOnStaleState(CloudSolrClient.java:1391)
at app//org.apache.solr.client.solrj.impl.CloudSolrClient.requestWithRetryOnStaleState(CloudSolrClient.java:1391)
at app//org.apache.solr.client.solrj.impl.CloudSolrClient.requestWithRetryOnStaleState(CloudSolrClient.java:1382)
at app//org.apache.solr.client.solrj.impl.CloudSolrClient.requestWithRetryOnStaleState(CloudSolrClient.java:1367)
at app//org.apache.solr.client.solrj.impl.CloudSolrClient.request(CloudSolrClient.java:1128)
at app//org.apache.solr.client.solrj.SolrRequest.process(SolrRequest.java:286)
at app//org.apache.solr.client.solrj.SolrClient.query(SolrClient.java:928)
at app//org.apache.solr.cloud.api.collections.AbstractIncrementalBackupTest.testSimple(AbstractIncrementalBackupTest.java:188)
at java.base@26-ea/jdk.internal.reflect.DirectMethodHandleAccessor.invoke(DirectMethodHandleAccessor.java:104)
at java.base@26-ea/java.lang.reflect.Method.invoke(Method.java:565)
at app//com.carrotsearch.randomizedtesting.RandomizedRunner.invoke(RandomizedRunner.java:1763)
at app//com.carrotsearch.randomizedtesting.RandomizedRunner$8.evaluate(RandomizedRunner.java:946)
at app//com.carrotsearch.randomizedtesting.RandomizedRunner$9.evaluate(RandomizedRunner.java:982)
at app//com.carrotsearch.randomizedtesting.RandomizedRunner$10.evaluate(RandomizedRunner.java:996)
at app//com.carrotsearch.randomizedtesting.rules.SystemPropertiesRestoreRule$1.evaluate(SystemPropertiesRestoreRule.java:80)
at app//org.junit.rules.RunRules.evaluate(RunRules.java:20)
at app//org.apache.lucene.tests.util.TestRuleSetupTeardownChained$1.evaluate(TestRuleSetupTeardownChained.java:48)
at app//org.apache.lucene.tests.util.AbstractBeforeAfterRule$1.evaluate(AbstractBeforeAfterRule.java:43)
at app//org.apache.lucene.tests.util.TestRuleThreadAndTestName$1.evaluate(TestRuleThreadAndTestName.java:45)
at app//org.apache.lucene.tests.util.TestRuleIgnoreAfterMaxFailures$1.evaluate(TestRuleIgnoreAfterMaxFailures.java:60)
at app//org.apache.lucene.tests.util.TestRuleMarkFailure$1.evaluate(TestRuleMarkFailure.java:44)
at app//org.junit.rules.RunRules.evaluate(RunRules.java:20)
at app//com.carrotsearch.randomizedtesting.rules.StatementAdapter.evaluate(StatementAdapter.java:36)
at app//com.carrotsearch.randomizedtesting.ThreadLeakControl$StatementRunner.run(ThreadLeakControl.java:390)
at app//com.carrotsearch.randomizedtesting.ThreadLeakControl.forkTimeoutingTask(ThreadLeakControl.java:843)
at app//com.carrotsearch.randomizedtesting.ThreadLeakControl$3.evaluate(ThreadLeakControl.java:490)
at app//com.carrotsearch.randomizedtesting.RandomizedRunner.runSingleTest(RandomizedRunner.java:955)
at app//com.carrotsearch.randomizedtesting.RandomizedRunner$5.evaluate(RandomizedRunner.java:840)
at app//com.carrotsearch.randomizedtesting.RandomizedRunner$6.evaluate(RandomizedRunner.java:891)
at app//com.carrotsearch.randomizedtesting.RandomizedRunner$7.evaluate(RandomizedRunner.java:902)
at app//com.carrotsearch.randomizedtesting.rules.StatementAdapter.evaluate(StatementAdapter.java:36)
at app//com.carrotsearch.randomizedtesting.rules.StatementAdapter.evaluate(StatementAdapter.java:36)
at app//org.apache.lucene.tests.util.AbstractBeforeAfterRule$1.evaluate(AbstractBeforeAfterRule.java:43)
at app//com.carrotsearch.randomizedtesting.rules.SystemPropertiesRestoreRule$1.evaluate(SystemPropertiesRestoreRule.java:80)
at app//org.junit.rules.RunRules.evaluate(RunRules.java:20)
at app//org.apache.lucene.tests.util.AbstractBeforeAfterRule$1.evaluate(AbstractBeforeAfterRule.java:43)
at app//com.carrotsearch.randomizedtesting.rules.StatementAdapter.evaluate(StatementAdapter.java:36)
at app//org.apache.lucene.tests.util.TestRuleStoreClassName$1.evaluate(TestRuleStoreClassName.java:38)
at app//com.carrotsearch.randomizedtesting.rules.NoShadowingOrOverridesOnMethodsRule$1.evaluate(NoShadowingOrOverridesOnMethodsRule.java:40)
at app//com.carrotsearch.randomizedtesting.rules.NoShadowingOrOverridesOnMethodsRule$1.evaluate(NoShadowingOrOverridesOnMethodsRule.java:40)
at app//com.carrotsearch.randomizedtesting.rules.StatementAdapter.evaluate(StatementAdapter.java:36)
at app//com.carrotsearch.randomizedtesting.rules.StatementAdapter.evaluate(StatementAdapter.java:36)
at app//org.apache.lucene.tests.util.TestRuleAssertionsRequired$1.evaluate(TestRuleAssertionsRequired.java:53)
at app//org.apache.lucene.tests.util.AbstractBeforeAfterRule$1.evaluate(AbstractBeforeAfterRule.java:43)
at app//org.apache.lucene.tests.util.TestRuleMarkFailure$1.evaluate(TestRuleMarkFailure.java:44)
at app//org.apache.lucene.tests.util.TestRuleIgnoreAfterMaxFailures$1.evaluate(TestRuleIgnoreAfterMaxFailures.java:60)
at app//org.apache.lucene.tests.util.TestRuleIgnoreTestSuites$1.evaluate(TestRuleIgnoreTestSuites.java:47)
at app//org.junit.rules.RunRules.evaluate(RunRules.java:20)
at app//com.carrotsearch.randomizedtesting.rules.StatementAdapter.evaluate(StatementAdapter.java:36)
at app//com.carrotsearch.randomizedtesting.ThreadLeakControl$StatementRunner.run(ThreadLeakControl.java:390)
at app//com.carrotsearch.randomizedtesting.ThreadLeakControl.lambda$forkTimeoutingTask$0(ThreadLeakControl.java:850)
at java.base@26-ea/java.lang.Thread.run(Thread.java:1516)
[JENKINS] Solr-main-Linux (64bit/hotspot/jdk-22.0.2) - Build # 29992 - Still Unstable!
Posted by Policeman Jenkins Server <je...@thetaphi.de>.
Build: https://jenkins.thetaphi.de/job/Solr-main-Linux/29992/
Java: 64bit/hotspot/jdk-22.0.2 -XX:+UseCompressedOops -XX:+UseSerialGC
1 tests failed.
FAILED: org.apache.solr.cloud.TestCloudConsistency.testOutOfSyncReplicasCannotBecomeLeader
Error Message:
java.lang.AssertionError: Timeout waiting for active collection
Timeout waiting to see state for collection=outOfSyncReplicasCannotBecomeLeader-false :DocCollection(outOfSyncReplicasCannotBecomeLeader-false//collections/outOfSyncReplicasCannotBecomeLeader-false/state.json/18 )={
"pullReplicas":0,
"configName":"outOfSyncReplicasCannotBecomeLeader-false.AUTOCREATED",
"nrtReplicas":3,
"replicationFactor":3,
"tlogReplicas":0,
"router":{"name":"compositeId"},
"shards":{"shard1":{
"range":"80000000-7fffffff",
"replicas":{
"core_node2":{
"core":"outOfSyncReplicasCannotBecomeLeader-false_shard1_replica_n1",
"node_name":"127.0.0.1:39317_solr",
"type":"NRT",
"state":"active",
"leader":"true",
"force_set_state":"false",
"base_url":"https://127.0.0.1:39317/solr"},
"core_node4":{
"core":"outOfSyncReplicasCannotBecomeLeader-false_shard1_replica_n3",
"node_name":"127.0.0.1:33289_solr",
"type":"NRT",
"state":"down",
"force_set_state":"false",
"base_url":"https://127.0.0.1:33289/solr"},
"core_node6":{
"core":"outOfSyncReplicasCannotBecomeLeader-false_shard1_replica_n5",
"node_name":"127.0.0.1:44185_solr",
"type":"NRT",
"state":"down",
"force_set_state":"false",
"base_url":"https://127.0.0.1:44185/solr"}},
"state":"active"}}}
Live Nodes: [127.0.0.1:33289_solr, 127.0.0.1:39317_solr, 127.0.0.1:43089_solr, 127.0.0.1:44185_solr]
Last available state: DocCollection(outOfSyncReplicasCannotBecomeLeader-false//collections/outOfSyncReplicasCannotBecomeLeader-false/state.json/18 )={
"pullReplicas":0,
"configName":"outOfSyncReplicasCannotBecomeLeader-false.AUTOCREATED",
"nrtReplicas":3,
"replicationFactor":3,
"tlogReplicas":0,
"router":{"name":"compositeId"},
"shards":{"shard1":{
"range":"80000000-7fffffff",
"replicas":{
"core_node2":{
"core":"outOfSyncReplicasCannotBecomeLeader-false_shard1_replica_n1",
"node_name":"127.0.0.1:39317_solr",
"type":"NRT",
"state":"active",
"leader":"true",
"force_set_state":"false",
"base_url":"https://127.0.0.1:39317/solr"},
"core_node4":{
"core":"outOfSyncReplicasCannotBecomeLeader-false_shard1_replica_n3",
"node_name":"127.0.0.1:33289_solr",
"type":"NRT",
"state":"down",
"force_set_state":"false",
"base_url":"https://127.0.0.1:33289/solr"},
"core_node6":{
"core":"outOfSyncReplicasCannotBecomeLeader-false_shard1_replica_n5",
"node_name":"127.0.0.1:44185_solr",
"type":"NRT",
"state":"down",
"force_set_state":"false",
"base_url":"https://127.0.0.1:44185/solr"}},
"state":"active"}}}
Stack Trace:
java.lang.AssertionError: Timeout waiting for active collection
Timeout waiting to see state for collection=outOfSyncReplicasCannotBecomeLeader-false :DocCollection(outOfSyncReplicasCannotBecomeLeader-false//collections/outOfSyncReplicasCannotBecomeLeader-false/state.json/18 )={
"pullReplicas":0,
"configName":"outOfSyncReplicasCannotBecomeLeader-false.AUTOCREATED",
"nrtReplicas":3,
"replicationFactor":3,
"tlogReplicas":0,
"router":{"name":"compositeId"},
"shards":{"shard1":{
"range":"80000000-7fffffff",
"replicas":{
"core_node2":{
"core":"outOfSyncReplicasCannotBecomeLeader-false_shard1_replica_n1",
"node_name":"127.0.0.1:39317_solr",
"type":"NRT",
"state":"active",
"leader":"true",
"force_set_state":"false",
"base_url":"https://127.0.0.1:39317/solr"},
"core_node4":{
"core":"outOfSyncReplicasCannotBecomeLeader-false_shard1_replica_n3",
"node_name":"127.0.0.1:33289_solr",
"type":"NRT",
"state":"down",
"force_set_state":"false",
"base_url":"https://127.0.0.1:33289/solr"},
"core_node6":{
"core":"outOfSyncReplicasCannotBecomeLeader-false_shard1_replica_n5",
"node_name":"127.0.0.1:44185_solr",
"type":"NRT",
"state":"down",
"force_set_state":"false",
"base_url":"https://127.0.0.1:44185/solr"}},
"state":"active"}}}
Live Nodes: [127.0.0.1:33289_solr, 127.0.0.1:39317_solr, 127.0.0.1:43089_solr, 127.0.0.1:44185_solr]
Last available state: DocCollection(outOfSyncReplicasCannotBecomeLeader-false//collections/outOfSyncReplicasCannotBecomeLeader-false/state.json/18 )={
"pullReplicas":0,
"configName":"outOfSyncReplicasCannotBecomeLeader-false.AUTOCREATED",
"nrtReplicas":3,
"replicationFactor":3,
"tlogReplicas":0,
"router":{"name":"compositeId"},
"shards":{"shard1":{
"range":"80000000-7fffffff",
"replicas":{
"core_node2":{
"core":"outOfSyncReplicasCannotBecomeLeader-false_shard1_replica_n1",
"node_name":"127.0.0.1:39317_solr",
"type":"NRT",
"state":"active",
"leader":"true",
"force_set_state":"false",
"base_url":"https://127.0.0.1:39317/solr"},
"core_node4":{
"core":"outOfSyncReplicasCannotBecomeLeader-false_shard1_replica_n3",
"node_name":"127.0.0.1:33289_solr",
"type":"NRT",
"state":"down",
"force_set_state":"false",
"base_url":"https://127.0.0.1:33289/solr"},
"core_node6":{
"core":"outOfSyncReplicasCannotBecomeLeader-false_shard1_replica_n5",
"node_name":"127.0.0.1:44185_solr",
"type":"NRT",
"state":"down",
"force_set_state":"false",
"base_url":"https://127.0.0.1:44185/solr"}},
"state":"active"}}}
at __randomizedtesting.SeedInfo.seed([20DFC3FD2BD6AACE:5E34E3EDE8B1A5F4]:0)
at org.junit.Assert.fail(Assert.java:89)
at org.apache.solr.cloud.SolrCloudTestCase.waitForState(SolrCloudTestCase.java:234)
at org.apache.solr.cloud.SolrCloudTestCase.waitForState(SolrCloudTestCase.java:202)
at org.apache.solr.cloud.TestCloudConsistency.addDocWhenOtherReplicasAreNetworkPartitioned(TestCloudConsistency.java:285)
at org.apache.solr.cloud.TestCloudConsistency.testOutOfSyncReplicasCannotBecomeLeader(TestCloudConsistency.java:136)
at org.apache.solr.cloud.TestCloudConsistency.testOutOfSyncReplicasCannotBecomeLeader(TestCloudConsistency.java:99)
at java.base/jdk.internal.reflect.DirectMethodHandleAccessor.invoke(DirectMethodHandleAccessor.java:103)
at java.base/java.lang.reflect.Method.invoke(Method.java:580)
at com.carrotsearch.randomizedtesting.RandomizedRunner.invoke(RandomizedRunner.java:1763)
at com.carrotsearch.randomizedtesting.RandomizedRunner$8.evaluate(RandomizedRunner.java:946)
at com.carrotsearch.randomizedtesting.RandomizedRunner$9.evaluate(RandomizedRunner.java:982)
at com.carrotsearch.randomizedtesting.RandomizedRunner$10.evaluate(RandomizedRunner.java:996)
at com.carrotsearch.randomizedtesting.rules.SystemPropertiesRestoreRule$1.evaluate(SystemPropertiesRestoreRule.java:80)
at org.junit.rules.RunRules.evaluate(RunRules.java:20)
at org.apache.lucene.tests.util.TestRuleSetupTeardownChained$1.evaluate(TestRuleSetupTeardownChained.java:48)
at org.apache.lucene.tests.util.AbstractBeforeAfterRule$1.evaluate(AbstractBeforeAfterRule.java:43)
at org.apache.lucene.tests.util.TestRuleThreadAndTestName$1.evaluate(TestRuleThreadAndTestName.java:45)
at org.apache.lucene.tests.util.TestRuleIgnoreAfterMaxFailures$1.evaluate(TestRuleIgnoreAfterMaxFailures.java:60)
at org.apache.lucene.tests.util.TestRuleMarkFailure$1.evaluate(TestRuleMarkFailure.java:44)
at org.junit.rules.RunRules.evaluate(RunRules.java:20)
at com.carrotsearch.randomizedtesting.rules.StatementAdapter.evaluate(StatementAdapter.java:36)
at com.carrotsearch.randomizedtesting.ThreadLeakControl$StatementRunner.run(ThreadLeakControl.java:390)
at com.carrotsearch.randomizedtesting.ThreadLeakControl.forkTimeoutingTask(ThreadLeakControl.java:843)
at com.carrotsearch.randomizedtesting.ThreadLeakControl$3.evaluate(ThreadLeakControl.java:490)
at com.carrotsearch.randomizedtesting.RandomizedRunner.runSingleTest(RandomizedRunner.java:955)
at com.carrotsearch.randomizedtesting.RandomizedRunner$5.evaluate(RandomizedRunner.java:840)
at com.carrotsearch.randomizedtesting.RandomizedRunner$6.evaluate(RandomizedRunner.java:891)
at com.carrotsearch.randomizedtesting.RandomizedRunner$7.evaluate(RandomizedRunner.java:902)
at com.carrotsearch.randomizedtesting.rules.StatementAdapter.evaluate(StatementAdapter.java:36)
at com.carrotsearch.randomizedtesting.rules.StatementAdapter.evaluate(StatementAdapter.java:36)
at org.apache.lucene.tests.util.AbstractBeforeAfterRule$1.evaluate(AbstractBeforeAfterRule.java:43)
at com.carrotsearch.randomizedtesting.rules.SystemPropertiesRestoreRule$1.evaluate(SystemPropertiesRestoreRule.java:80)
at org.junit.rules.RunRules.evaluate(RunRules.java:20)
at org.apache.lucene.tests.util.AbstractBeforeAfterRule$1.evaluate(AbstractBeforeAfterRule.java:43)
at com.carrotsearch.randomizedtesting.rules.StatementAdapter.evaluate(StatementAdapter.java:36)
at org.apache.lucene.tests.util.TestRuleStoreClassName$1.evaluate(TestRuleStoreClassName.java:38)
at com.carrotsearch.randomizedtesting.rules.NoShadowingOrOverridesOnMethodsRule$1.evaluate(NoShadowingOrOverridesOnMethodsRule.java:40)
at com.carrotsearch.randomizedtesting.rules.NoShadowingOrOverridesOnMethodsRule$1.evaluate(NoShadowingOrOverridesOnMethodsRule.java:40)
at com.carrotsearch.randomizedtesting.rules.StatementAdapter.evaluate(StatementAdapter.java:36)
at com.carrotsearch.randomizedtesting.rules.StatementAdapter.evaluate(StatementAdapter.java:36)
at org.apache.lucene.tests.util.TestRuleAssertionsRequired$1.evaluate(TestRuleAssertionsRequired.java:53)
at org.apache.lucene.tests.util.AbstractBeforeAfterRule$1.evaluate(AbstractBeforeAfterRule.java:43)
at org.apache.lucene.tests.util.TestRuleMarkFailure$1.evaluate(TestRuleMarkFailure.java:44)
at org.apache.lucene.tests.util.TestRuleIgnoreAfterMaxFailures$1.evaluate(TestRuleIgnoreAfterMaxFailures.java:60)
at org.apache.lucene.tests.util.TestRuleIgnoreTestSuites$1.evaluate(TestRuleIgnoreTestSuites.java:47)
at org.junit.rules.RunRules.evaluate(RunRules.java:20)
at com.carrotsearch.randomizedtesting.rules.StatementAdapter.evaluate(StatementAdapter.java:36)
at com.carrotsearch.randomizedtesting.ThreadLeakControl$StatementRunner.run(ThreadLeakControl.java:390)
at com.carrotsearch.randomizedtesting.ThreadLeakControl.lambda$forkTimeoutingTask$0(ThreadLeakControl.java:850)
at java.base/java.lang.Thread.run(Thread.java:1570)
[JENKINS] Solr-main-Linux (64bit/hotspot/jdk-24) - Build # 29991 - Still Unstable!
Posted by Policeman Jenkins Server <je...@thetaphi.de>.
Build: https://jenkins.thetaphi.de/job/Solr-main-Linux/29991/
Java: 64bit/hotspot/jdk-24 -XX:+UseCompressedOops -XX:+UseG1GC
1 tests failed.
FAILED: org.apache.solr.search.TestFiltering.testRandomFiltering
Error Message:
java.lang.AssertionError: FAILURE: indexSize=80 iiter=0 qiter=670 request=[q, {! cost=20 tag=t}val_s:{00055 TO 00101}, fq, {!frange v=val_i l=70 u=123}, fq, {! cost=174}val_s:{00015 TO 00033} AND val_s:[00016 TO 00032], fq, -_query_:"{!frange v=val_i l=25 u=79}", fq, {!frange v=val_i l=75 u=83}, facet, true, facet.query, *:*, facet.query, {!key=multiSelect ex=t}*:*, facet.query, {!key=facetQuery}-_query_:"{!frange v=val_i l=34 u=79}"]
Stack Trace:
java.lang.AssertionError: FAILURE: indexSize=80 iiter=0 qiter=670 request=[q, {! cost=20 tag=t}val_s:{00055 TO 00101}, fq, {!frange v=val_i l=70 u=123}, fq, {! cost=174}val_s:{00015 TO 00033} AND val_s:[00016 TO 00032], fq, -_query_:"{!frange v=val_i l=25 u=79}", fq, {!frange v=val_i l=75 u=83}, facet, true, facet.query, *:*, facet.query, {!key=multiSelect ex=t}*:*, facet.query, {!key=facetQuery}-_query_:"{!frange v=val_i l=34 u=79}"]
at __randomizedtesting.SeedInfo.seed([66E1A767B3672DBD:798204A256406DB4]:0)
at org.junit.Assert.fail(Assert.java:89)
at org.apache.solr.search.TestFiltering.testRandomFiltering(TestFiltering.java:575)
at java.base/jdk.internal.reflect.DirectMethodHandleAccessor.invoke(DirectMethodHandleAccessor.java:104)
at java.base/java.lang.reflect.Method.invoke(Method.java:565)
at com.carrotsearch.randomizedtesting.RandomizedRunner.invoke(RandomizedRunner.java:1763)
at com.carrotsearch.randomizedtesting.RandomizedRunner$8.evaluate(RandomizedRunner.java:946)
at com.carrotsearch.randomizedtesting.RandomizedRunner$9.evaluate(RandomizedRunner.java:982)
at com.carrotsearch.randomizedtesting.RandomizedRunner$10.evaluate(RandomizedRunner.java:996)
at com.carrotsearch.randomizedtesting.rules.SystemPropertiesRestoreRule$1.evaluate(SystemPropertiesRestoreRule.java:80)
at org.junit.rules.RunRules.evaluate(RunRules.java:20)
at org.apache.lucene.tests.util.TestRuleSetupTeardownChained$1.evaluate(TestRuleSetupTeardownChained.java:48)
at org.apache.lucene.tests.util.AbstractBeforeAfterRule$1.evaluate(AbstractBeforeAfterRule.java:43)
at org.apache.lucene.tests.util.TestRuleThreadAndTestName$1.evaluate(TestRuleThreadAndTestName.java:45)
at org.apache.lucene.tests.util.TestRuleIgnoreAfterMaxFailures$1.evaluate(TestRuleIgnoreAfterMaxFailures.java:60)
at org.apache.lucene.tests.util.TestRuleMarkFailure$1.evaluate(TestRuleMarkFailure.java:44)
at org.junit.rules.RunRules.evaluate(RunRules.java:20)
at com.carrotsearch.randomizedtesting.rules.StatementAdapter.evaluate(StatementAdapter.java:36)
at com.carrotsearch.randomizedtesting.ThreadLeakControl$StatementRunner.run(ThreadLeakControl.java:390)
at com.carrotsearch.randomizedtesting.ThreadLeakControl.forkTimeoutingTask(ThreadLeakControl.java:843)
at com.carrotsearch.randomizedtesting.ThreadLeakControl$3.evaluate(ThreadLeakControl.java:490)
at com.carrotsearch.randomizedtesting.RandomizedRunner.runSingleTest(RandomizedRunner.java:955)
at com.carrotsearch.randomizedtesting.RandomizedRunner$5.evaluate(RandomizedRunner.java:840)
at com.carrotsearch.randomizedtesting.RandomizedRunner$6.evaluate(RandomizedRunner.java:891)
at com.carrotsearch.randomizedtesting.RandomizedRunner$7.evaluate(RandomizedRunner.java:902)
at com.carrotsearch.randomizedtesting.rules.StatementAdapter.evaluate(StatementAdapter.java:36)
at com.carrotsearch.randomizedtesting.rules.StatementAdapter.evaluate(StatementAdapter.java:36)
at org.apache.lucene.tests.util.AbstractBeforeAfterRule$1.evaluate(AbstractBeforeAfterRule.java:43)
at com.carrotsearch.randomizedtesting.rules.SystemPropertiesRestoreRule$1.evaluate(SystemPropertiesRestoreRule.java:80)
at org.junit.rules.RunRules.evaluate(RunRules.java:20)
at org.apache.lucene.tests.util.AbstractBeforeAfterRule$1.evaluate(AbstractBeforeAfterRule.java:43)
at com.carrotsearch.randomizedtesting.rules.StatementAdapter.evaluate(StatementAdapter.java:36)
at org.apache.lucene.tests.util.TestRuleStoreClassName$1.evaluate(TestRuleStoreClassName.java:38)
at com.carrotsearch.randomizedtesting.rules.NoShadowingOrOverridesOnMethodsRule$1.evaluate(NoShadowingOrOverridesOnMethodsRule.java:40)
at com.carrotsearch.randomizedtesting.rules.NoShadowingOrOverridesOnMethodsRule$1.evaluate(NoShadowingOrOverridesOnMethodsRule.java:40)
at com.carrotsearch.randomizedtesting.rules.StatementAdapter.evaluate(StatementAdapter.java:36)
at com.carrotsearch.randomizedtesting.rules.StatementAdapter.evaluate(StatementAdapter.java:36)
at org.apache.lucene.tests.util.TestRuleAssertionsRequired$1.evaluate(TestRuleAssertionsRequired.java:53)
at org.apache.lucene.tests.util.AbstractBeforeAfterRule$1.evaluate(AbstractBeforeAfterRule.java:43)
at org.apache.lucene.tests.util.TestRuleMarkFailure$1.evaluate(TestRuleMarkFailure.java:44)
at org.apache.lucene.tests.util.TestRuleIgnoreAfterMaxFailures$1.evaluate(TestRuleIgnoreAfterMaxFailures.java:60)
at org.apache.lucene.tests.util.TestRuleIgnoreTestSuites$1.evaluate(TestRuleIgnoreTestSuites.java:47)
at org.junit.rules.RunRules.evaluate(RunRules.java:20)
at com.carrotsearch.randomizedtesting.rules.StatementAdapter.evaluate(StatementAdapter.java:36)
at com.carrotsearch.randomizedtesting.ThreadLeakControl$StatementRunner.run(ThreadLeakControl.java:390)
at com.carrotsearch.randomizedtesting.ThreadLeakControl.lambda$forkTimeoutingTask$0(ThreadLeakControl.java:850)
at java.base/java.lang.Thread.run(Thread.java:1447)