You are viewing a plain text version of this content. The canonical link for it is here.
Posted to builds@mesos.apache.org by Apache Jenkins Server <je...@builds.apache.org> on 2017/01/20 14:18:50 UTC

Build failed in Jenkins: Mesos-Windows-Reviewbot #25

See <https://builds.apache.org/job/Mesos-Windows-Reviewbot/25/>

------------------------------------------
[...truncated 3900 lines...]
[ RUN      ] OsTest.Argv
[       OK ] OsTest.Argv (1 ms)
[ RUN      ] OsTest.System
'invalid.command' is not recognized as an internal or external command,
operable program or batch file.
[       OK ] OsTest.System (84 ms)
[ RUN      ] OsTest.BootId
[       OK ] OsTest.BootId (1 ms)
[ RUN      ] OsTest.TrivialUser
[       OK ] OsTest.TrivialUser (2 ms)
[----------] 4 tests from OsTest (88 ms total)

[----------] 2 tests from RecordIOTest
[ RUN      ] RecordIOTest.Encoder
[       OK ] RecordIOTest.Encoder (1 ms)
[ RUN      ] RecordIOTest.Decoder
[       OK ] RecordIOTest.Decoder (1 ms)
[----------] 2 tests from RecordIOTest (2 ms total)

[----------] 2 tests from ResultTest
[ RUN      ] ResultTest.TryToResultConversion
[       OK ] ResultTest.TryToResultConversion (0 ms)
[ RUN      ] ResultTest.ArrowOperator
[       OK ] ResultTest.ArrowOperator (0 ms)
[----------] 2 tests from ResultTest (1 ms total)

[----------] 1 test from SomeTest
[ RUN      ] SomeTest.Some
[       OK ] SomeTest.Some (0 ms)
[----------] 1 test from SomeTest (0 ms total)

[----------] 39 tests from StringsTest
[ RUN      ] StringsTest.Format
[       OK ] StringsTest.Format (1 ms)
[ RUN      ] StringsTest.Remove
[       OK ] StringsTest.Remove (0 ms)
[ RUN      ] StringsTest.Replace
[       OK ] StringsTest.Replace (0 ms)
[ RUN      ] StringsTest.Trim
[       OK ] StringsTest.Trim (0 ms)
[ RUN      ] StringsTest.Tokenize
[       OK ] StringsTest.Tokenize (0 ms)
[ RUN      ] StringsTest.TokenizeStringWithDelimsAtStart
[       OK ] StringsTest.TokenizeStringWithDelimsAtStart (0 ms)
[ RUN      ] StringsTest.TokenizeStringWithDelimsAtEnd
[       OK ] StringsTest.TokenizeStringWithDelimsAtEnd (0 ms)
[ RUN      ] StringsTest.TokenizeStringWithDelimsAtStartAndEnd
[       OK ] StringsTest.TokenizeStringWithDelimsAtStartAndEnd (0 ms)
[ RUN      ] StringsTest.TokenizeWithMultipleDelims
[       OK ] StringsTest.TokenizeWithMultipleDelims (0 ms)
[ RUN      ] StringsTest.TokenizeEmptyString
[       OK ] StringsTest.TokenizeEmptyString (0 ms)
[ RUN      ] StringsTest.TokenizeDelimOnlyString
[       OK ] StringsTest.TokenizeDelimOnlyString (0 ms)
[ RUN      ] StringsTest.TokenizeNullByteDelim
[       OK ] StringsTest.TokenizeNullByteDelim (0 ms)
[ RUN      ] StringsTest.TokenizeNZero
[       OK ] StringsTest.TokenizeNZero (0 ms)
[ RUN      ] StringsTest.TokenizeNOne
[       OK ] StringsTest.TokenizeNOne (0 ms)
[ RUN      ] StringsTest.TokenizeNDelimOnlyString
[       OK ] StringsTest.TokenizeNDelimOnlyString (0 ms)
[ RUN      ] StringsTest.TokenizeN
[       OK ] StringsTest.TokenizeN (0 ms)
[ RUN      ] StringsTest.TokenizeNStringWithDelimsAtStart
[       OK ] StringsTest.TokenizeNStringWithDelimsAtStart (0 ms)
[ RUN      ] StringsTest.TokenizeNStringWithDelimsAtEnd
[       OK ] StringsTest.TokenizeNStringWithDelimsAtEnd (0 ms)
[ RUN      ] StringsTest.TokenizeNStringWithDelimsAtStartAndEnd
[       OK ] StringsTest.TokenizeNStringWithDelimsAtStartAndEnd (0 ms)
[ RUN      ] StringsTest.TokenizeNWithMultipleDelims
[       OK ] StringsTest.TokenizeNWithMultipleDelims (0 ms)
[ RUN      ] StringsTest.SplitEmptyString
[       OK ] StringsTest.SplitEmptyString (0 ms)
[ RUN      ] StringsTest.SplitDelimOnlyString
[       OK ] StringsTest.SplitDelimOnlyString (1 ms)
[ RUN      ] StringsTest.Split
[       OK ] StringsTest.Split (0 ms)
[ RUN      ] StringsTest.SplitStringWithDelimsAtStart
[       OK ] StringsTest.SplitStringWithDelimsAtStart (0 ms)
[ RUN      ] StringsTest.SplitStringWithDelimsAtEnd
[       OK ] StringsTest.SplitStringWithDelimsAtEnd (0 ms)
[ RUN      ] StringsTest.SplitStringWithDelimsAtStartAndEnd
[       OK ] StringsTest.SplitStringWithDelimsAtStartAndEnd (0 ms)
[ RUN      ] StringsTest.SplitWithMultipleDelims
[       OK ] StringsTest.SplitWithMultipleDelims (0 ms)
[ RUN      ] StringsTest.SplitNZero
[       OK ] StringsTest.SplitNZero (0 ms)
[ RUN      ] StringsTest.SplitNOne
[       OK ] StringsTest.SplitNOne (0 ms)
[ RUN      ] StringsTest.SplitNDelimOnlyString
[       OK ] StringsTest.SplitNDelimOnlyString (0 ms)
[ RUN      ] StringsTest.SplitN
[       OK ] StringsTest.SplitN (1 ms)
[ RUN      ] StringsTest.SplitNStringWithDelimsAtStart
[       OK ] StringsTest.SplitNStringWithDelimsAtStart (0 ms)
[ RUN      ] StringsTest.SplitNStringWithDelimsAtEnd
[       OK ] StringsTest.SplitNStringWithDelimsAtEnd (0 ms)
[ RUN      ] StringsTest.SplitNStringWithDelimsAtStartAndEnd
[       OK ] StringsTest.SplitNStringWithDelimsAtStartAndEnd (0 ms)
[ RUN      ] StringsTest.SplitNWithMultipleDelims
[       OK ] StringsTest.SplitNWithMultipleDelims (1 ms)
[ RUN      ] StringsTest.Pairs
[       OK ] StringsTest.Pairs (0 ms)
[ RUN      ] StringsTest.Join
[       OK ] StringsTest.Join (1 ms)
[ RUN      ] StringsTest.StartsWith
[       OK ] StringsTest.StartsWith (0 ms)
[ RUN      ] StringsTest.Contains
[       OK ] StringsTest.Contains (0 ms)
[----------] 39 tests from StringsTest (9 ms total)

[----------] 2 tests from SubcommandTest
[ RUN      ] SubcommandTest.Flags
[       OK ] SubcommandTest.Flags (6 ms)
[ RUN      ] SubcommandTest.Dispatch
Subcommand 'subcommand' is not available
Usage: command <subcommand> [OPTIONS]

Available subcommands:
    help
    subcommand2

Multiple subcommands have name 'subcommand'
[       OK ] SubcommandTest.Dispatch (2 ms)
[----------] 2 tests from SubcommandTest (8 ms total)

[----------] 1 test from TryTest
[ RUN      ] TryTest.ArrowOperator
[       OK ] TryTest.ArrowOperator (0 ms)
[----------] 1 test from TryTest (0 ms total)

[----------] 2 tests from UUIDTest
[ RUN      ] UUIDTest.Test
[       OK ] UUIDTest.Test (4 ms)
[ RUN      ] UUIDTest.MalformedUUID
[       OK ] UUIDTest.MalformedUUID (1 ms)
[----------] 2 tests from UUIDTest (5 ms total)

[----------] 2 tests from VersionTest
[ RUN      ] VersionTest.Comparison
[       OK ] VersionTest.Comparison (0 ms)
[ RUN      ] VersionTest.Parse
[       OK ] VersionTest.Parse (1 ms)
[----------] 2 tests from VersionTest (1 ms total)

[----------] 1 test from EnvTest
[ RUN      ] EnvTest.SimpleEnvTest
[       OK ] EnvTest.SimpleEnvTest (0 ms)
[----------] 1 test from EnvTest (0 ms total)

[----------] 8 tests from FsTest
[ RUN      ] FsTest.Find
[       OK ] FsTest.Find (5 ms)
[ RUN      ] FsTest.ReadWriteString
[       OK ] FsTest.ReadWriteString (1 ms)
[ RUN      ] FsTest.Mkdir
[       OK ] FsTest.Mkdir (7 ms)
[ RUN      ] FsTest.Exists
[       OK ] FsTest.Exists (4 ms)
[ RUN      ] FsTest.Touch
[       OK ] FsTest.Touch (2 ms)
[ RUN      ] FsTest.List
[       OK ] FsTest.List (3 ms)
[ RUN      ] FsTest.Rename
[       OK ] FsTest.Rename (5 ms)
[ RUN      ] FsTest.Close
[       OK ] FsTest.Close (2 ms)
[----------] 8 tests from FsTest (29 ms total)

[----------] 4 tests from ProcessTest
[ RUN      ] ProcessTest.Process
[       OK ] ProcessTest.Process (6 ms)
[ RUN      ] ProcessTest.Processes
[       OK ] ProcessTest.Processes (103 ms)
[ RUN      ] ProcessTest.Pids
[       OK ] ProcessTest.Pids (19 ms)
[ RUN      ] ProcessTest.Pstree

Pinging 127.0.0.1 with 32 bytes of data:
Reply from 127.0.0.1: bytes=32 time<1ms TTL=128
Reply from 127.0.0.1: bytes=32 time<1ms TTL=128

Ping statistics for 127.0.0.1:
    Packets: Sent = 2, Received = 2, Lost = 0 (0% loss),
Approximate round trip times in milli-seconds:
    Minimum = 0ms, Maximum = 0ms, Average = 0ms
[       OK ] ProcessTest.Pstree (1100 ms)
[----------] 4 tests from ProcessTest (1228 ms total)

[----------] 8 tests from RmdirTest
[ RUN      ] RmdirTest.TrivialRemoveEmptyDirectoryAbsolutePath
[       OK ] RmdirTest.TrivialRemoveEmptyDirectoryAbsolutePath (3 ms)
[ RUN      ] RmdirTest.TrivialRemoveEmptyDirectoryRelativePath
[       OK ] RmdirTest.TrivialRemoveEmptyDirectoryRelativePath (1 ms)
[ RUN      ] RmdirTest.RemoveFile
[       OK ] RmdirTest.RemoveFile (4 ms)
[ RUN      ] RmdirTest.RemoveRecursiveByDefault
[       OK ] RmdirTest.RemoveRecursiveByDefault (3 ms)
[ RUN      ] RmdirTest.TrivialFailToRemoveInvalidPath
[       OK ] RmdirTest.TrivialFailToRemoveInvalidPath (1 ms)
[ RUN      ] RmdirTest.FailToRemoveNestedInvalidPath
[       OK ] RmdirTest.FailToRemoveNestedInvalidPath (2 ms)
[ RUN      ] RmdirTest.RemoveDirectoryHangingSymlink
F:\jenkins\jenkins-slave\workspace\Mesos-Windows-Reviewbot\3rdparty\stout\tests\os\rmdir_tests.cpp(313): error: fs::symlink("tmp", link): 'internal::windows::create_symbolic_link': 'CreateSymbolicLink' call failed: A required privilege is not held by the client.


[  FAILED  ] RmdirTest.RemoveDirectoryHangingSymlink (2 ms)
[ RUN      ] RmdirTest.RemoveDirectoryButPreserveRoot
[       OK ] RmdirTest.RemoveDirectoryButPreserveRoot (3 ms)
[----------] 8 tests from RmdirTest (21 ms total)

[----------] 1 test from SocketTests
[ RUN      ] SocketTests.InitSocket
[       OK ] SocketTests.InitSocket (1 ms)
[----------] 1 test from SocketTests (1 ms total)

[----------] 3 tests from StrerrorTest
[ RUN      ] StrerrorTest.ValidErrno
[       OK ] StrerrorTest.ValidErrno (0 ms)
[ RUN      ] StrerrorTest.InvalidErrno
[       OK ] StrerrorTest.InvalidErrno (0 ms)
[ RUN      ] StrerrorTest.ValidHerrno
[       OK ] StrerrorTest.ValidHerrno (1 ms)
[----------] 3 tests from StrerrorTest (1 ms total)

[----------] 3 tests from SystemsTests
[ RUN      ] SystemsTests.Uname
[       OK ] SystemsTests.Uname (1 ms)
[ RUN      ] SystemsTests.Sysname
[       OK ] SystemsTests.Sysname (1 ms)
[ RUN      ] SystemsTests.Release
[       OK ] SystemsTests.Release (1 ms)
[----------] 3 tests from SystemsTests (3 ms total)

[----------] Global test environment tear-down
[==========] 223 tests from 39 test cases ran. (2195 ms total)
[  PASSED  ] 222 tests.
[  FAILED  ] 1 test, listed below:
[  FAILED  ] RmdirTest.RemoveDirectoryHangingSymlink

 1 FAILED TEST
  YOU HAVE 13 DISABLED TESTS


<https://builds.apache.org/job/Mesos-Windows-Reviewbot/ws/build>if> 1 NEQ 0 exit /b 1 

<https://builds.apache.org/job/Mesos-Windows-Reviewbot/ws/>if> 1 NEQ 0 exit /b 1 
Build step 'Execute Windows batch command' marked build as failure

Re: Build failed in Jenkins: Mesos-Reviewbot-Windows #29

Posted by Joseph Wu <jo...@mesosphere.io>.
Tweaked the test filters on the job.  I'll move this job into the
`support/jenkins` folder too.

On Fri, Jan 20, 2017 at 12:08 PM, Apache Jenkins Server <
jenkins@builds.apache.org> wrote:

> See <https://builds.apache.org/job/Mesos-Reviewbot-Windows/29/changes>
>
> Changes:
>
> [alexr] Passed an optional parameter by reference.
>
> ------------------------------------------
> [...truncated 3963 lines...]
> [ RUN      ] OsTest.Argv
> [       OK ] OsTest.Argv (1 ms)
> [ RUN      ] OsTest.System
> 'invalid.command' is not recognized as an internal or external command,
> operable program or batch file.
> [       OK ] OsTest.System (42 ms)
> [ RUN      ] OsTest.BootId
> [       OK ] OsTest.BootId (1 ms)
> [ RUN      ] OsTest.TrivialUser
> [       OK ] OsTest.TrivialUser (3 ms)
> [----------] 4 tests from OsTest (48 ms total)
>
> [----------] 2 tests from RecordIOTest
> [ RUN      ] RecordIOTest.Encoder
> [       OK ] RecordIOTest.Encoder (0 ms)
> [ RUN      ] RecordIOTest.Decoder
> [       OK ] RecordIOTest.Decoder (1 ms)
> [----------] 2 tests from RecordIOTest (1 ms total)
>
> [----------] 2 tests from ResultTest
> [ RUN      ] ResultTest.TryToResultConversion
> [       OK ] ResultTest.TryToResultConversion (0 ms)
> [ RUN      ] ResultTest.ArrowOperator
> [       OK ] ResultTest.ArrowOperator (0 ms)
> [----------] 2 tests from ResultTest (1 ms total)
>
> [----------] 1 test from SomeTest
> [ RUN      ] SomeTest.Some
> [       OK ] SomeTest.Some (0 ms)
> [----------] 1 test from SomeTest (0 ms total)
>
> [----------] 39 tests from StringsTest
> [ RUN      ] StringsTest.Format
> [       OK ] StringsTest.Format (1 ms)
> [ RUN      ] StringsTest.Remove
> [       OK ] StringsTest.Remove (0 ms)
> [ RUN      ] StringsTest.Replace
> [       OK ] StringsTest.Replace (0 ms)
> [ RUN      ] StringsTest.Trim
> [       OK ] StringsTest.Trim (0 ms)
> [ RUN      ] StringsTest.Tokenize
> [       OK ] StringsTest.Tokenize (1 ms)
> [ RUN      ] StringsTest.TokenizeStringWithDelimsAtStart
> [       OK ] StringsTest.TokenizeStringWithDelimsAtStart (0 ms)
> [ RUN      ] StringsTest.TokenizeStringWithDelimsAtEnd
> [       OK ] StringsTest.TokenizeStringWithDelimsAtEnd (0 ms)
> [ RUN      ] StringsTest.TokenizeStringWithDelimsAtStartAndEnd
> [       OK ] StringsTest.TokenizeStringWithDelimsAtStartAndEnd (0 ms)
> [ RUN      ] StringsTest.TokenizeWithMultipleDelims
> [       OK ] StringsTest.TokenizeWithMultipleDelims (0 ms)
> [ RUN      ] StringsTest.TokenizeEmptyString
> [       OK ] StringsTest.TokenizeEmptyString (0 ms)
> [ RUN      ] StringsTest.TokenizeDelimOnlyString
> [       OK ] StringsTest.TokenizeDelimOnlyString (0 ms)
> [ RUN      ] StringsTest.TokenizeNullByteDelim
> [       OK ] StringsTest.TokenizeNullByteDelim (0 ms)
> [ RUN      ] StringsTest.TokenizeNZero
> [       OK ] StringsTest.TokenizeNZero (0 ms)
> [ RUN      ] StringsTest.TokenizeNOne
> [       OK ] StringsTest.TokenizeNOne (0 ms)
> [ RUN      ] StringsTest.TokenizeNDelimOnlyString
> [       OK ] StringsTest.TokenizeNDelimOnlyString (0 ms)
> [ RUN      ] StringsTest.TokenizeN
> [       OK ] StringsTest.TokenizeN (0 ms)
> [ RUN      ] StringsTest.TokenizeNStringWithDelimsAtStart
> [       OK ] StringsTest.TokenizeNStringWithDelimsAtStart (0 ms)
> [ RUN      ] StringsTest.TokenizeNStringWithDelimsAtEnd
> [       OK ] StringsTest.TokenizeNStringWithDelimsAtEnd (0 ms)
> [ RUN      ] StringsTest.TokenizeNStringWithDelimsAtStartAndEnd
> [       OK ] StringsTest.TokenizeNStringWithDelimsAtStartAndEnd (0 ms)
> [ RUN      ] StringsTest.TokenizeNWithMultipleDelims
> [       OK ] StringsTest.TokenizeNWithMultipleDelims (0 ms)
> [ RUN      ] StringsTest.SplitEmptyString
> [       OK ] StringsTest.SplitEmptyString (0 ms)
> [ RUN      ] StringsTest.SplitDelimOnlyString
> [       OK ] StringsTest.SplitDelimOnlyString (0 ms)
> [ RUN      ] StringsTest.Split
> [       OK ] StringsTest.Split (0 ms)
> [ RUN      ] StringsTest.SplitStringWithDelimsAtStart
> [       OK ] StringsTest.SplitStringWithDelimsAtStart (0 ms)
> [ RUN      ] StringsTest.SplitStringWithDelimsAtEnd
> [       OK ] StringsTest.SplitStringWithDelimsAtEnd (0 ms)
> [ RUN      ] StringsTest.SplitStringWithDelimsAtStartAndEnd
> [       OK ] StringsTest.SplitStringWithDelimsAtStartAndEnd (0 ms)
> [ RUN      ] StringsTest.SplitWithMultipleDelims
> [       OK ] StringsTest.SplitWithMultipleDelims (0 ms)
> [ RUN      ] StringsTest.SplitNZero
> [       OK ] StringsTest.SplitNZero (0 ms)
> [ RUN      ] StringsTest.SplitNOne
> [       OK ] StringsTest.SplitNOne (0 ms)
> [ RUN      ] StringsTest.SplitNDelimOnlyString
> [       OK ] StringsTest.SplitNDelimOnlyString (0 ms)
> [ RUN      ] StringsTest.SplitN
> [       OK ] StringsTest.SplitN (0 ms)
> [ RUN      ] StringsTest.SplitNStringWithDelimsAtStart
> [       OK ] StringsTest.SplitNStringWithDelimsAtStart (0 ms)
> [ RUN      ] StringsTest.SplitNStringWithDelimsAtEnd
> [       OK ] StringsTest.SplitNStringWithDelimsAtEnd (0 ms)
> [ RUN      ] StringsTest.SplitNStringWithDelimsAtStartAndEnd
> [       OK ] StringsTest.SplitNStringWithDelimsAtStartAndEnd (0 ms)
> [ RUN      ] StringsTest.SplitNWithMultipleDelims
> [       OK ] StringsTest.SplitNWithMultipleDelims (1 ms)
> [ RUN      ] StringsTest.Pairs
> [       OK ] StringsTest.Pairs (0 ms)
> [ RUN      ] StringsTest.Join
> [       OK ] StringsTest.Join (1 ms)
> [ RUN      ] StringsTest.StartsWith
> [       OK ] StringsTest.StartsWith (0 ms)
> [ RUN      ] StringsTest.Contains
> [       OK ] StringsTest.Contains (0 ms)
> [----------] 39 tests from StringsTest (9 ms total)
>
> [----------] 2 tests from SubcommandTest
> [ RUN      ] SubcommandTest.Flags
> [       OK ] SubcommandTest.Flags (6 ms)
> [ RUN      ] SubcommandTest.Dispatch
> Subcommand 'subcommand' is not available
> Usage: command <subcommand> [OPTIONS]
>
> Available subcommands:
>     help
>     subcommand2
>
> Multiple subcommands have name 'subcommand'
> [       OK ] SubcommandTest.Dispatch (2 ms)
> [----------] 2 tests from SubcommandTest (8 ms total)
>
> [----------] 1 test from TryTest
> [ RUN      ] TryTest.ArrowOperator
> [       OK ] TryTest.ArrowOperator (0 ms)
> [----------] 1 test from TryTest (0 ms total)
>
> [----------] 2 tests from UUIDTest
> [ RUN      ] UUIDTest.Test
> [       OK ] UUIDTest.Test (4 ms)
> [ RUN      ] UUIDTest.MalformedUUID
> [       OK ] UUIDTest.MalformedUUID (1 ms)
> [----------] 2 tests from UUIDTest (5 ms total)
>
> [----------] 2 tests from VersionTest
> [ RUN      ] VersionTest.Comparison
> [       OK ] VersionTest.Comparison (0 ms)
> [ RUN      ] VersionTest.Parse
> [       OK ] VersionTest.Parse (1 ms)
> [----------] 2 tests from VersionTest (1 ms total)
>
> [----------] 1 test from EnvTest
> [ RUN      ] EnvTest.SimpleEnvTest
> [       OK ] EnvTest.SimpleEnvTest (1 ms)
> [----------] 1 test from EnvTest (1 ms total)
>
> [----------] 8 tests from FsTest
> [ RUN      ] FsTest.Find
> [       OK ] FsTest.Find (5 ms)
> [ RUN      ] FsTest.ReadWriteString
> [       OK ] FsTest.ReadWriteString (2 ms)
> [ RUN      ] FsTest.Mkdir
> [       OK ] FsTest.Mkdir (6 ms)
> [ RUN      ] FsTest.Exists
> [       OK ] FsTest.Exists (5 ms)
> [ RUN      ] FsTest.Touch
> [       OK ] FsTest.Touch (2 ms)
> [ RUN      ] FsTest.List
> [       OK ] FsTest.List (3 ms)
> [ RUN      ] FsTest.Rename
> [       OK ] FsTest.Rename (3 ms)
> [ RUN      ] FsTest.Close
> [       OK ] FsTest.Close (2 ms)
> [----------] 8 tests from FsTest (30 ms total)
>
> [----------] 4 tests from ProcessTest
> [ RUN      ] ProcessTest.Process
> [       OK ] ProcessTest.Process (6 ms)
> [ RUN      ] ProcessTest.Processes
> [       OK ] ProcessTest.Processes (67 ms)
> [ RUN      ] ProcessTest.Pids
> [       OK ] ProcessTest.Pids (19 ms)
> [ RUN      ] ProcessTest.Pstree
>
> Pinging 127.0.0.1 with 32 bytes of data:
> Reply from 127.0.0.1: bytes=32 time<1ms TTL=128
> Reply from 127.0.0.1: bytes=32 time<1ms TTL=128
>
> Ping statistics for 127.0.0.1:
>     Packets: Sent = 2, Received = 2, Lost = 0 (0% loss),
> Approximate round trip times in milli-seconds:
>     Minimum = 0ms, Maximum = 0ms, Average = 0ms
> [       OK ] ProcessTest.Pstree (1091 ms)
> [----------] 4 tests from ProcessTest (1183 ms total)
>
> [----------] 8 tests from RmdirTest
> [ RUN      ] RmdirTest.TrivialRemoveEmptyDirectoryAbsolutePath
> [       OK ] RmdirTest.TrivialRemoveEmptyDirectoryAbsolutePath (3 ms)
> [ RUN      ] RmdirTest.TrivialRemoveEmptyDirectoryRelativePath
> [       OK ] RmdirTest.TrivialRemoveEmptyDirectoryRelativePath (2 ms)
> [ RUN      ] RmdirTest.RemoveFile
> [       OK ] RmdirTest.RemoveFile (4 ms)
> [ RUN      ] RmdirTest.RemoveRecursiveByDefault
> [       OK ] RmdirTest.RemoveRecursiveByDefault (2 ms)
> [ RUN      ] RmdirTest.TrivialFailToRemoveInvalidPath
> [       OK ] RmdirTest.TrivialFailToRemoveInvalidPath (1 ms)
> [ RUN      ] RmdirTest.FailToRemoveNestedInvalidPath
> [       OK ] RmdirTest.FailToRemoveNestedInvalidPath (4 ms)
> [ RUN      ] RmdirTest.RemoveDirectoryHangingSymlink
> F:\jenkins\jenkins-slave\workspace\Mesos-Reviewbot-
> Windows\3rdparty\stout\tests\os\rmdir_tests.cpp(313): error:
> fs::symlink("tmp", link): 'internal::windows::create_symbolic_link':
> 'CreateSymbolicLink' call failed: A required privilege is not held by the
> client.
>
>
> [  FAILED  ] RmdirTest.RemoveDirectoryHangingSymlink (8 ms)
> [ RUN      ] RmdirTest.RemoveDirectoryButPreserveRoot
> [       OK ] RmdirTest.RemoveDirectoryButPreserveRoot (5 ms)
> [----------] 8 tests from RmdirTest (31 ms total)
>
> [----------] 1 test from SocketTests
> [ RUN      ] SocketTests.InitSocket
> [       OK ] SocketTests.InitSocket (1 ms)
> [----------] 1 test from SocketTests (1 ms total)
>
> [----------] 3 tests from StrerrorTest
> [ RUN      ] StrerrorTest.ValidErrno
> [       OK ] StrerrorTest.ValidErrno (0 ms)
> [ RUN      ] StrerrorTest.InvalidErrno
> [       OK ] StrerrorTest.InvalidErrno (0 ms)
> [ RUN      ] StrerrorTest.ValidHerrno
> [       OK ] StrerrorTest.ValidHerrno (0 ms)
> [----------] 3 tests from StrerrorTest (0 ms total)
>
> [----------] 3 tests from SystemsTests
> [ RUN      ] SystemsTests.Uname
> [       OK ] SystemsTests.Uname (1 ms)
> [ RUN      ] SystemsTests.Sysname
> [       OK ] SystemsTests.Sysname (1 ms)
> [ RUN      ] SystemsTests.Release
> [       OK ] SystemsTests.Release (1 ms)
> [----------] 3 tests from SystemsTests (3 ms total)
>
> [----------] Global test environment tear-down
> [==========] 223 tests from 39 test cases ran. (2106 ms total)
> [  PASSED  ] 222 tests.
> [  FAILED  ] 1 test, listed below:
> [  FAILED  ] RmdirTest.RemoveDirectoryHangingSymlink
>
>  1 FAILED TEST
>   YOU HAVE 13 DISABLED TESTS
>
>
> <https://builds.apache.org/job/Mesos-Reviewbot-Windows/ws/build>if> 1 NEQ
> 0 exit /b 1
>
> <https://builds.apache.org/job/Mesos-Reviewbot-Windows/ws/>if> 1 NEQ 0
> exit /b 1
> Build step 'Execute Windows batch command' marked build as failure
>

Build failed in Jenkins: Mesos-Reviewbot-Windows #29

Posted by Apache Jenkins Server <je...@builds.apache.org>.
See <https://builds.apache.org/job/Mesos-Reviewbot-Windows/29/changes>

Changes:

[alexr] Passed an optional parameter by reference.

------------------------------------------
[...truncated 3963 lines...]
[ RUN      ] OsTest.Argv
[       OK ] OsTest.Argv (1 ms)
[ RUN      ] OsTest.System
'invalid.command' is not recognized as an internal or external command,
operable program or batch file.
[       OK ] OsTest.System (42 ms)
[ RUN      ] OsTest.BootId
[       OK ] OsTest.BootId (1 ms)
[ RUN      ] OsTest.TrivialUser
[       OK ] OsTest.TrivialUser (3 ms)
[----------] 4 tests from OsTest (48 ms total)

[----------] 2 tests from RecordIOTest
[ RUN      ] RecordIOTest.Encoder
[       OK ] RecordIOTest.Encoder (0 ms)
[ RUN      ] RecordIOTest.Decoder
[       OK ] RecordIOTest.Decoder (1 ms)
[----------] 2 tests from RecordIOTest (1 ms total)

[----------] 2 tests from ResultTest
[ RUN      ] ResultTest.TryToResultConversion
[       OK ] ResultTest.TryToResultConversion (0 ms)
[ RUN      ] ResultTest.ArrowOperator
[       OK ] ResultTest.ArrowOperator (0 ms)
[----------] 2 tests from ResultTest (1 ms total)

[----------] 1 test from SomeTest
[ RUN      ] SomeTest.Some
[       OK ] SomeTest.Some (0 ms)
[----------] 1 test from SomeTest (0 ms total)

[----------] 39 tests from StringsTest
[ RUN      ] StringsTest.Format
[       OK ] StringsTest.Format (1 ms)
[ RUN      ] StringsTest.Remove
[       OK ] StringsTest.Remove (0 ms)
[ RUN      ] StringsTest.Replace
[       OK ] StringsTest.Replace (0 ms)
[ RUN      ] StringsTest.Trim
[       OK ] StringsTest.Trim (0 ms)
[ RUN      ] StringsTest.Tokenize
[       OK ] StringsTest.Tokenize (1 ms)
[ RUN      ] StringsTest.TokenizeStringWithDelimsAtStart
[       OK ] StringsTest.TokenizeStringWithDelimsAtStart (0 ms)
[ RUN      ] StringsTest.TokenizeStringWithDelimsAtEnd
[       OK ] StringsTest.TokenizeStringWithDelimsAtEnd (0 ms)
[ RUN      ] StringsTest.TokenizeStringWithDelimsAtStartAndEnd
[       OK ] StringsTest.TokenizeStringWithDelimsAtStartAndEnd (0 ms)
[ RUN      ] StringsTest.TokenizeWithMultipleDelims
[       OK ] StringsTest.TokenizeWithMultipleDelims (0 ms)
[ RUN      ] StringsTest.TokenizeEmptyString
[       OK ] StringsTest.TokenizeEmptyString (0 ms)
[ RUN      ] StringsTest.TokenizeDelimOnlyString
[       OK ] StringsTest.TokenizeDelimOnlyString (0 ms)
[ RUN      ] StringsTest.TokenizeNullByteDelim
[       OK ] StringsTest.TokenizeNullByteDelim (0 ms)
[ RUN      ] StringsTest.TokenizeNZero
[       OK ] StringsTest.TokenizeNZero (0 ms)
[ RUN      ] StringsTest.TokenizeNOne
[       OK ] StringsTest.TokenizeNOne (0 ms)
[ RUN      ] StringsTest.TokenizeNDelimOnlyString
[       OK ] StringsTest.TokenizeNDelimOnlyString (0 ms)
[ RUN      ] StringsTest.TokenizeN
[       OK ] StringsTest.TokenizeN (0 ms)
[ RUN      ] StringsTest.TokenizeNStringWithDelimsAtStart
[       OK ] StringsTest.TokenizeNStringWithDelimsAtStart (0 ms)
[ RUN      ] StringsTest.TokenizeNStringWithDelimsAtEnd
[       OK ] StringsTest.TokenizeNStringWithDelimsAtEnd (0 ms)
[ RUN      ] StringsTest.TokenizeNStringWithDelimsAtStartAndEnd
[       OK ] StringsTest.TokenizeNStringWithDelimsAtStartAndEnd (0 ms)
[ RUN      ] StringsTest.TokenizeNWithMultipleDelims
[       OK ] StringsTest.TokenizeNWithMultipleDelims (0 ms)
[ RUN      ] StringsTest.SplitEmptyString
[       OK ] StringsTest.SplitEmptyString (0 ms)
[ RUN      ] StringsTest.SplitDelimOnlyString
[       OK ] StringsTest.SplitDelimOnlyString (0 ms)
[ RUN      ] StringsTest.Split
[       OK ] StringsTest.Split (0 ms)
[ RUN      ] StringsTest.SplitStringWithDelimsAtStart
[       OK ] StringsTest.SplitStringWithDelimsAtStart (0 ms)
[ RUN      ] StringsTest.SplitStringWithDelimsAtEnd
[       OK ] StringsTest.SplitStringWithDelimsAtEnd (0 ms)
[ RUN      ] StringsTest.SplitStringWithDelimsAtStartAndEnd
[       OK ] StringsTest.SplitStringWithDelimsAtStartAndEnd (0 ms)
[ RUN      ] StringsTest.SplitWithMultipleDelims
[       OK ] StringsTest.SplitWithMultipleDelims (0 ms)
[ RUN      ] StringsTest.SplitNZero
[       OK ] StringsTest.SplitNZero (0 ms)
[ RUN      ] StringsTest.SplitNOne
[       OK ] StringsTest.SplitNOne (0 ms)
[ RUN      ] StringsTest.SplitNDelimOnlyString
[       OK ] StringsTest.SplitNDelimOnlyString (0 ms)
[ RUN      ] StringsTest.SplitN
[       OK ] StringsTest.SplitN (0 ms)
[ RUN      ] StringsTest.SplitNStringWithDelimsAtStart
[       OK ] StringsTest.SplitNStringWithDelimsAtStart (0 ms)
[ RUN      ] StringsTest.SplitNStringWithDelimsAtEnd
[       OK ] StringsTest.SplitNStringWithDelimsAtEnd (0 ms)
[ RUN      ] StringsTest.SplitNStringWithDelimsAtStartAndEnd
[       OK ] StringsTest.SplitNStringWithDelimsAtStartAndEnd (0 ms)
[ RUN      ] StringsTest.SplitNWithMultipleDelims
[       OK ] StringsTest.SplitNWithMultipleDelims (1 ms)
[ RUN      ] StringsTest.Pairs
[       OK ] StringsTest.Pairs (0 ms)
[ RUN      ] StringsTest.Join
[       OK ] StringsTest.Join (1 ms)
[ RUN      ] StringsTest.StartsWith
[       OK ] StringsTest.StartsWith (0 ms)
[ RUN      ] StringsTest.Contains
[       OK ] StringsTest.Contains (0 ms)
[----------] 39 tests from StringsTest (9 ms total)

[----------] 2 tests from SubcommandTest
[ RUN      ] SubcommandTest.Flags
[       OK ] SubcommandTest.Flags (6 ms)
[ RUN      ] SubcommandTest.Dispatch
Subcommand 'subcommand' is not available
Usage: command <subcommand> [OPTIONS]

Available subcommands:
    help
    subcommand2

Multiple subcommands have name 'subcommand'
[       OK ] SubcommandTest.Dispatch (2 ms)
[----------] 2 tests from SubcommandTest (8 ms total)

[----------] 1 test from TryTest
[ RUN      ] TryTest.ArrowOperator
[       OK ] TryTest.ArrowOperator (0 ms)
[----------] 1 test from TryTest (0 ms total)

[----------] 2 tests from UUIDTest
[ RUN      ] UUIDTest.Test
[       OK ] UUIDTest.Test (4 ms)
[ RUN      ] UUIDTest.MalformedUUID
[       OK ] UUIDTest.MalformedUUID (1 ms)
[----------] 2 tests from UUIDTest (5 ms total)

[----------] 2 tests from VersionTest
[ RUN      ] VersionTest.Comparison
[       OK ] VersionTest.Comparison (0 ms)
[ RUN      ] VersionTest.Parse
[       OK ] VersionTest.Parse (1 ms)
[----------] 2 tests from VersionTest (1 ms total)

[----------] 1 test from EnvTest
[ RUN      ] EnvTest.SimpleEnvTest
[       OK ] EnvTest.SimpleEnvTest (1 ms)
[----------] 1 test from EnvTest (1 ms total)

[----------] 8 tests from FsTest
[ RUN      ] FsTest.Find
[       OK ] FsTest.Find (5 ms)
[ RUN      ] FsTest.ReadWriteString
[       OK ] FsTest.ReadWriteString (2 ms)
[ RUN      ] FsTest.Mkdir
[       OK ] FsTest.Mkdir (6 ms)
[ RUN      ] FsTest.Exists
[       OK ] FsTest.Exists (5 ms)
[ RUN      ] FsTest.Touch
[       OK ] FsTest.Touch (2 ms)
[ RUN      ] FsTest.List
[       OK ] FsTest.List (3 ms)
[ RUN      ] FsTest.Rename
[       OK ] FsTest.Rename (3 ms)
[ RUN      ] FsTest.Close
[       OK ] FsTest.Close (2 ms)
[----------] 8 tests from FsTest (30 ms total)

[----------] 4 tests from ProcessTest
[ RUN      ] ProcessTest.Process
[       OK ] ProcessTest.Process (6 ms)
[ RUN      ] ProcessTest.Processes
[       OK ] ProcessTest.Processes (67 ms)
[ RUN      ] ProcessTest.Pids
[       OK ] ProcessTest.Pids (19 ms)
[ RUN      ] ProcessTest.Pstree

Pinging 127.0.0.1 with 32 bytes of data:
Reply from 127.0.0.1: bytes=32 time<1ms TTL=128
Reply from 127.0.0.1: bytes=32 time<1ms TTL=128

Ping statistics for 127.0.0.1:
    Packets: Sent = 2, Received = 2, Lost = 0 (0% loss),
Approximate round trip times in milli-seconds:
    Minimum = 0ms, Maximum = 0ms, Average = 0ms
[       OK ] ProcessTest.Pstree (1091 ms)
[----------] 4 tests from ProcessTest (1183 ms total)

[----------] 8 tests from RmdirTest
[ RUN      ] RmdirTest.TrivialRemoveEmptyDirectoryAbsolutePath
[       OK ] RmdirTest.TrivialRemoveEmptyDirectoryAbsolutePath (3 ms)
[ RUN      ] RmdirTest.TrivialRemoveEmptyDirectoryRelativePath
[       OK ] RmdirTest.TrivialRemoveEmptyDirectoryRelativePath (2 ms)
[ RUN      ] RmdirTest.RemoveFile
[       OK ] RmdirTest.RemoveFile (4 ms)
[ RUN      ] RmdirTest.RemoveRecursiveByDefault
[       OK ] RmdirTest.RemoveRecursiveByDefault (2 ms)
[ RUN      ] RmdirTest.TrivialFailToRemoveInvalidPath
[       OK ] RmdirTest.TrivialFailToRemoveInvalidPath (1 ms)
[ RUN      ] RmdirTest.FailToRemoveNestedInvalidPath
[       OK ] RmdirTest.FailToRemoveNestedInvalidPath (4 ms)
[ RUN      ] RmdirTest.RemoveDirectoryHangingSymlink
F:\jenkins\jenkins-slave\workspace\Mesos-Reviewbot-Windows\3rdparty\stout\tests\os\rmdir_tests.cpp(313): error: fs::symlink("tmp", link): 'internal::windows::create_symbolic_link': 'CreateSymbolicLink' call failed: A required privilege is not held by the client.


[  FAILED  ] RmdirTest.RemoveDirectoryHangingSymlink (8 ms)
[ RUN      ] RmdirTest.RemoveDirectoryButPreserveRoot
[       OK ] RmdirTest.RemoveDirectoryButPreserveRoot (5 ms)
[----------] 8 tests from RmdirTest (31 ms total)

[----------] 1 test from SocketTests
[ RUN      ] SocketTests.InitSocket
[       OK ] SocketTests.InitSocket (1 ms)
[----------] 1 test from SocketTests (1 ms total)

[----------] 3 tests from StrerrorTest
[ RUN      ] StrerrorTest.ValidErrno
[       OK ] StrerrorTest.ValidErrno (0 ms)
[ RUN      ] StrerrorTest.InvalidErrno
[       OK ] StrerrorTest.InvalidErrno (0 ms)
[ RUN      ] StrerrorTest.ValidHerrno
[       OK ] StrerrorTest.ValidHerrno (0 ms)
[----------] 3 tests from StrerrorTest (0 ms total)

[----------] 3 tests from SystemsTests
[ RUN      ] SystemsTests.Uname
[       OK ] SystemsTests.Uname (1 ms)
[ RUN      ] SystemsTests.Sysname
[       OK ] SystemsTests.Sysname (1 ms)
[ RUN      ] SystemsTests.Release
[       OK ] SystemsTests.Release (1 ms)
[----------] 3 tests from SystemsTests (3 ms total)

[----------] Global test environment tear-down
[==========] 223 tests from 39 test cases ran. (2106 ms total)
[  PASSED  ] 222 tests.
[  FAILED  ] 1 test, listed below:
[  FAILED  ] RmdirTest.RemoveDirectoryHangingSymlink

 1 FAILED TEST
  YOU HAVE 13 DISABLED TESTS


<https://builds.apache.org/job/Mesos-Reviewbot-Windows/ws/build>if> 1 NEQ 0 exit /b 1 

<https://builds.apache.org/job/Mesos-Reviewbot-Windows/ws/>if> 1 NEQ 0 exit /b 1 
Build step 'Execute Windows batch command' marked build as failure

Build failed in Jenkins: Mesos-Windows-Reviewbot #28

Posted by Apache Jenkins Server <je...@builds.apache.org>.
See <https://builds.apache.org/job/Mesos-Windows-Reviewbot/28/>

------------------------------------------
[...truncated 3969 lines...]
[ RUN      ] OsTest.Argv
[       OK ] OsTest.Argv (2 ms)
[ RUN      ] OsTest.System
'invalid.command' is not recognized as an internal or external command,
operable program or batch file.
[       OK ] OsTest.System (42 ms)
[ RUN      ] OsTest.BootId
[       OK ] OsTest.BootId (1 ms)
[ RUN      ] OsTest.TrivialUser
[       OK ] OsTest.TrivialUser (2 ms)
[----------] 4 tests from OsTest (47 ms total)

[----------] 2 tests from RecordIOTest
[ RUN      ] RecordIOTest.Encoder
[       OK ] RecordIOTest.Encoder (1 ms)
[ RUN      ] RecordIOTest.Decoder
[       OK ] RecordIOTest.Decoder (1 ms)
[----------] 2 tests from RecordIOTest (2 ms total)

[----------] 2 tests from ResultTest
[ RUN      ] ResultTest.TryToResultConversion
[       OK ] ResultTest.TryToResultConversion (0 ms)
[ RUN      ] ResultTest.ArrowOperator
[       OK ] ResultTest.ArrowOperator (0 ms)
[----------] 2 tests from ResultTest (0 ms total)

[----------] 1 test from SomeTest
[ RUN      ] SomeTest.Some
[       OK ] SomeTest.Some (0 ms)
[----------] 1 test from SomeTest (0 ms total)

[----------] 39 tests from StringsTest
[ RUN      ] StringsTest.Format
[       OK ] StringsTest.Format (0 ms)
[ RUN      ] StringsTest.Remove
[       OK ] StringsTest.Remove (1 ms)
[ RUN      ] StringsTest.Replace
[       OK ] StringsTest.Replace (0 ms)
[ RUN      ] StringsTest.Trim
[       OK ] StringsTest.Trim (0 ms)
[ RUN      ] StringsTest.Tokenize
[       OK ] StringsTest.Tokenize (0 ms)
[ RUN      ] StringsTest.TokenizeStringWithDelimsAtStart
[       OK ] StringsTest.TokenizeStringWithDelimsAtStart (0 ms)
[ RUN      ] StringsTest.TokenizeStringWithDelimsAtEnd
[       OK ] StringsTest.TokenizeStringWithDelimsAtEnd (0 ms)
[ RUN      ] StringsTest.TokenizeStringWithDelimsAtStartAndEnd
[       OK ] StringsTest.TokenizeStringWithDelimsAtStartAndEnd (0 ms)
[ RUN      ] StringsTest.TokenizeWithMultipleDelims
[       OK ] StringsTest.TokenizeWithMultipleDelims (0 ms)
[ RUN      ] StringsTest.TokenizeEmptyString
[       OK ] StringsTest.TokenizeEmptyString (0 ms)
[ RUN      ] StringsTest.TokenizeDelimOnlyString
[       OK ] StringsTest.TokenizeDelimOnlyString (0 ms)
[ RUN      ] StringsTest.TokenizeNullByteDelim
[       OK ] StringsTest.TokenizeNullByteDelim (0 ms)
[ RUN      ] StringsTest.TokenizeNZero
[       OK ] StringsTest.TokenizeNZero (0 ms)
[ RUN      ] StringsTest.TokenizeNOne
[       OK ] StringsTest.TokenizeNOne (0 ms)
[ RUN      ] StringsTest.TokenizeNDelimOnlyString
[       OK ] StringsTest.TokenizeNDelimOnlyString (0 ms)
[ RUN      ] StringsTest.TokenizeN
[       OK ] StringsTest.TokenizeN (1 ms)
[ RUN      ] StringsTest.TokenizeNStringWithDelimsAtStart
[       OK ] StringsTest.TokenizeNStringWithDelimsAtStart (0 ms)
[ RUN      ] StringsTest.TokenizeNStringWithDelimsAtEnd
[       OK ] StringsTest.TokenizeNStringWithDelimsAtEnd (0 ms)
[ RUN      ] StringsTest.TokenizeNStringWithDelimsAtStartAndEnd
[       OK ] StringsTest.TokenizeNStringWithDelimsAtStartAndEnd (0 ms)
[ RUN      ] StringsTest.TokenizeNWithMultipleDelims
[       OK ] StringsTest.TokenizeNWithMultipleDelims (0 ms)
[ RUN      ] StringsTest.SplitEmptyString
[       OK ] StringsTest.SplitEmptyString (0 ms)
[ RUN      ] StringsTest.SplitDelimOnlyString
[       OK ] StringsTest.SplitDelimOnlyString (0 ms)
[ RUN      ] StringsTest.Split
[       OK ] StringsTest.Split (0 ms)
[ RUN      ] StringsTest.SplitStringWithDelimsAtStart
[       OK ] StringsTest.SplitStringWithDelimsAtStart (0 ms)
[ RUN      ] StringsTest.SplitStringWithDelimsAtEnd
[       OK ] StringsTest.SplitStringWithDelimsAtEnd (1 ms)
[ RUN      ] StringsTest.SplitStringWithDelimsAtStartAndEnd
[       OK ] StringsTest.SplitStringWithDelimsAtStartAndEnd (0 ms)
[ RUN      ] StringsTest.SplitWithMultipleDelims
[       OK ] StringsTest.SplitWithMultipleDelims (0 ms)
[ RUN      ] StringsTest.SplitNZero
[       OK ] StringsTest.SplitNZero (0 ms)
[ RUN      ] StringsTest.SplitNOne
[       OK ] StringsTest.SplitNOne (0 ms)
[ RUN      ] StringsTest.SplitNDelimOnlyString
[       OK ] StringsTest.SplitNDelimOnlyString (0 ms)
[ RUN      ] StringsTest.SplitN
[       OK ] StringsTest.SplitN (0 ms)
[ RUN      ] StringsTest.SplitNStringWithDelimsAtStart
[       OK ] StringsTest.SplitNStringWithDelimsAtStart (0 ms)
[ RUN      ] StringsTest.SplitNStringWithDelimsAtEnd
[       OK ] StringsTest.SplitNStringWithDelimsAtEnd (0 ms)
[ RUN      ] StringsTest.SplitNStringWithDelimsAtStartAndEnd
[       OK ] StringsTest.SplitNStringWithDelimsAtStartAndEnd (0 ms)
[ RUN      ] StringsTest.SplitNWithMultipleDelims
[       OK ] StringsTest.SplitNWithMultipleDelims (0 ms)
[ RUN      ] StringsTest.Pairs
[       OK ] StringsTest.Pairs (1 ms)
[ RUN      ] StringsTest.Join
[       OK ] StringsTest.Join (0 ms)
[ RUN      ] StringsTest.StartsWith
[       OK ] StringsTest.StartsWith (0 ms)
[ RUN      ] StringsTest.Contains
[       OK ] StringsTest.Contains (1 ms)
[----------] 39 tests from StringsTest (10 ms total)

[----------] 2 tests from SubcommandTest
[ RUN      ] SubcommandTest.Flags
[       OK ] SubcommandTest.Flags (5 ms)
[ RUN      ] SubcommandTest.Dispatch
Subcommand 'subcommand' is not available
Usage: command <subcommand> [OPTIONS]

Available subcommands:
    help
    subcommand2

Multiple subcommands have name 'subcommand'
[       OK ] SubcommandTest.Dispatch (2 ms)
[----------] 2 tests from SubcommandTest (7 ms total)

[----------] 1 test from TryTest
[ RUN      ] TryTest.ArrowOperator
[       OK ] TryTest.ArrowOperator (0 ms)
[----------] 1 test from TryTest (0 ms total)

[----------] 2 tests from UUIDTest
[ RUN      ] UUIDTest.Test
[       OK ] UUIDTest.Test (5 ms)
[ RUN      ] UUIDTest.MalformedUUID
[       OK ] UUIDTest.MalformedUUID (0 ms)
[----------] 2 tests from UUIDTest (5 ms total)

[----------] 2 tests from VersionTest
[ RUN      ] VersionTest.Comparison
[       OK ] VersionTest.Comparison (0 ms)
[ RUN      ] VersionTest.Parse
[       OK ] VersionTest.Parse (1 ms)
[----------] 2 tests from VersionTest (2 ms total)

[----------] 1 test from EnvTest
[ RUN      ] EnvTest.SimpleEnvTest
[       OK ] EnvTest.SimpleEnvTest (0 ms)
[----------] 1 test from EnvTest (0 ms total)

[----------] 8 tests from FsTest
[ RUN      ] FsTest.Find
[       OK ] FsTest.Find (5 ms)
[ RUN      ] FsTest.ReadWriteString
[       OK ] FsTest.ReadWriteString (2 ms)
[ RUN      ] FsTest.Mkdir
[       OK ] FsTest.Mkdir (7 ms)
[ RUN      ] FsTest.Exists
[       OK ] FsTest.Exists (6 ms)
[ RUN      ] FsTest.Touch
[       OK ] FsTest.Touch (1 ms)
[ RUN      ] FsTest.List
[       OK ] FsTest.List (5 ms)
[ RUN      ] FsTest.Rename
[       OK ] FsTest.Rename (4 ms)
[ RUN      ] FsTest.Close
[       OK ] FsTest.Close (3 ms)
[----------] 8 tests from FsTest (35 ms total)

[----------] 4 tests from ProcessTest
[ RUN      ] ProcessTest.Process
[       OK ] ProcessTest.Process (5 ms)
[ RUN      ] ProcessTest.Processes
[       OK ] ProcessTest.Processes (82 ms)
[ RUN      ] ProcessTest.Pids
[       OK ] ProcessTest.Pids (22 ms)
[ RUN      ] ProcessTest.Pstree

Pinging 127.0.0.1 with 32 bytes of data:
Reply from 127.0.0.1: bytes=32 time<1ms TTL=128
Reply from 127.0.0.1: bytes=32 time<1ms TTL=128

Ping statistics for 127.0.0.1:
    Packets: Sent = 2, Received = 2, Lost = 0 (0% loss),
Approximate round trip times in milli-seconds:
    Minimum = 0ms, Maximum = 0ms, Average = 0ms
[       OK ] ProcessTest.Pstree (1107 ms)
[----------] 4 tests from ProcessTest (1217 ms total)

[----------] 8 tests from RmdirTest
[ RUN      ] RmdirTest.TrivialRemoveEmptyDirectoryAbsolutePath
[       OK ] RmdirTest.TrivialRemoveEmptyDirectoryAbsolutePath (4 ms)
[ RUN      ] RmdirTest.TrivialRemoveEmptyDirectoryRelativePath
[       OK ] RmdirTest.TrivialRemoveEmptyDirectoryRelativePath (3 ms)
[ RUN      ] RmdirTest.RemoveFile
[       OK ] RmdirTest.RemoveFile (7 ms)
[ RUN      ] RmdirTest.RemoveRecursiveByDefault
[       OK ] RmdirTest.RemoveRecursiveByDefault (4 ms)
[ RUN      ] RmdirTest.TrivialFailToRemoveInvalidPath
[       OK ] RmdirTest.TrivialFailToRemoveInvalidPath (1 ms)
[ RUN      ] RmdirTest.FailToRemoveNestedInvalidPath
[       OK ] RmdirTest.FailToRemoveNestedInvalidPath (3 ms)
[ RUN      ] RmdirTest.RemoveDirectoryHangingSymlink
F:\jenkins\jenkins-slave\workspace\Mesos-Windows-Reviewbot\3rdparty\stout\tests\os\rmdir_tests.cpp(313): error: fs::symlink("tmp", link): 'internal::windows::create_symbolic_link': 'CreateSymbolicLink' call failed: A required privilege is not held by the client.


[  FAILED  ] RmdirTest.RemoveDirectoryHangingSymlink (3 ms)
[ RUN      ] RmdirTest.RemoveDirectoryButPreserveRoot
[       OK ] RmdirTest.RemoveDirectoryButPreserveRoot (4 ms)
[----------] 8 tests from RmdirTest (30 ms total)

[----------] 1 test from SocketTests
[ RUN      ] SocketTests.InitSocket
[       OK ] SocketTests.InitSocket (0 ms)
[----------] 1 test from SocketTests (0 ms total)

[----------] 3 tests from StrerrorTest
[ RUN      ] StrerrorTest.ValidErrno
[       OK ] StrerrorTest.ValidErrno (1 ms)
[ RUN      ] StrerrorTest.InvalidErrno
[       OK ] StrerrorTest.InvalidErrno (0 ms)
[ RUN      ] StrerrorTest.ValidHerrno
[       OK ] StrerrorTest.ValidHerrno (0 ms)
[----------] 3 tests from StrerrorTest (1 ms total)

[----------] 3 tests from SystemsTests
[ RUN      ] SystemsTests.Uname
[       OK ] SystemsTests.Uname (1 ms)
[ RUN      ] SystemsTests.Sysname
[       OK ] SystemsTests.Sysname (1 ms)
[ RUN      ] SystemsTests.Release
[       OK ] SystemsTests.Release (1 ms)
[----------] 3 tests from SystemsTests (3 ms total)

[----------] Global test environment tear-down
[==========] 223 tests from 39 test cases ran. (2107 ms total)
[  PASSED  ] 222 tests.
[  FAILED  ] 1 test, listed below:
[  FAILED  ] RmdirTest.RemoveDirectoryHangingSymlink

 1 FAILED TEST
  YOU HAVE 13 DISABLED TESTS


<https://builds.apache.org/job/Mesos-Windows-Reviewbot/ws/build>if> 1 NEQ 0 exit /b 1 

<https://builds.apache.org/job/Mesos-Windows-Reviewbot/ws/>if> 1 NEQ 0 exit /b 1 
Build step 'Execute Windows batch command' marked build as failure

Build failed in Jenkins: Mesos-Windows-Reviewbot #27

Posted by Apache Jenkins Server <je...@builds.apache.org>.
See <https://builds.apache.org/job/Mesos-Windows-Reviewbot/27/changes>

Changes:

[anand] Added scheduler adapter to API client libraries doc.

------------------------------------------
[...truncated 3889 lines...]
[ RUN      ] OsTest.Argv
[       OK ] OsTest.Argv (1 ms)
[ RUN      ] OsTest.System
'invalid.command' is not recognized as an internal or external command,
operable program or batch file.
[       OK ] OsTest.System (47 ms)
[ RUN      ] OsTest.BootId
[       OK ] OsTest.BootId (1 ms)
[ RUN      ] OsTest.TrivialUser
[       OK ] OsTest.TrivialUser (4 ms)
[----------] 4 tests from OsTest (54 ms total)

[----------] 2 tests from RecordIOTest
[ RUN      ] RecordIOTest.Encoder
[       OK ] RecordIOTest.Encoder (0 ms)
[ RUN      ] RecordIOTest.Decoder
[       OK ] RecordIOTest.Decoder (1 ms)
[----------] 2 tests from RecordIOTest (1 ms total)

[----------] 2 tests from ResultTest
[ RUN      ] ResultTest.TryToResultConversion
[       OK ] ResultTest.TryToResultConversion (1 ms)
[ RUN      ] ResultTest.ArrowOperator
[       OK ] ResultTest.ArrowOperator (0 ms)
[----------] 2 tests from ResultTest (1 ms total)

[----------] 1 test from SomeTest
[ RUN      ] SomeTest.Some
[       OK ] SomeTest.Some (1 ms)
[----------] 1 test from SomeTest (1 ms total)

[----------] 39 tests from StringsTest
[ RUN      ] StringsTest.Format
[       OK ] StringsTest.Format (0 ms)
[ RUN      ] StringsTest.Remove
[       OK ] StringsTest.Remove (0 ms)
[ RUN      ] StringsTest.Replace
[       OK ] StringsTest.Replace (1 ms)
[ RUN      ] StringsTest.Trim
[       OK ] StringsTest.Trim (0 ms)
[ RUN      ] StringsTest.Tokenize
[       OK ] StringsTest.Tokenize (0 ms)
[ RUN      ] StringsTest.TokenizeStringWithDelimsAtStart
[       OK ] StringsTest.TokenizeStringWithDelimsAtStart (0 ms)
[ RUN      ] StringsTest.TokenizeStringWithDelimsAtEnd
[       OK ] StringsTest.TokenizeStringWithDelimsAtEnd (0 ms)
[ RUN      ] StringsTest.TokenizeStringWithDelimsAtStartAndEnd
[       OK ] StringsTest.TokenizeStringWithDelimsAtStartAndEnd (0 ms)
[ RUN      ] StringsTest.TokenizeWithMultipleDelims
[       OK ] StringsTest.TokenizeWithMultipleDelims (0 ms)
[ RUN      ] StringsTest.TokenizeEmptyString
[       OK ] StringsTest.TokenizeEmptyString (0 ms)
[ RUN      ] StringsTest.TokenizeDelimOnlyString
[       OK ] StringsTest.TokenizeDelimOnlyString (0 ms)
[ RUN      ] StringsTest.TokenizeNullByteDelim
[       OK ] StringsTest.TokenizeNullByteDelim (0 ms)
[ RUN      ] StringsTest.TokenizeNZero
[       OK ] StringsTest.TokenizeNZero (0 ms)
[ RUN      ] StringsTest.TokenizeNOne
[       OK ] StringsTest.TokenizeNOne (0 ms)
[ RUN      ] StringsTest.TokenizeNDelimOnlyString
[       OK ] StringsTest.TokenizeNDelimOnlyString (1 ms)
[ RUN      ] StringsTest.TokenizeN
[       OK ] StringsTest.TokenizeN (0 ms)
[ RUN      ] StringsTest.TokenizeNStringWithDelimsAtStart
[       OK ] StringsTest.TokenizeNStringWithDelimsAtStart (0 ms)
[ RUN      ] StringsTest.TokenizeNStringWithDelimsAtEnd
[       OK ] StringsTest.TokenizeNStringWithDelimsAtEnd (0 ms)
[ RUN      ] StringsTest.TokenizeNStringWithDelimsAtStartAndEnd
[       OK ] StringsTest.TokenizeNStringWithDelimsAtStartAndEnd (0 ms)
[ RUN      ] StringsTest.TokenizeNWithMultipleDelims
[       OK ] StringsTest.TokenizeNWithMultipleDelims (1 ms)
[ RUN      ] StringsTest.SplitEmptyString
[       OK ] StringsTest.SplitEmptyString (0 ms)
[ RUN      ] StringsTest.SplitDelimOnlyString
[       OK ] StringsTest.SplitDelimOnlyString (0 ms)
[ RUN      ] StringsTest.Split
[       OK ] StringsTest.Split (0 ms)
[ RUN      ] StringsTest.SplitStringWithDelimsAtStart
[       OK ] StringsTest.SplitStringWithDelimsAtStart (0 ms)
[ RUN      ] StringsTest.SplitStringWithDelimsAtEnd
[       OK ] StringsTest.SplitStringWithDelimsAtEnd (0 ms)
[ RUN      ] StringsTest.SplitStringWithDelimsAtStartAndEnd
[       OK ] StringsTest.SplitStringWithDelimsAtStartAndEnd (0 ms)
[ RUN      ] StringsTest.SplitWithMultipleDelims
[       OK ] StringsTest.SplitWithMultipleDelims (0 ms)
[ RUN      ] StringsTest.SplitNZero
[       OK ] StringsTest.SplitNZero (0 ms)
[ RUN      ] StringsTest.SplitNOne
[       OK ] StringsTest.SplitNOne (0 ms)
[ RUN      ] StringsTest.SplitNDelimOnlyString
[       OK ] StringsTest.SplitNDelimOnlyString (0 ms)
[ RUN      ] StringsTest.SplitN
[       OK ] StringsTest.SplitN (0 ms)
[ RUN      ] StringsTest.SplitNStringWithDelimsAtStart
[       OK ] StringsTest.SplitNStringWithDelimsAtStart (0 ms)
[ RUN      ] StringsTest.SplitNStringWithDelimsAtEnd
[       OK ] StringsTest.SplitNStringWithDelimsAtEnd (0 ms)
[ RUN      ] StringsTest.SplitNStringWithDelimsAtStartAndEnd
[       OK ] StringsTest.SplitNStringWithDelimsAtStartAndEnd (0 ms)
[ RUN      ] StringsTest.SplitNWithMultipleDelims
[       OK ] StringsTest.SplitNWithMultipleDelims (0 ms)
[ RUN      ] StringsTest.Pairs
[       OK ] StringsTest.Pairs (1 ms)
[ RUN      ] StringsTest.Join
[       OK ] StringsTest.Join (0 ms)
[ RUN      ] StringsTest.StartsWith
[       OK ] StringsTest.StartsWith (0 ms)
[ RUN      ] StringsTest.Contains
[       OK ] StringsTest.Contains (1 ms)
[----------] 39 tests from StringsTest (10 ms total)

[----------] 2 tests from SubcommandTest
[ RUN      ] SubcommandTest.Flags
[       OK ] SubcommandTest.Flags (6 ms)
[ RUN      ] SubcommandTest.Dispatch
Subcommand 'subcommand' is not available
Usage: command <subcommand> [OPTIONS]

Available subcommands:
    help
    subcommand2

Multiple subcommands have name 'subcommand'
[       OK ] SubcommandTest.Dispatch (3 ms)
[----------] 2 tests from SubcommandTest (9 ms total)

[----------] 1 test from TryTest
[ RUN      ] TryTest.ArrowOperator
[       OK ] TryTest.ArrowOperator (0 ms)
[----------] 1 test from TryTest (1 ms total)

[----------] 2 tests from UUIDTest
[ RUN      ] UUIDTest.Test
[       OK ] UUIDTest.Test (6 ms)
[ RUN      ] UUIDTest.MalformedUUID
[       OK ] UUIDTest.MalformedUUID (1 ms)
[----------] 2 tests from UUIDTest (8 ms total)

[----------] 2 tests from VersionTest
[ RUN      ] VersionTest.Comparison
[       OK ] VersionTest.Comparison (1 ms)
[ RUN      ] VersionTest.Parse
[       OK ] VersionTest.Parse (1 ms)
[----------] 2 tests from VersionTest (2 ms total)

[----------] 1 test from EnvTest
[ RUN      ] EnvTest.SimpleEnvTest
[       OK ] EnvTest.SimpleEnvTest (0 ms)
[----------] 1 test from EnvTest (1 ms total)

[----------] 8 tests from FsTest
[ RUN      ] FsTest.Find
[       OK ] FsTest.Find (5 ms)
[ RUN      ] FsTest.ReadWriteString
[       OK ] FsTest.ReadWriteString (1 ms)
[ RUN      ] FsTest.Mkdir
[       OK ] FsTest.Mkdir (7 ms)
[ RUN      ] FsTest.Exists
[       OK ] FsTest.Exists (6 ms)
[ RUN      ] FsTest.Touch
[       OK ] FsTest.Touch (1 ms)
[ RUN      ] FsTest.List
[       OK ] FsTest.List (4 ms)
[ RUN      ] FsTest.Rename
[       OK ] FsTest.Rename (4 ms)
[ RUN      ] FsTest.Close
[       OK ] FsTest.Close (5 ms)
[----------] 8 tests from FsTest (34 ms total)

[----------] 4 tests from ProcessTest
[ RUN      ] ProcessTest.Process
[       OK ] ProcessTest.Process (5 ms)
[ RUN      ] ProcessTest.Processes
[       OK ] ProcessTest.Processes (53 ms)
[ RUN      ] ProcessTest.Pids
[       OK ] ProcessTest.Pids (18 ms)
[ RUN      ] ProcessTest.Pstree

Pinging 127.0.0.1 with 32 bytes of data:
Reply from 127.0.0.1: bytes=32 time<1ms TTL=128
Reply from 127.0.0.1: bytes=32 time<1ms TTL=128

Ping statistics for 127.0.0.1:
    Packets: Sent = 2, Received = 2, Lost = 0 (0% loss),
Approximate round trip times in milli-seconds:
    Minimum = 0ms, Maximum = 0ms, Average = 0ms
[       OK ] ProcessTest.Pstree (1077 ms)
[----------] 4 tests from ProcessTest (1154 ms total)

[----------] 8 tests from RmdirTest
[ RUN      ] RmdirTest.TrivialRemoveEmptyDirectoryAbsolutePath
[       OK ] RmdirTest.TrivialRemoveEmptyDirectoryAbsolutePath (2 ms)
[ RUN      ] RmdirTest.TrivialRemoveEmptyDirectoryRelativePath
[       OK ] RmdirTest.TrivialRemoveEmptyDirectoryRelativePath (2 ms)
[ RUN      ] RmdirTest.RemoveFile
[       OK ] RmdirTest.RemoveFile (4 ms)
[ RUN      ] RmdirTest.RemoveRecursiveByDefault
[       OK ] RmdirTest.RemoveRecursiveByDefault (3 ms)
[ RUN      ] RmdirTest.TrivialFailToRemoveInvalidPath
[       OK ] RmdirTest.TrivialFailToRemoveInvalidPath (1 ms)
[ RUN      ] RmdirTest.FailToRemoveNestedInvalidPath
[       OK ] RmdirTest.FailToRemoveNestedInvalidPath (3 ms)
[ RUN      ] RmdirTest.RemoveDirectoryHangingSymlink
F:\jenkins\jenkins-slave\workspace\Mesos-Windows-Reviewbot\3rdparty\stout\tests\os\rmdir_tests.cpp(313): error: fs::symlink("tmp", link): 'internal::windows::create_symbolic_link': 'CreateSymbolicLink' call failed: A required privilege is not held by the client.


[  FAILED  ] RmdirTest.RemoveDirectoryHangingSymlink (10 ms)
[ RUN      ] RmdirTest.RemoveDirectoryButPreserveRoot
[       OK ] RmdirTest.RemoveDirectoryButPreserveRoot (4 ms)
[----------] 8 tests from RmdirTest (29 ms total)

[----------] 1 test from SocketTests
[ RUN      ] SocketTests.InitSocket
[       OK ] SocketTests.InitSocket (2 ms)
[----------] 1 test from SocketTests (2 ms total)

[----------] 3 tests from StrerrorTest
[ RUN      ] StrerrorTest.ValidErrno
[       OK ] StrerrorTest.ValidErrno (0 ms)
[ RUN      ] StrerrorTest.InvalidErrno
[       OK ] StrerrorTest.InvalidErrno (0 ms)
[ RUN      ] StrerrorTest.ValidHerrno
[       OK ] StrerrorTest.ValidHerrno (0 ms)
[----------] 3 tests from StrerrorTest (1 ms total)

[----------] 3 tests from SystemsTests
[ RUN      ] SystemsTests.Uname
[       OK ] SystemsTests.Uname (1 ms)
[ RUN      ] SystemsTests.Sysname
[       OK ] SystemsTests.Sysname (1 ms)
[ RUN      ] SystemsTests.Release
[       OK ] SystemsTests.Release (1 ms)
[----------] 3 tests from SystemsTests (3 ms total)

[----------] Global test environment tear-down
[==========] 223 tests from 39 test cases ran. (2010 ms total)
[  PASSED  ] 222 tests.
[  FAILED  ] 1 test, listed below:
[  FAILED  ] RmdirTest.RemoveDirectoryHangingSymlink

 1 FAILED TEST
  YOU HAVE 13 DISABLED TESTS


<https://builds.apache.org/job/Mesos-Windows-Reviewbot/ws/build>if> 1 NEQ 0 exit /b 1 

<https://builds.apache.org/job/Mesos-Windows-Reviewbot/ws/>if> 1 NEQ 0 exit /b 1 
Build step 'Execute Windows batch command' marked build as failure

Build failed in Jenkins: Mesos-Windows-Reviewbot #26

Posted by Apache Jenkins Server <je...@builds.apache.org>.
See <https://builds.apache.org/job/Mesos-Windows-Reviewbot/26/changes>

Changes:

[haosdent] Fixed body padding in mobile WebUI.

------------------------------------------
[...truncated 3865 lines...]
[ RUN      ] OsTest.Argv
[       OK ] OsTest.Argv (1 ms)
[ RUN      ] OsTest.System
'invalid.command' is not recognized as an internal or external command,
operable program or batch file.
[       OK ] OsTest.System (42 ms)
[ RUN      ] OsTest.BootId
[       OK ] OsTest.BootId (1 ms)
[ RUN      ] OsTest.TrivialUser
[       OK ] OsTest.TrivialUser (10 ms)
[----------] 4 tests from OsTest (54 ms total)

[----------] 2 tests from RecordIOTest
[ RUN      ] RecordIOTest.Encoder
[       OK ] RecordIOTest.Encoder (1 ms)
[ RUN      ] RecordIOTest.Decoder
[       OK ] RecordIOTest.Decoder (1 ms)
[----------] 2 tests from RecordIOTest (2 ms total)

[----------] 2 tests from ResultTest
[ RUN      ] ResultTest.TryToResultConversion
[       OK ] ResultTest.TryToResultConversion (0 ms)
[ RUN      ] ResultTest.ArrowOperator
[       OK ] ResultTest.ArrowOperator (0 ms)
[----------] 2 tests from ResultTest (1 ms total)

[----------] 1 test from SomeTest
[ RUN      ] SomeTest.Some
[       OK ] SomeTest.Some (0 ms)
[----------] 1 test from SomeTest (0 ms total)

[----------] 39 tests from StringsTest
[ RUN      ] StringsTest.Format
[       OK ] StringsTest.Format (1 ms)
[ RUN      ] StringsTest.Remove
[       OK ] StringsTest.Remove (0 ms)
[ RUN      ] StringsTest.Replace
[       OK ] StringsTest.Replace (0 ms)
[ RUN      ] StringsTest.Trim
[       OK ] StringsTest.Trim (1 ms)
[ RUN      ] StringsTest.Tokenize
[       OK ] StringsTest.Tokenize (0 ms)
[ RUN      ] StringsTest.TokenizeStringWithDelimsAtStart
[       OK ] StringsTest.TokenizeStringWithDelimsAtStart (0 ms)
[ RUN      ] StringsTest.TokenizeStringWithDelimsAtEnd
[       OK ] StringsTest.TokenizeStringWithDelimsAtEnd (0 ms)
[ RUN      ] StringsTest.TokenizeStringWithDelimsAtStartAndEnd
[       OK ] StringsTest.TokenizeStringWithDelimsAtStartAndEnd (0 ms)
[ RUN      ] StringsTest.TokenizeWithMultipleDelims
[       OK ] StringsTest.TokenizeWithMultipleDelims (0 ms)
[ RUN      ] StringsTest.TokenizeEmptyString
[       OK ] StringsTest.TokenizeEmptyString (0 ms)
[ RUN      ] StringsTest.TokenizeDelimOnlyString
[       OK ] StringsTest.TokenizeDelimOnlyString (0 ms)
[ RUN      ] StringsTest.TokenizeNullByteDelim
[       OK ] StringsTest.TokenizeNullByteDelim (1 ms)
[ RUN      ] StringsTest.TokenizeNZero
[       OK ] StringsTest.TokenizeNZero (0 ms)
[ RUN      ] StringsTest.TokenizeNOne
[       OK ] StringsTest.TokenizeNOne (0 ms)
[ RUN      ] StringsTest.TokenizeNDelimOnlyString
[       OK ] StringsTest.TokenizeNDelimOnlyString (0 ms)
[ RUN      ] StringsTest.TokenizeN
[       OK ] StringsTest.TokenizeN (0 ms)
[ RUN      ] StringsTest.TokenizeNStringWithDelimsAtStart
[       OK ] StringsTest.TokenizeNStringWithDelimsAtStart (0 ms)
[ RUN      ] StringsTest.TokenizeNStringWithDelimsAtEnd
[       OK ] StringsTest.TokenizeNStringWithDelimsAtEnd (0 ms)
[ RUN      ] StringsTest.TokenizeNStringWithDelimsAtStartAndEnd
[       OK ] StringsTest.TokenizeNStringWithDelimsAtStartAndEnd (0 ms)
[ RUN      ] StringsTest.TokenizeNWithMultipleDelims
[       OK ] StringsTest.TokenizeNWithMultipleDelims (0 ms)
[ RUN      ] StringsTest.SplitEmptyString
[       OK ] StringsTest.SplitEmptyString (0 ms)
[ RUN      ] StringsTest.SplitDelimOnlyString
[       OK ] StringsTest.SplitDelimOnlyString (0 ms)
[ RUN      ] StringsTest.Split
[       OK ] StringsTest.Split (0 ms)
[ RUN      ] StringsTest.SplitStringWithDelimsAtStart
[       OK ] StringsTest.SplitStringWithDelimsAtStart (0 ms)
[ RUN      ] StringsTest.SplitStringWithDelimsAtEnd
[       OK ] StringsTest.SplitStringWithDelimsAtEnd (0 ms)
[ RUN      ] StringsTest.SplitStringWithDelimsAtStartAndEnd
[       OK ] StringsTest.SplitStringWithDelimsAtStartAndEnd (0 ms)
[ RUN      ] StringsTest.SplitWithMultipleDelims
[       OK ] StringsTest.SplitWithMultipleDelims (1 ms)
[ RUN      ] StringsTest.SplitNZero
[       OK ] StringsTest.SplitNZero (0 ms)
[ RUN      ] StringsTest.SplitNOne
[       OK ] StringsTest.SplitNOne (0 ms)
[ RUN      ] StringsTest.SplitNDelimOnlyString
[       OK ] StringsTest.SplitNDelimOnlyString (0 ms)
[ RUN      ] StringsTest.SplitN
[       OK ] StringsTest.SplitN (0 ms)
[ RUN      ] StringsTest.SplitNStringWithDelimsAtStart
[       OK ] StringsTest.SplitNStringWithDelimsAtStart (0 ms)
[ RUN      ] StringsTest.SplitNStringWithDelimsAtEnd
[       OK ] StringsTest.SplitNStringWithDelimsAtEnd (0 ms)
[ RUN      ] StringsTest.SplitNStringWithDelimsAtStartAndEnd
[       OK ] StringsTest.SplitNStringWithDelimsAtStartAndEnd (0 ms)
[ RUN      ] StringsTest.SplitNWithMultipleDelims
[       OK ] StringsTest.SplitNWithMultipleDelims (0 ms)
[ RUN      ] StringsTest.Pairs
[       OK ] StringsTest.Pairs (1 ms)
[ RUN      ] StringsTest.Join
[       OK ] StringsTest.Join (1 ms)
[ RUN      ] StringsTest.StartsWith
[       OK ] StringsTest.StartsWith (0 ms)
[ RUN      ] StringsTest.Contains
[       OK ] StringsTest.Contains (0 ms)
[----------] 39 tests from StringsTest (10 ms total)

[----------] 2 tests from SubcommandTest
[ RUN      ] SubcommandTest.Flags
[       OK ] SubcommandTest.Flags (6 ms)
[ RUN      ] SubcommandTest.Dispatch
Subcommand 'subcommand' is not available
Usage: command <subcommand> [OPTIONS]

Available subcommands:
    help
    subcommand2

Multiple subcommands have name 'subcommand'
[       OK ] SubcommandTest.Dispatch (2 ms)
[----------] 2 tests from SubcommandTest (8 ms total)

[----------] 1 test from TryTest
[ RUN      ] TryTest.ArrowOperator
[       OK ] TryTest.ArrowOperator (0 ms)
[----------] 1 test from TryTest (0 ms total)

[----------] 2 tests from UUIDTest
[ RUN      ] UUIDTest.Test
[       OK ] UUIDTest.Test (4 ms)
[ RUN      ] UUIDTest.MalformedUUID
[       OK ] UUIDTest.MalformedUUID (0 ms)
[----------] 2 tests from UUIDTest (4 ms total)

[----------] 2 tests from VersionTest
[ RUN      ] VersionTest.Comparison
[       OK ] VersionTest.Comparison (0 ms)
[ RUN      ] VersionTest.Parse
[       OK ] VersionTest.Parse (1 ms)
[----------] 2 tests from VersionTest (1 ms total)

[----------] 1 test from EnvTest
[ RUN      ] EnvTest.SimpleEnvTest
[       OK ] EnvTest.SimpleEnvTest (0 ms)
[----------] 1 test from EnvTest (0 ms total)

[----------] 8 tests from FsTest
[ RUN      ] FsTest.Find
[       OK ] FsTest.Find (5 ms)
[ RUN      ] FsTest.ReadWriteString
[       OK ] FsTest.ReadWriteString (1 ms)
[ RUN      ] FsTest.Mkdir
[       OK ] FsTest.Mkdir (6 ms)
[ RUN      ] FsTest.Exists
[       OK ] FsTest.Exists (4 ms)
[ RUN      ] FsTest.Touch
[       OK ] FsTest.Touch (1 ms)
[ RUN      ] FsTest.List
[       OK ] FsTest.List (4 ms)
[ RUN      ] FsTest.Rename
[       OK ] FsTest.Rename (4 ms)
[ RUN      ] FsTest.Close
[       OK ] FsTest.Close (9 ms)
[----------] 8 tests from FsTest (36 ms total)

[----------] 4 tests from ProcessTest
[ RUN      ] ProcessTest.Process
[       OK ] ProcessTest.Process (4 ms)
[ RUN      ] ProcessTest.Processes
[       OK ] ProcessTest.Processes (48 ms)
[ RUN      ] ProcessTest.Pids
[       OK ] ProcessTest.Pids (19 ms)
[ RUN      ] ProcessTest.Pstree

Pinging 127.0.0.1 with 32 bytes of data:
Reply from 127.0.0.1: bytes=32 time<1ms TTL=128
Reply from 127.0.0.1: bytes=32 time<1ms TTL=128

Ping statistics for 127.0.0.1:
    Packets: Sent = 2, Received = 2, Lost = 0 (0% loss),
Approximate round trip times in milli-seconds:
    Minimum = 0ms, Maximum = 0ms, Average = 0ms
[       OK ] ProcessTest.Pstree (1094 ms)
[----------] 4 tests from ProcessTest (1165 ms total)

[----------] 8 tests from RmdirTest
[ RUN      ] RmdirTest.TrivialRemoveEmptyDirectoryAbsolutePath
[       OK ] RmdirTest.TrivialRemoveEmptyDirectoryAbsolutePath (3 ms)
[ RUN      ] RmdirTest.TrivialRemoveEmptyDirectoryRelativePath
[       OK ] RmdirTest.TrivialRemoveEmptyDirectoryRelativePath (2 ms)
[ RUN      ] RmdirTest.RemoveFile
[       OK ] RmdirTest.RemoveFile (4 ms)
[ RUN      ] RmdirTest.RemoveRecursiveByDefault
[       OK ] RmdirTest.RemoveRecursiveByDefault (3 ms)
[ RUN      ] RmdirTest.TrivialFailToRemoveInvalidPath
[       OK ] RmdirTest.TrivialFailToRemoveInvalidPath (1 ms)
[ RUN      ] RmdirTest.FailToRemoveNestedInvalidPath
[       OK ] RmdirTest.FailToRemoveNestedInvalidPath (2 ms)
[ RUN      ] RmdirTest.RemoveDirectoryHangingSymlink
F:\jenkins\jenkins-slave\workspace\Mesos-Windows-Reviewbot\3rdparty\stout\tests\os\rmdir_tests.cpp(313): error: fs::symlink("tmp", link): 'internal::windows::create_symbolic_link': 'CreateSymbolicLink' call failed: A required privilege is not held by the client.


[  FAILED  ] RmdirTest.RemoveDirectoryHangingSymlink (7 ms)
[ RUN      ] RmdirTest.RemoveDirectoryButPreserveRoot
[       OK ] RmdirTest.RemoveDirectoryButPreserveRoot (4 ms)
[----------] 8 tests from RmdirTest (27 ms total)

[----------] 1 test from SocketTests
[ RUN      ] SocketTests.InitSocket
[       OK ] SocketTests.InitSocket (1 ms)
[----------] 1 test from SocketTests (1 ms total)

[----------] 3 tests from StrerrorTest
[ RUN      ] StrerrorTest.ValidErrno
[       OK ] StrerrorTest.ValidErrno (0 ms)
[ RUN      ] StrerrorTest.InvalidErrno
[       OK ] StrerrorTest.InvalidErrno (0 ms)
[ RUN      ] StrerrorTest.ValidHerrno
[       OK ] StrerrorTest.ValidHerrno (0 ms)
[----------] 3 tests from StrerrorTest (1 ms total)

[----------] 3 tests from SystemsTests
[ RUN      ] SystemsTests.Uname
[       OK ] SystemsTests.Uname (1 ms)
[ RUN      ] SystemsTests.Sysname
[       OK ] SystemsTests.Sysname (1 ms)
[ RUN      ] SystemsTests.Release
[       OK ] SystemsTests.Release (1 ms)
[----------] 3 tests from SystemsTests (3 ms total)

[----------] Global test environment tear-down
[==========] 223 tests from 39 test cases ran. (2087 ms total)
[  PASSED  ] 222 tests.
[  FAILED  ] 1 test, listed below:
[  FAILED  ] RmdirTest.RemoveDirectoryHangingSymlink

 1 FAILED TEST
  YOU HAVE 13 DISABLED TESTS


<https://builds.apache.org/job/Mesos-Windows-Reviewbot/ws/build>if> 1 NEQ 0 exit /b 1 

<https://builds.apache.org/job/Mesos-Windows-Reviewbot/ws/>if> 1 NEQ 0 exit /b 1 
Build step 'Execute Windows batch command' marked build as failure