You are viewing a plain text version of this content. The canonical link for it is here.
Posted to commits@phoenix.apache.org by Apache Jenkins Server <je...@builds.apache.org> on 2019/06/17 20:31:42 UTC

Build failed in Jenkins: Phoenix-4.x-HBase-1.5 #47

See <https://builds.apache.org/job/Phoenix-4.x-HBase-1.5/47/display/redirect?page=changes>

Changes:

[larsh] PHOENIX-5348 increase batch size from 1 to 1000.

------------------------------------------
[...truncated 169.93 KB...]
[INFO] Tests run: 8, Failures: 0, Errors: 0, Skipped: 0, Time elapsed: 20.55 s - in org.apache.phoenix.tx.FlappingTransactionIT
[INFO] Running org.apache.phoenix.tx.TransactionIT
[INFO] Tests run: 15, Failures: 0, Errors: 0, Skipped: 0, Time elapsed: 167.065 s - in org.apache.phoenix.end2end.join.SubqueryUsingSortMergeJoinIT
[INFO] Tests run: 8, Failures: 0, Errors: 0, Skipped: 0, Time elapsed: 42.184 s - in org.apache.phoenix.rpc.UpdateCacheIT
[INFO] Running org.apache.phoenix.util.IndexScrutinyIT
[INFO] Tests run: 24, Failures: 0, Errors: 0, Skipped: 0, Time elapsed: 229.171 s - in org.apache.phoenix.end2end.join.SubqueryIT
[INFO] Tests run: 3, Failures: 0, Errors: 0, Skipped: 0, Time elapsed: 17.694 s - in org.apache.phoenix.util.IndexScrutinyIT
[INFO] Running org.apache.phoenix.tx.TxCheckpointIT
[INFO] Tests run: 34, Failures: 0, Errors: 0, Skipped: 0, Time elapsed: 598.597 s - in org.apache.phoenix.end2end.join.HashJoinLocalIndexIT
[INFO] Tests run: 28, Failures: 0, Errors: 0, Skipped: 0, Time elapsed: 176.103 s - in org.apache.phoenix.tx.TransactionIT
[INFO] Tests run: 34, Failures: 0, Errors: 0, Skipped: 0, Time elapsed: 598.951 s - in org.apache.phoenix.end2end.join.SortMergeJoinLocalIndexIT
[INFO] Tests run: 50, Failures: 0, Errors: 0, Skipped: 0, Time elapsed: 346.495 s - in org.apache.phoenix.tx.TxCheckpointIT
[INFO] Tests run: 66, Failures: 0, Errors: 0, Skipped: 0, Time elapsed: 416.076 s - in org.apache.phoenix.tx.ParameterizedTransactionIT
[INFO] 
[INFO] Results:
[INFO] 
[ERROR] Errors: 
[ERROR]   RowValueConstructorIT.testQueryMoreWithLeadingPKColSkippedInRowValueConstructor:544->_testQueryMoreWithLeadingPKColSkippedInRowValueConstructor:584 » PhoenixIO
[ERROR]   RowValueConstructorIT.testQueryMoreWithLeadingPKColSkippedInRowValueConstructor_salted:549->_testQueryMoreWithLeadingPKColSkippedInRowValueConstructor:584 » PhoenixIO
[ERROR]   RowValueConstructorIT.testQueryMoreWithSubsetofPKColsInRowValueConstructor:472->_testQueryMoreWithSubsetofPKColsInRowValueConstructor:515 » PhoenixIO
[ERROR]   RowValueConstructorIT.testQueryMoreWithSubsetofPKColsInRowValueConstructor_salted:477->_testQueryMoreWithSubsetofPKColsInRowValueConstructor:515 » PhoenixIO
[INFO] 
[ERROR] Tests run: 3765, Failures: 0, Errors: 4, Skipped: 2
[INFO] 
[INFO] 
[INFO] --- maven-failsafe-plugin:2.20:integration-test (HBaseManagedTimeTests) @ phoenix-core ---
[INFO] 
[INFO] -------------------------------------------------------
[INFO]  T E S T S
[INFO] -------------------------------------------------------
[INFO] 
[INFO] Results:
[INFO] 
[INFO] Tests run: 0, Failures: 0, Errors: 0, Skipped: 0
[INFO] 
[INFO] 
[INFO] --- maven-failsafe-plugin:2.20:integration-test (NeedTheirOwnClusterTests) @ phoenix-core ---
[INFO] 
[INFO] -------------------------------------------------------
[INFO]  T E S T S
[INFO] -------------------------------------------------------
[INFO] Running org.apache.hadoop.hbase.regionserver.wal.WALReplayWithIndexWritesAndCompressedWALIT
[WARNING] Tests run: 1, Failures: 0, Errors: 0, Skipped: 1, Time elapsed: 0.003 s - in org.apache.hadoop.hbase.regionserver.wal.WALReplayWithIndexWritesAndCompressedWALIT
[INFO] Running org.apache.phoenix.end2end.ConnectionUtilIT
[INFO] Running org.apache.hadoop.hbase.regionserver.wal.WALRecoveryRegionPostOpenIT
[INFO] Running org.apache.phoenix.end2end.ConcurrentMutationsExtendedIT
[INFO] Running org.apache.phoenix.end2end.CsvBulkLoadToolIT
[INFO] Running org.apache.phoenix.end2end.CountDistinctCompressionIT
[INFO] Tests run: 1, Failures: 0, Errors: 0, Skipped: 0, Time elapsed: 17.927 s - in org.apache.hadoop.hbase.regionserver.wal.WALRecoveryRegionPostOpenIT
[INFO] Running org.apache.phoenix.end2end.ContextClassloaderIT
[INFO] Tests run: 1, Failures: 0, Errors: 0, Skipped: 0, Time elapsed: 8.493 s - in org.apache.phoenix.end2end.CountDistinctCompressionIT
[INFO] Tests run: 1, Failures: 0, Errors: 0, Skipped: 0, Time elapsed: 40.206 s - in org.apache.phoenix.end2end.ConnectionUtilIT
[INFO] Running org.apache.phoenix.end2end.CostBasedDecisionIT
[INFO] Tests run: 3, Failures: 0, Errors: 0, Skipped: 0, Time elapsed: 2.481 s - in org.apache.phoenix.end2end.ContextClassloaderIT
[INFO] Running org.apache.phoenix.end2end.DropSchemaIT
[INFO] Running org.apache.phoenix.end2end.IndexBuildTimestampIT
[INFO] Running org.apache.phoenix.end2end.FlappingLocalIndexIT
[INFO] Running org.apache.phoenix.end2end.IndexExtendedIT
[INFO] Tests run: 2, Failures: 0, Errors: 0, Skipped: 0, Time elapsed: 26.006 s - in org.apache.phoenix.end2end.DropSchemaIT
[INFO] Tests run: 14, Failures: 0, Errors: 0, Skipped: 0, Time elapsed: 101.155 s - in org.apache.phoenix.end2end.CsvBulkLoadToolIT
[INFO] Running org.apache.phoenix.end2end.IndexRebuildTaskIT
[INFO] Tests run: 1, Failures: 0, Errors: 0, Skipped: 0, Time elapsed: 15.657 s - in org.apache.phoenix.end2end.IndexRebuildTaskIT
[INFO] Running org.apache.phoenix.end2end.IndexToolForPartialBuildIT
[INFO] Tests run: 1, Failures: 0, Errors: 0, Skipped: 0, Time elapsed: 10.85 s - in org.apache.phoenix.end2end.IndexToolForPartialBuildIT
[INFO] Running org.apache.phoenix.end2end.IndexToolForPartialBuildWithNamespaceEnabledIT
[INFO] Running org.apache.phoenix.end2end.IndexToolIT
[INFO] Tests run: 16, Failures: 0, Errors: 0, Skipped: 0, Time elapsed: 137.515 s - in org.apache.phoenix.end2end.IndexBuildTimestampIT
[INFO] Tests run: 2, Failures: 0, Errors: 0, Skipped: 0, Time elapsed: 21.111 s - in org.apache.phoenix.end2end.IndexToolForPartialBuildWithNamespaceEnabledIT
[INFO] Tests run: 12, Failures: 0, Errors: 0, Skipped: 0, Time elapsed: 148.52 s - in org.apache.phoenix.end2end.FlappingLocalIndexIT
[INFO] Tests run: 32, Failures: 0, Errors: 0, Skipped: 0, Time elapsed: 152.971 s - in org.apache.phoenix.end2end.IndexExtendedIT
[INFO] Running org.apache.phoenix.end2end.MigrateSystemTablesToSystemNamespaceIT
[INFO] Running org.apache.phoenix.end2end.PartialResultServerConfigurationIT
[INFO] Running org.apache.phoenix.end2end.PermissionNSDisabledIT
[INFO] Running org.apache.phoenix.end2end.LocalIndexSplitMergeIT
[INFO] Tests run: 1, Failures: 0, Errors: 0, Skipped: 0, Time elapsed: 36.207 s - in org.apache.phoenix.end2end.PartialResultServerConfigurationIT
[INFO] Running org.apache.phoenix.end2end.PermissionNSEnabledIT
[INFO] Tests run: 10, Failures: 0, Errors: 0, Skipped: 0, Time elapsed: 349.135 s - in org.apache.phoenix.end2end.ConcurrentMutationsExtendedIT
[INFO] Running org.apache.phoenix.end2end.PermissionsCacheIT
[INFO] Tests run: 8, Failures: 0, Errors: 0, Skipped: 0, Time elapsed: 168.533 s - in org.apache.phoenix.end2end.PermissionNSDisabledIT
[INFO] Tests run: 20, Failures: 0, Errors: 0, Skipped: 0, Time elapsed: 415.775 s - in org.apache.phoenix.end2end.CostBasedDecisionIT
[INFO] Running org.apache.phoenix.end2end.PhoenixDriverIT
[INFO] Tests run: 9, Failures: 0, Errors: 0, Skipped: 0, Time elapsed: 174.333 s - in org.apache.phoenix.end2end.PermissionNSEnabledIT
[INFO] Running org.apache.phoenix.end2end.QueryLoggerIT
[INFO] Tests run: 4, Failures: 0, Errors: 0, Skipped: 0, Time elapsed: 57.28 s - in org.apache.phoenix.end2end.PhoenixDriverIT
[INFO] Running org.apache.phoenix.end2end.QueryTimeoutIT
[INFO] Tests run: 2, Failures: 0, Errors: 0, Skipped: 0, Time elapsed: 6.493 s - in org.apache.phoenix.end2end.QueryTimeoutIT
[INFO] Tests run: 4, Failures: 0, Errors: 0, Skipped: 0, Time elapsed: 301.015 s - in org.apache.phoenix.end2end.MigrateSystemTablesToSystemNamespaceIT
[INFO] Tests run: 7, Failures: 0, Errors: 0, Skipped: 0, Time elapsed: 49.834 s - in org.apache.phoenix.end2end.QueryLoggerIT
[INFO] Tests run: 9, Failures: 0, Errors: 0, Skipped: 0, Time elapsed: 174.564 s - in org.apache.phoenix.end2end.PermissionsCacheIT
[INFO] Running org.apache.phoenix.end2end.QueryWithLimitIT
[INFO] Tests run: 2, Failures: 0, Errors: 0, Skipped: 0, Time elapsed: 4.886 s - in org.apache.phoenix.end2end.QueryWithLimitIT
[INFO] Running org.apache.phoenix.end2end.RegexBulkLoadToolIT
[INFO] Running org.apache.phoenix.end2end.RebuildIndexConnectionPropsIT
[INFO] Tests run: 1, Failures: 0, Errors: 0, Skipped: 0, Time elapsed: 0.329 s - in org.apache.phoenix.end2end.RebuildIndexConnectionPropsIT
[INFO] Running org.apache.phoenix.end2end.RenewLeaseIT
[INFO] Running org.apache.phoenix.end2end.SequencePointInTimeIT
[INFO] Tests run: 1, Failures: 0, Errors: 0, Skipped: 0, Time elapsed: 0.104 s - in org.apache.phoenix.end2end.SequencePointInTimeIT
[INFO] Running org.apache.phoenix.end2end.SystemCatalogCreationOnConnectionIT
[INFO] Tests run: 1, Failures: 0, Errors: 0, Skipped: 0, Time elapsed: 26.426 s - in org.apache.phoenix.end2end.RenewLeaseIT
[INFO] Running org.apache.phoenix.end2end.SpillableGroupByIT
[INFO] Tests run: 3, Failures: 0, Errors: 0, Skipped: 0, Time elapsed: 10.377 s - in org.apache.phoenix.end2end.SpillableGroupByIT
[INFO] Running org.apache.phoenix.end2end.StatsEnabledSplitSystemCatalogIT
[INFO] Tests run: 10, Failures: 0, Errors: 0, Skipped: 0, Time elapsed: 70.79 s - in org.apache.phoenix.end2end.RegexBulkLoadToolIT
[INFO] Running org.apache.phoenix.end2end.SystemCatalogIT
[INFO] Running org.apache.phoenix.end2end.TableSnapshotReadsMapReduceIT
[INFO] Running org.apache.phoenix.end2end.UpdateCacheAcrossDifferentClientsIT
[INFO] Tests run: 4, Failures: 0, Errors: 0, Skipped: 0, Time elapsed: 29.882 s - in org.apache.phoenix.end2end.TableSnapshotReadsMapReduceIT
[INFO] Tests run: 18, Failures: 0, Errors: 0, Skipped: 0, Time elapsed: 77.412 s - in org.apache.phoenix.end2end.StatsEnabledSplitSystemCatalogIT
[INFO] Tests run: 2, Failures: 0, Errors: 0, Skipped: 0, Time elapsed: 62.664 s - in org.apache.phoenix.end2end.SystemCatalogIT
[INFO] Tests run: 3, Failures: 0, Errors: 0, Skipped: 0, Time elapsed: 453.873 s - in org.apache.phoenix.end2end.LocalIndexSplitMergeIT
[INFO] Running org.apache.phoenix.end2end.UpgradeIT
[INFO] Tests run: 6, Failures: 0, Errors: 0, Skipped: 0, Time elapsed: 68.79 s - in org.apache.phoenix.end2end.UpdateCacheAcrossDifferentClientsIT
[INFO] Running org.apache.phoenix.end2end.UserDefinedFunctionsIT
[INFO] Running org.apache.phoenix.end2end.index.GlobalIndexCheckerIT
[INFO] Running org.apache.phoenix.end2end.index.ImmutableIndexIT
[INFO] Running org.apache.phoenix.end2end.index.IndexRebuildIncrementDisableCountIT
[INFO] Tests run: 2, Failures: 0, Errors: 0, Skipped: 0, Time elapsed: 10.915 s - in org.apache.phoenix.end2end.index.IndexRebuildIncrementDisableCountIT
[INFO] Tests run: 9, Failures: 0, Errors: 0, Skipped: 0, Time elapsed: 97.964 s - in org.apache.phoenix.end2end.UpgradeIT
[INFO] Running org.apache.phoenix.end2end.index.LocalIndexIT
[INFO] Tests run: 16, Failures: 0, Errors: 0, Skipped: 0, Time elapsed: 108.992 s - in org.apache.phoenix.end2end.index.GlobalIndexCheckerIT
[INFO] Tests run: 16, Failures: 0, Errors: 0, Skipped: 0, Time elapsed: 118.089 s - in org.apache.phoenix.end2end.UserDefinedFunctionsIT
[INFO] Running org.apache.phoenix.end2end.index.MutableIndexExtendedIT
[INFO] Running org.apache.phoenix.end2end.index.MutableIndexFailureIT
[INFO] Running org.apache.phoenix.end2end.index.MutableIndexFailureWithNamespaceIT
[INFO] Tests run: 88, Failures: 0, Errors: 0, Skipped: 0, Time elapsed: 724.955 s - in org.apache.phoenix.end2end.IndexToolIT
[INFO] Running org.apache.phoenix.end2end.index.MutableIndexRebuilderIT
[INFO] Tests run: 9, Failures: 0, Errors: 0, Skipped: 0, Time elapsed: 86.055 s - in org.apache.phoenix.end2end.index.MutableIndexExtendedIT
[INFO] Tests run: 1, Failures: 0, Errors: 0, Skipped: 0, Time elapsed: 45.941 s - in org.apache.phoenix.end2end.index.MutableIndexRebuilderIT
[INFO] Running org.apache.phoenix.end2end.index.MutableIndexReplicationIT
[INFO] Tests run: 1, Failures: 0, Errors: 0, Skipped: 0, Time elapsed: 26.552 s - in org.apache.phoenix.end2end.index.MutableIndexReplicationIT
[INFO] Tests run: 8, Failures: 0, Errors: 0, Skipped: 0, Time elapsed: 123.562 s - in org.apache.phoenix.end2end.index.MutableIndexFailureWithNamespaceIT
[INFO] Running org.apache.phoenix.end2end.index.PartialIndexRebuilderIT
[INFO] Running org.apache.phoenix.end2end.index.PhoenixMRJobSubmitterIT
[INFO] Tests run: 1, Failures: 0, Errors: 0, Skipped: 0, Time elapsed: 7.281 s - in org.apache.phoenix.end2end.index.PhoenixMRJobSubmitterIT
[INFO] Tests run: 14, Failures: 0, Errors: 0, Skipped: 0, Time elapsed: 187.668 s - in org.apache.phoenix.end2end.index.MutableIndexFailureIT
[INFO] Running org.apache.phoenix.end2end.index.txn.TxWriteFailureIT
[INFO] Running org.apache.phoenix.end2end.join.HashJoinCacheIT
[WARNING] Tests run: 45, Failures: 0, Errors: 0, Skipped: 18, Time elapsed: 362.736 s - in org.apache.phoenix.end2end.index.ImmutableIndexIT
[INFO] Tests run: 1, Failures: 0, Errors: 0, Skipped: 0, Time elapsed: 7.801 s - in org.apache.phoenix.end2end.join.HashJoinCacheIT
[INFO] Tests run: 12, Failures: 0, Errors: 0, Skipped: 0, Time elapsed: 57.966 s - in org.apache.phoenix.end2end.index.txn.TxWriteFailureIT
[INFO] Running org.apache.phoenix.hbase.index.FailForUnsupportedHBaseVersionsIT
[INFO] Running org.apache.phoenix.end2end.join.SortMergeJoinNoSpoolingIT
[INFO] Running org.apache.phoenix.execute.PartialCommitIT
[INFO] Running org.apache.phoenix.execute.UpsertSelectOverlappingBatchesIT
[INFO] Tests run: 2, Failures: 0, Errors: 0, Skipped: 0, Time elapsed: 18.87 s - in org.apache.phoenix.hbase.index.FailForUnsupportedHBaseVersionsIT
[INFO] Running org.apache.phoenix.iterate.RoundRobinResultIteratorWithStatsIT
[INFO] Tests run: 1, Failures: 0, Errors: 0, Skipped: 0, Time elapsed: 4.502 s - in org.apache.phoenix.iterate.RoundRobinResultIteratorWithStatsIT
[INFO] Tests run: 3, Failures: 0, Errors: 0, Skipped: 0, Time elapsed: 71.498 s - in org.apache.phoenix.execute.UpsertSelectOverlappingBatchesIT
[INFO] Running org.apache.phoenix.jdbc.SecureUserConnectionsIT
[INFO] Tests run: 8, Failures: 0, Errors: 0, Skipped: 0, Time elapsed: 0.525 s - in org.apache.phoenix.jdbc.SecureUserConnectionsIT
[INFO] Tests run: 12, Failures: 0, Errors: 0, Skipped: 0, Time elapsed: 84.907 s - in org.apache.phoenix.execute.PartialCommitIT
[INFO] Tests run: 15, Failures: 0, Errors: 0, Skipped: 0, Time elapsed: 682.589 s - in org.apache.phoenix.end2end.SystemCatalogCreationOnConnectionIT
[INFO] Running org.apache.phoenix.iterate.ScannerLeaseRenewalIT
[INFO] Running org.apache.phoenix.monitoring.PhoenixLoggingMetricsIT
[INFO] Running org.apache.phoenix.monitoring.PhoenixMetricsDisabledIT
[INFO] Tests run: 1, Failures: 0, Errors: 0, Skipped: 0, Time elapsed: 0.005 s - in org.apache.phoenix.monitoring.PhoenixMetricsDisabledIT
[INFO] Running org.apache.phoenix.monitoring.PhoenixMetricsIT
[INFO] Tests run: 4, Failures: 0, Errors: 0, Skipped: 0, Time elapsed: 23.251 s - in org.apache.phoenix.monitoring.PhoenixLoggingMetricsIT
[INFO] Tests run: 50, Failures: 0, Errors: 0, Skipped: 0, Time elapsed: 491.002 s - in org.apache.phoenix.end2end.index.LocalIndexIT
[INFO] Running org.apache.phoenix.rpc.PhoenixClientRpcIT
[INFO] Tests run: 2, Failures: 0, Errors: 0, Skipped: 0, Time elapsed: 6.163 s - in org.apache.phoenix.rpc.PhoenixClientRpcIT
[INFO] Running org.apache.phoenix.rpc.PhoenixServerRpcIT
[INFO] Tests run: 31, Failures: 0, Errors: 0, Skipped: 0, Time elapsed: 320.386 s - in org.apache.phoenix.end2end.index.PartialIndexRebuilderIT
[INFO] Tests run: 2, Failures: 0, Errors: 0, Skipped: 0, Time elapsed: 14.69 s - in org.apache.phoenix.rpc.PhoenixServerRpcIT
[INFO] Tests run: 22, Failures: 0, Errors: 0, Skipped: 0, Time elapsed: 67.08 s - in org.apache.phoenix.monitoring.PhoenixMetricsIT
[INFO] Tests run: 35, Failures: 0, Errors: 0, Skipped: 0, Time elapsed: 204.061 s - in org.apache.phoenix.end2end.join.SortMergeJoinNoSpoolingIT
[INFO] Running org.apache.phoenix.tool.ParameterizedPhoenixCanaryToolIT
[INFO] Running org.apache.phoenix.schema.stats.NamespaceDisabledStatsCollectorIT
[INFO] Running org.apache.phoenix.schema.stats.NamespaceEnabledStatsCollectorIT
[INFO] Running org.apache.phoenix.schema.stats.NoOpStatsCollectorIT
[INFO] Tests run: 2, Failures: 0, Errors: 0, Skipped: 0, Time elapsed: 11.565 s - in org.apache.phoenix.schema.stats.NoOpStatsCollectorIT
[INFO] Running org.apache.phoenix.schema.stats.NonTxStatsCollectorIT
[INFO] Running org.apache.phoenix.schema.stats.TxStatsCollectorIT
[INFO] Tests run: 2, Failures: 0, Errors: 0, Skipped: 0, Time elapsed: 161.961 s - in org.apache.phoenix.iterate.ScannerLeaseRenewalIT
[INFO] Tests run: 8, Failures: 0, Errors: 0, Skipped: 0, Time elapsed: 78.145 s - in org.apache.phoenix.tool.ParameterizedPhoenixCanaryToolIT
[INFO] Running org.apache.phoenix.util.CoprocessorHConnectionTableFactoryIT
[INFO] Tests run: 1, Failures: 0, Errors: 0, Skipped: 0, Time elapsed: 9.471 s - in org.apache.phoenix.util.CoprocessorHConnectionTableFactoryIT
[WARNING] Tests run: 39, Failures: 0, Errors: 0, Skipped: 6, Time elapsed: 142.931 s - in org.apache.phoenix.schema.stats.NonTxStatsCollectorIT
[WARNING] Tests run: 26, Failures: 0, Errors: 0, Skipped: 4, Time elapsed: 188.554 s - in org.apache.phoenix.schema.stats.NamespaceDisabledStatsCollectorIT
[WARNING] Tests run: 26, Failures: 0, Errors: 0, Skipped: 4, Time elapsed: 208.282 s - in org.apache.phoenix.schema.stats.NamespaceEnabledStatsCollectorIT
[WARNING] Tests run: 78, Failures: 0, Errors: 0, Skipped: 12, Time elapsed: 260.965 s - in org.apache.phoenix.schema.stats.TxStatsCollectorIT
[INFO] 
[INFO] Results:
[INFO] 
[WARNING] Tests run: 805, Failures: 0, Errors: 0, Skipped: 45
[INFO] 
[INFO] 
[INFO] --- maven-failsafe-plugin:2.20:integration-test (SplitSystemCatalogTests) @ phoenix-core ---
[INFO] 
[INFO] -------------------------------------------------------
[INFO]  T E S T S
[INFO] -------------------------------------------------------
[INFO] Running org.apache.phoenix.end2end.AlterTableWithViewsIT
[INFO] Running org.apache.phoenix.end2end.AlterMultiTenantTableWithViewsIT
[INFO] Running org.apache.phoenix.end2end.DropTableWithViewsIT
[INFO] Tests run: 4, Failures: 0, Errors: 0, Skipped: 0, Time elapsed: 24.148 s - in org.apache.phoenix.end2end.DropTableWithViewsIT
[INFO] Running org.apache.phoenix.end2end.TenantSpecificViewIndexIT
[INFO] Running org.apache.phoenix.end2end.TenantSpecificViewIndexSaltedIT
[INFO] Running org.apache.phoenix.end2end.ViewIT
[INFO] Running org.apache.phoenix.end2end.ViewMetadataIT
[INFO] Tests run: 4, Failures: 0, Errors: 0, Skipped: 0, Time elapsed: 37.36 s - in org.apache.phoenix.end2end.TenantSpecificViewIndexSaltedIT
[INFO] Tests run: 9, Failures: 0, Errors: 0, Skipped: 0, Time elapsed: 80.078 s - in org.apache.phoenix.end2end.AlterMultiTenantTableWithViewsIT
[INFO] Tests run: 10, Failures: 0, Errors: 0, Skipped: 0, Time elapsed: 82.251 s - in org.apache.phoenix.end2end.TenantSpecificViewIndexIT
[INFO] Tests run: 20, Failures: 0, Errors: 0, Skipped: 0, Time elapsed: 97.096 s - in org.apache.phoenix.end2end.ViewMetadataIT
[INFO] Running org.apache.phoenix.end2end.index.ViewIndexIT
[INFO] Tests run: 65, Failures: 0, Errors: 0, Skipped: 0, Time elapsed: 217.685 s - in org.apache.phoenix.end2end.ViewIT
[WARNING] Tests run: 16, Failures: 0, Errors: 0, Skipped: 2, Time elapsed: 107.479 s - in org.apache.phoenix.end2end.index.ViewIndexIT
[INFO] Tests run: 56, Failures: 0, Errors: 0, Skipped: 0, Time elapsed: 386.079 s - in org.apache.phoenix.end2end.AlterTableWithViewsIT
[INFO] 
[INFO] Results:
[INFO] 
[WARNING] Tests run: 184, Failures: 0, Errors: 0, Skipped: 2
[INFO] 
[INFO] 
[INFO] --- maven-failsafe-plugin:2.20:verify (ParallelStatsEnabledTest) @ phoenix-core ---
[INFO] ------------------------------------------------------------------------
[INFO] Reactor Summary for Apache Phoenix 4.15.0-HBase-1.5-SNAPSHOT:
[INFO] 
[INFO] Apache Phoenix ..................................... SUCCESS [  1.948 s]
[INFO] Phoenix Core ....................................... FAILURE [  01:43 h]
[INFO] Phoenix - Pherf .................................... SKIPPED
[INFO] Phoenix Client ..................................... SKIPPED
[INFO] Phoenix Server ..................................... SKIPPED
[INFO] Phoenix Assembly ................................... SKIPPED
[INFO] Phoenix - Tracing Web Application .................. SKIPPED
[INFO] ------------------------------------------------------------------------
[INFO] BUILD FAILURE
[INFO] ------------------------------------------------------------------------
[INFO] Total time:  01:44 h
[INFO] Finished at: 2019-06-17T20:25:24Z
[INFO] ------------------------------------------------------------------------
[ERROR] Failed to execute goal org.apache.maven.plugins:maven-failsafe-plugin:2.20:verify (ParallelStatsEnabledTest) on project phoenix-core: There are test failures.
[ERROR] 
[ERROR] Please refer to <https://builds.apache.org/job/Phoenix-4.x-HBase-1.5/ws/phoenix-core/target/failsafe-reports> for the individual test results.
[ERROR] Please refer to dump files (if any exist) [date]-jvmRun[N].dump, [date].dumpstream and [date]-jvmRun[N].dumpstream.
[ERROR] -> [Help 1]
[ERROR] 
[ERROR] To see the full stack trace of the errors, re-run Maven with the -e switch.
[ERROR] Re-run Maven using the -X switch to enable full debug logging.
[ERROR] 
[ERROR] For more information about the errors and possible solutions, please read the following articles:
[ERROR] [Help 1] http://cwiki.apache.org/confluence/display/MAVEN/MojoFailureException
[ERROR] 
[ERROR] After correcting the problems, you can resume the build with the command
[ERROR]   mvn <goals> -rf :phoenix-core
Build step 'Invoke top-level Maven targets' marked build as failure
Archiving artifacts
[JIRA] Updating issue PHOENIX-5348
Recording test results

Jenkins build is back to normal : Phoenix-4.x-HBase-1.5 #48

Posted by Apache Jenkins Server <je...@builds.apache.org>.
See <https://builds.apache.org/job/Phoenix-4.x-HBase-1.5/48/display/redirect>