You are viewing a plain text version of this content. The canonical link for it is here.
Posted to dev@lucene.apache.org by Policeman Jenkins Server <je...@thetaphi.de> on 2018/03/29 00:08:38 UTC
[JENKINS-EA] Lucene-Solr-7.3-Linux (64bit/jdk-11-ea+5) - Build # 82
- Unstable!
Build: https://jenkins.thetaphi.de/job/Lucene-Solr-7.3-Linux/82/
Java: 64bit/jdk-11-ea+5 -XX:+UseCompressedOops -XX:+UseSerialGC
1 tests failed.
FAILED: org.apache.solr.cloud.MoveReplicaHDFSTest.testFailedMove
Error Message:
No live SolrServers available to handle this request:[https://127.0.0.1:33379/solr/MoveReplicaHDFSTest_failed_coll_true, https://127.0.0.1:43709/solr/MoveReplicaHDFSTest_failed_coll_true]
Stack Trace:
org.apache.solr.client.solrj.SolrServerException: No live SolrServers available to handle this request:[https://127.0.0.1:33379/solr/MoveReplicaHDFSTest_failed_coll_true, https://127.0.0.1:43709/solr/MoveReplicaHDFSTest_failed_coll_true]
at __randomizedtesting.SeedInfo.seed([421018B9561C4A9B:E8DDCB4BE1CF9F4B]:0)
at org.apache.solr.client.solrj.impl.LBHttpSolrClient.request(LBHttpSolrClient.java:462)
at org.apache.solr.client.solrj.impl.CloudSolrClient.sendRequest(CloudSolrClient.java:1105)
at org.apache.solr.client.solrj.impl.CloudSolrClient.requestWithRetryOnStaleState(CloudSolrClient.java:885)
at org.apache.solr.client.solrj.impl.CloudSolrClient.requestWithRetryOnStaleState(CloudSolrClient.java:992)
at org.apache.solr.client.solrj.impl.CloudSolrClient.request(CloudSolrClient.java:818)
at org.apache.solr.client.solrj.SolrRequest.process(SolrRequest.java:194)
at org.apache.solr.client.solrj.SolrClient.query(SolrClient.java:942)
at org.apache.solr.cloud.MoveReplicaTest.testFailedMove(MoveReplicaTest.java:307)
at java.base/jdk.internal.reflect.NativeMethodAccessorImpl.invoke0(Native Method)
at java.base/jdk.internal.reflect.NativeMethodAccessorImpl.invoke(NativeMethodAccessorImpl.java:62)
at java.base/jdk.internal.reflect.DelegatingMethodAccessorImpl.invoke(DelegatingMethodAccessorImpl.java:43)
at java.base/java.lang.reflect.Method.invoke(Method.java:564)
at com.carrotsearch.randomizedtesting.RandomizedRunner.invoke(RandomizedRunner.java:1737)
at com.carrotsearch.randomizedtesting.RandomizedRunner$8.evaluate(RandomizedRunner.java:934)
at com.carrotsearch.randomizedtesting.RandomizedRunner$9.evaluate(RandomizedRunner.java:970)
at com.carrotsearch.randomizedtesting.RandomizedRunner$10.evaluate(RandomizedRunner.java:984)
at com.carrotsearch.randomizedtesting.rules.SystemPropertiesRestoreRule$1.evaluate(SystemPropertiesRestoreRule.java:57)
at org.apache.lucene.util.TestRuleSetupTeardownChained$1.evaluate(TestRuleSetupTeardownChained.java:49)
at org.apache.lucene.util.AbstractBeforeAfterRule$1.evaluate(AbstractBeforeAfterRule.java:45)
at org.apache.lucene.util.TestRuleThreadAndTestName$1.evaluate(TestRuleThreadAndTestName.java:48)
at org.apache.lucene.util.TestRuleIgnoreAfterMaxFailures$1.evaluate(TestRuleIgnoreAfterMaxFailures.java:64)
at org.apache.lucene.util.TestRuleMarkFailure$1.evaluate(TestRuleMarkFailure.java:47)
at com.carrotsearch.randomizedtesting.rules.StatementAdapter.evaluate(StatementAdapter.java:36)
at com.carrotsearch.randomizedtesting.ThreadLeakControl$StatementRunner.run(ThreadLeakControl.java:368)
at com.carrotsearch.randomizedtesting.ThreadLeakControl.forkTimeoutingTask(ThreadLeakControl.java:817)
at com.carrotsearch.randomizedtesting.ThreadLeakControl$3.evaluate(ThreadLeakControl.java:468)
at com.carrotsearch.randomizedtesting.RandomizedRunner.runSingleTest(RandomizedRunner.java:943)
at com.carrotsearch.randomizedtesting.RandomizedRunner$5.evaluate(RandomizedRunner.java:829)
at com.carrotsearch.randomizedtesting.RandomizedRunner$6.evaluate(RandomizedRunner.java:879)
at com.carrotsearch.randomizedtesting.RandomizedRunner$7.evaluate(RandomizedRunner.java:890)
at com.carrotsearch.randomizedtesting.rules.StatementAdapter.evaluate(StatementAdapter.java:36)
at com.carrotsearch.randomizedtesting.rules.SystemPropertiesRestoreRule$1.evaluate(SystemPropertiesRestoreRule.java:57)
at org.apache.lucene.util.AbstractBeforeAfterRule$1.evaluate(AbstractBeforeAfterRule.java:45)
at com.carrotsearch.randomizedtesting.rules.StatementAdapter.evaluate(StatementAdapter.java:36)
at org.apache.lucene.util.TestRuleStoreClassName$1.evaluate(TestRuleStoreClassName.java:41)
at com.carrotsearch.randomizedtesting.rules.NoShadowingOrOverridesOnMethodsRule$1.evaluate(NoShadowingOrOverridesOnMethodsRule.java:40)
at com.carrotsearch.randomizedtesting.rules.NoShadowingOrOverridesOnMethodsRule$1.evaluate(NoShadowingOrOverridesOnMethodsRule.java:40)
at com.carrotsearch.randomizedtesting.rules.StatementAdapter.evaluate(StatementAdapter.java:36)
at com.carrotsearch.randomizedtesting.rules.StatementAdapter.evaluate(StatementAdapter.java:36)
at org.apache.lucene.util.TestRuleAssertionsRequired$1.evaluate(TestRuleAssertionsRequired.java:53)
at org.apache.lucene.util.TestRuleMarkFailure$1.evaluate(TestRuleMarkFailure.java:47)
at org.apache.lucene.util.TestRuleIgnoreAfterMaxFailures$1.evaluate(TestRuleIgnoreAfterMaxFailures.java:64)
at org.apache.lucene.util.TestRuleIgnoreTestSuites$1.evaluate(TestRuleIgnoreTestSuites.java:54)
at com.carrotsearch.randomizedtesting.rules.StatementAdapter.evaluate(StatementAdapter.java:36)
at com.carrotsearch.randomizedtesting.ThreadLeakControl$StatementRunner.run(ThreadLeakControl.java:368)
at java.base/java.lang.Thread.run(Thread.java:841)
Caused by: org.apache.solr.client.solrj.impl.HttpSolrClient$RemoteSolrException: Error from server at https://127.0.0.1:33379/solr/MoveReplicaHDFSTest_failed_coll_true: no servers hosting shard: shard1
at org.apache.solr.client.solrj.impl.HttpSolrClient.executeMethod(HttpSolrClient.java:643)
at org.apache.solr.client.solrj.impl.HttpSolrClient.request(HttpSolrClient.java:255)
at org.apache.solr.client.solrj.impl.HttpSolrClient.request(HttpSolrClient.java:244)
at org.apache.solr.client.solrj.impl.LBHttpSolrClient.doRequest(LBHttpSolrClient.java:483)
at org.apache.solr.client.solrj.impl.LBHttpSolrClient.request(LBHttpSolrClient.java:413)
... 45 more
Build Log:
[...truncated 13 lines...]
ERROR: Error fetching remote repo 'origin'
hudson.plugins.git.GitException: Failed to fetch from git://git.apache.org/lucene-solr.git
at hudson.plugins.git.GitSCM.fetchFrom(GitSCM.java:862)
at hudson.plugins.git.GitSCM.retrieveChanges(GitSCM.java:1129)
at hudson.plugins.git.GitSCM.checkout(GitSCM.java:1160)
at hudson.scm.SCM.checkout(SCM.java:504)
at hudson.model.AbstractProject.checkout(AbstractProject.java:1208)
at hudson.model.AbstractBuild$AbstractBuildExecution.defaultCheckout(AbstractBuild.java:574)
at jenkins.scm.SCMCheckoutStrategy.checkout(SCMCheckoutStrategy.java:86)
at hudson.model.AbstractBuild$AbstractBuildExecution.run(AbstractBuild.java:499)
at hudson.model.Run.execute(Run.java:1727)
at hudson.model.FreeStyleBuild.run(FreeStyleBuild.java:43)
at hudson.model.ResourceController.execute(ResourceController.java:97)
at hudson.model.Executor.run(Executor.java:429)
Caused by: hudson.plugins.git.GitException: org.eclipse.jgit.api.errors.TransportException: git://git.apache.org/lucene-solr.git: Connection refused (Connection refused)
at org.jenkinsci.plugins.gitclient.JGitAPIImpl$2.execute(JGitAPIImpl.java:634)
at hudson.plugins.git.GitSCM.fetchFrom(GitSCM.java:860)
... 11 more
Caused by: org.eclipse.jgit.api.errors.TransportException: git://git.apache.org/lucene-solr.git: Connection refused (Connection refused)
at org.eclipse.jgit.api.FetchCommand.call(FetchCommand.java:135)
at org.jenkinsci.plugins.gitclient.JGitAPIImpl$2.execute(JGitAPIImpl.java:632)
... 12 more
Caused by: org.eclipse.jgit.errors.TransportException: git://git.apache.org/lucene-solr.git: Connection refused (Connection refused)
at org.eclipse.jgit.transport.TransportGitAnon.openConnection(TransportGitAnon.java:150)
at org.eclipse.jgit.transport.TransportGitAnon$TcpFetchConnection.<init>(TransportGitAnon.java:179)
at org.eclipse.jgit.transport.TransportGitAnon.openFetch(TransportGitAnon.java:120)
at org.eclipse.jgit.transport.FetchProcess.executeImp(FetchProcess.java:136)
at org.eclipse.jgit.transport.FetchProcess.execute(FetchProcess.java:122)
at org.eclipse.jgit.transport.Transport.fetch(Transport.java:1201)
at org.eclipse.jgit.api.FetchCommand.call(FetchCommand.java:128)
... 13 more
ERROR: Error fetching remote repo 'origin'
Retrying after 10 seconds
Fetching changes from the remote Git repository
Cleaning workspace
Checking out Revision 98a6b3d642928b1ac9076c6c5a369472581f7633 (refs/remotes/origin/branch_7_3)
Commit message: "SOLR-12141: Fix "bin/solr" shell scripts (Windows/Linux/Mac) to correctly detect major Java version and use numerical version comparison to enforce minimum requirements. Also remove obsolete "UseParNewGC" option. This allows to start Solr with Java 10 or later."
No emails were triggered.
Setting ANT_1_8_2_HOME=/var/lib/jenkins/tools/hudson.tasks.Ant_AntInstallation/ANT_1.8.2
[description-setter] Description set: Java: 64bit/jdk-11-ea+5 -XX:+UseCompressedOops -XX:+UseSerialGC
Setting ANT_1_8_2_HOME=/var/lib/jenkins/tools/hudson.tasks.Ant_AntInstallation/ANT_1.8.2
[Lucene-Solr-7.3-Linux] $ /var/lib/jenkins/tools/hudson.tasks.Ant_AntInstallation/ANT_1.8.2/bin/ant "-Dargs=-XX:+UseCompressedOops -XX:+UseSerialGC" jenkins-hourly
Buildfile: /home/jenkins/workspace/Lucene-Solr-7.3-Linux/build.xml
jenkins-hourly:
-print-java-info:
[java-info] java version "11-ea"
[java-info] OpenJDK Runtime Environment (11-ea+5, Oracle Corporation)
[java-info] OpenJDK 64-Bit Server VM (11-ea+5, "Oracle Corporation")
[java-info] Test args: [-XX:+UseCompressedOops -XX:+UseSerialGC]
clean:
clean:
clean:
ivy-availability-check:
[loadresource] Do not set property disallowed.ivy.jars.list as its length is 0.
-ivy-fail-disallowed-ivy-version:
ivy-fail:
ivy-configure:
[ivy:configure] :: Apache Ivy 2.4.0 - 20141213170938 :: http://ant.apache.org/ivy/ ::
[ivy:configure] :: loading settings :: file = /home/jenkins/workspace/Lucene-Solr-7.3-Linux/lucene/top-level-ivy-settings.xml
resolve-groovy:
[ivy:cachepath] :: resolving dependencies :: org.codehaus.groovy#groovy-all-caller;working
[ivy:cachepath] confs: [default]
[ivy:cachepath] found org.codehaus.groovy#groovy-all;2.4.13 in public
[ivy:cachepath] :: resolution report :: resolve 150ms :: artifacts dl 2ms
---------------------------------------------------------------------
| | modules || artifacts |
| conf | number| search|dwnlded|evicted|| number|dwnlded|
---------------------------------------------------------------------
| default | 1 | 0 | 0 | 0 || 1 | 0 |
---------------------------------------------------------------------
-test-with-heapdumps-enabled:
[echo] OpenJDK 64-Bit Server VM: Enabling heap dumps on OutOfMemoryError to dir '/home/jenkins/workspace/Lucene-Solr-7.3-Linux/heapdumps'.
[mkdir] Created dir: /home/jenkins/workspace/Lucene-Solr-7.3-Linux/heapdumps
ivy-availability-check:
[loadresource] Do not set property disallowed.ivy.jars.list as its length is 0.
-ivy-fail-disallowed-ivy-version:
ivy-fail:
ivy-configure:
[ivy:configure] :: loading settings :: file = /home/jenkins/workspace/Lucene-Solr-7.3-Linux/lucene/top-level-ivy-settings.xml
resolve-groovy:
test:
ivy-availability-check:
[loadresource] Do not set property disallowed.ivy.jars.list as its length is 0.
-ivy-fail-disallowed-ivy-version:
ivy-fail:
ivy-configure:
[ivy:configure] :: loading settings :: file = /home/jenkins/workspace/Lucene-Solr-7.3-Linux/lucene/top-level-ivy-settings.xml
-clover.load:
resolve-groovy:
-init-totals:
test-core:
-clover.disable:
ivy-availability-check:
[loadresource] Do not set property disallowed.ivy.jars.list as its length is 0.
-ivy-fail-disallowed-ivy-version:
ivy-fail:
ivy-configure:
[ivy:configure] :: loading settings :: file = /home/jenkins/workspace/Lucene-Solr-7.3-Linux/lucene/top-level-ivy-settings.xml
-clover.load:
-clover.classpath:
-clover.setup:
clover:
-check-git-state:
-git-cleanroot:
-copy-git-state:
[copy] Copying 1 file to /home/jenkins/workspace/Lucene-Solr-7.3-Linux/lucene/build
git-autoclean:
resolve:
init:
compile-core:
[mkdir] Created dir: /home/jenkins/workspace/Lucene-Solr-7.3-Linux/lucene/build/core/classes/java
[javac] Compiling 827 source files to /home/jenkins/workspace/Lucene-Solr-7.3-Linux/lucene/build/core/classes/java
[javac] Note: Some input files use or override a deprecated API.
[javac] Note: Recompile with -Xlint:deprecation for details.
[javac] Creating empty /home/jenkins/workspace/Lucene-Solr-7.3-Linux/lucene/build/core/classes/java/org/apache/lucene/util/graph/package-info.class
[javac] Creating empty /home/jenkins/workspace/Lucene-Solr-7.3-Linux/lucene/build/core/classes/java/org/apache/lucene/document/package-info.class
[javac] Creating empty /home/jenkins/workspace/Lucene-Solr-7.3-Linux/lucene/build/core/classes/java/org/apache/lucene/package-info.class
[javac] Creating empty /home/jenkins/workspace/Lucene-Solr-7.3-Linux/lucene/build/core/classes/java/org/apache/lucene/util/bkd/package-info.class
[javac] Creating empty /home/jenkins/workspace/Lucene-Solr-7.3-Linux/lucene/build/core/classes/java/org/apache/lucene/codecs/compressing/package-info.class
[javac] Creating empty /home/jenkins/workspace/Lucene-Solr-7.3-Linux/lucene/build/core/classes/java/org/apache/lucene/codecs/lucene60/package-info.class
[javac] Creating empty /home/jenkins/workspace/Lucene-Solr-7.3-Linux/lucene/build/core/classes/java/org/apache/lucene/codecs/package-info.class
[javac] Creating empty /home/jenkins/workspace/Lucene-Solr-7.3-Linux/lucene/build/core/classes/java/org/apache/lucene/util/package-info.class
[javac] Creating empty /home/jenkins/workspace/Lucene-Solr-7.3-Linux/lucene/build/core/classes/java/org/apache/lucene/index/package-info.class
[javac] Creating empty /home/jenkins/workspace/Lucene-Solr-7.3-Linux/lucene/build/core/classes/java/org/apache/lucene/util/fst/package-info.class
[javac] Creating empty /home/jenkins/workspace/Lucene-Solr-7.3-Linux/lucene/build/core/classes/java/org/apache/lucene/analysis/tokenattributes/package-info.class
[javac] Creating empty /home/jenkins/workspace/Lucene-Solr-7.3-Linux/lucene/build/core/classes/java/org/apache/lucene/search/package-info.class
[javac] Creating empty /home/jenkins/workspace/Lucene-Solr-7.3-Linux/lucene/build/core/classes/java/org/apache/lucene/codecs/lucene62/package-info.class
[javac] Creating empty /home/jenkins/workspace/Lucene-Solr-7.3-Linux/lucene/build/core/classes/java/org/apache/lucene/util/packed/package-info.class
[javac] Creating empty /home/jenkins/workspace/Lucene-Solr-7.3-Linux/lucene/build/core/classes/java/org/apache/lucene/util/mutable/package-info.class
[javac] Creating empty /home/jenkins/workspace/Lucene-Solr-7.3-Linux/lucene/build/core/classes/java/org/apache/lucene/codecs/lucene70/package-info.class
[javac] Creating empty /home/jenkins/workspace/Lucene-Solr-7.3-Linux/lucene/build/core/classes/java/org/apache/lucene/codecs/perfield/package-info.class
[javac] Creating empty /home/jenkins/workspace/Lucene-Solr-7.3-Linux/lucene/build/core/classes/java/org/apache/lucene/analysis/package-info.class
[javac] Creating empty /home/jenkins/workspace/Lucene-Solr-7.3-Linux/lucene/build/core/classes/java/org/apache/lucene/analysis/standard/package-info.class
[javac] Creating empty /home/jenkins/workspace/Lucene-Solr-7.3-Linux/lucene/build/core/classes/java/org/apache/lucene/store/package-info.class
[javac] Creating empty /home/jenkins/workspace/Lucene-Solr-7.3-Linux/lucene/build/core/classes/java/org/apache/lucene/codecs/blocktree/package-info.class
[javac] Creating empty /home/jenkins/workspace/Lucene-Solr-7.3-Linux/lucene/build/core/classes/java/org/apache/lucene/search/spans/package-info.class
[javac] Creating empty /home/jenkins/workspace/Lucene-Solr-7.3-Linux/lucene/build/core/classes/java/org/apache/lucene/search/similarities/package-info.class
[javac] Creating empty /home/jenkins/workspace/Lucene-Solr-7.3-Linux/lucene/build/core/classes/java/org/apache/lucene/util/automaton/package-info.class
[javac] Creating empty /home/jenkins/workspace/Lucene-Solr-7.3-Linux/lucene/build/core/classes/java/org/apache/lucene/codecs/lucene50/package-info.class
[javac] Creating empty /home/jenkins/workspace/Lucene-Solr-7.3-Linux/lucene/build/core/classes/java/org/apache/lucene/geo/package-info.class
[copy] Copying 3 files to /home/jenkins/workspace/Lucene-Solr-7.3-Linux/lucene/build/core/classes/java
compile-test-framework:
-check-git-state:
-git-cleanroot:
-copy-git-state:
git-autoclean:
ivy-availability-check:
[loadresource] Do not set property disallowed.ivy.jars.list as its length is 0.
-ivy-fail-disallowed-ivy-version:
ivy-fail:
ivy-configure:
[ivy:configure] :: loading settings :: file = /home/jenkins/workspace/Lucene-Solr-7.3-Linux/lucene/top-level-ivy-settings.xml
resolve:
init:
compile-lucene-core:
-check-git-state:
-git-cleanroot:
-copy-git-state:
git-autoclean:
ivy-availability-check:
[loadresource] Do not set property disallowed.ivy.jars.list as its length is 0.
-ivy-fail-disallowed-ivy-version:
ivy-fail:
ivy-configure:
[ivy:configure] :: loading settings :: file = /home/jenkins/workspace/Lucene-Solr-7.3-Linux/lucene/top-level-ivy-settings.xml
resolve:
init:
-clover.disable:
-clover.load:
-clover.classpath:
-clover.setup:
clover:
compile-core:
compile-codecs:
-check-git-state:
-git-cleanroot:
-copy-git-state:
git-autoclean:
ivy-availability-check:
[loadresource] Do not set property disallowed.ivy.jars.list as its length is 0.
-ivy-fail-disallowed-ivy-version:
ivy-fail:
ivy-configure:
[ivy:configure] :: loading settings :: file = /home/jenkins/workspace/Lucene-Solr-7.3-Linux/lucene/top-level-ivy-settings.xml
resolve:
common.init:
compile-lucene-core:
init:
-clover.disable:
-clover.load:
-clover.classpath:
-clover.setup:
clover:
compile-core:
[mkdir] Created dir: /home/jenkins/workspace/Lucene-Solr-7.3-Linux/lucene/build/codecs/classes/java
[javac] Compiling 67 source files to /home/jenkins/workspace/Lucene-Solr-7.3-Linux/lucene/build/codecs/classes/java
[javac] Note: Some input files use or override a deprecated API.
[javac] Note: Recompile with -Xlint:deprecation for details.
[javac] Creating empty /home/jenkins/workspace/Lucene-Solr-7.3-Linux/lucene/build/codecs/classes/java/org/apache/lucene/codecs/bloom/package-info.class
[javac] Creating empty /home/jenkins/workspace/Lucene-Solr-7.3-Linux/lucene/build/codecs/classes/java/org/apache/lucene/codecs/memory/package-info.class
[javac] Creating empty /home/jenkins/workspace/Lucene-Solr-7.3-Linux/lucene/build/codecs/classes/java/org/apache/lucene/codecs/simpletext/package-info.class
[javac] Creating empty /home/jenkins/workspace/Lucene-Solr-7.3-Linux/lucene/build/codecs/classes/java/org/apache/lucene/codecs/blockterms/package-info.class
[javac] Creating empty /home/jenkins/workspace/Lucene-Solr-7.3-Linux/lucene/build/codecs/classes/java/org/apache/lucene/codecs/blocktreeords/package-info.class
[copy] Copying 3 files to /home/jenkins/workspace/Lucene-Solr-7.3-Linux/lucene/build/codecs/classes/java
-clover.disable:
-clover.load:
-clover.classpath:
-clover.setup:
clover:
common.compile-core:
[mkdir] Created dir: /home/jenkins/workspace/Lucene-Solr-7.3-Linux/lucene/build/test-framework/classes/java
[javac] Compiling 188 source files to /home/jenkins/workspace/Lucene-Solr-7.3-Linux/lucene/build/test-framework/classes/java
[javac] Note: Some input files use or override a deprecated API.
[javac] Note: Recompile with -Xlint:deprecation for details.
[javac] Creating empty /home/jenkins/workspace/Lucene-Solr-7.3-Linux/lucene/build/test-framework/classes/java/org/apache/lucene/codecs/asserting/package-info.class
[javac] Creating empty /home/jenkins/workspace/Lucene-Solr-7.3-Linux/lucene/build/test-framework/classes/java/org/apache/lucene/codecs/ramonly/package-info.class
[javac] Creating empty /home/jenkins/workspace/Lucene-Solr-7.3-Linux/lucene/build/test-framework/classes/java/org/apache/lucene/mockfile/package-info.class
[javac] Creating empty /home/jenkins/workspace/Lucene-Solr-7.3-Linux/lucene/build/test-framework/classes/java/org/apache/lucene/codecs/cheapbastard/package-info.class
[javac] Creating empty /home/jenkins/workspace/Lucene-Solr-7.3-Linux/lucene/build/test-framework/classes/java/org/apache/lucene/codecs/mockrandom/package-info.class
[javac] Creating empty /home/jenkins/workspace/Lucene-Solr-7.3-Linux/lucene/build/test-framework/classes/java/org/apache/lucene/codecs/cranky/package-info.class
[javac] Creating empty /home/jenkins/workspace/Lucene-Solr-7.3-Linux/lucene/build/test-framework/classes/java/org/apache/lucene/codecs/compressing/dummy/package-info.class
[copy] Copying 4 files to /home/jenkins/workspace/Lucene-Solr-7.3-Linux/lucene/build/test-framework/classes/java
compile-core:
compile-test:
[mkdir] Created dir: /home/jenkins/workspace/Lucene-Solr-7.3-Linux/lucene/build/core/classes/test
[javac] Compiling 473 source files to /home/jenkins/workspace/Lucene-Solr-7.3-Linux/lucene/build/core/classes/test
[javac] Note: Some input files use or override a deprecated API.
[javac] Note: Recompile with -Xlint:deprecation for details.
[copy] Copying 3 files to /home/jenkins/workspace/Lucene-Solr-7.3-Linux/lucene/build/core/classes/test
-mrjar-classes-uptodate:
resolve-groovy:
patch-mrjar-classes:
WARNING: An illegal reflective access operation has occurred
WARNING: Illegal reflective access by org.codehaus.groovy.reflection.CachedClass (file:/home/jenkins/.ivy2/cache/org.codehaus.groovy/groovy-all/jars/groovy-all-2.4.13.jar) to method java.lang.Object.finalize()
WARNING: Please consider reporting this to the maintainers of org.codehaus.groovy.reflection.CachedClass
WARNING: Use --illegal-access=warn to enable warnings of further illegal reflective access operations
WARNING: All illegal access operations will be denied in a future release
[patch-cls] Remapped: org/apache/lucene/analysis/tokenattributes/CharTermAttributeImpl
[patch-cls] Remapped: org/apache/lucene/codecs/compressing/LZ4
[patch-cls] Remapped: org/apache/lucene/document/BinaryPoint$2
[patch-cls] Remapped: org/apache/lucene/document/DoubleRange
[patch-cls] Remapped: org/apache/lucene/document/FloatRange
[patch-cls] Remapped: org/apache/lucene/document/IntRange
[patch-cls] Remapped: org/apache/lucene/document/LongRange
[patch-cls] Remapped: org/apache/lucene/index/BitsSlice
[patch-cls] Remapped: org/apache/lucene/index/CodecReader
[patch-cls] Remapped: org/apache/lucene/index/MergeReaderWrapper
[patch-cls] Remapped: org/apache/lucene/search/BooleanScorer$TailPriorityQueue
[patch-cls] Remapped: org/apache/lucene/util/BytesRef
[patch-cls] Remapped: org/apache/lucene/util/BytesRefArray
[patch-cls] Remapped: org/apache/lucene/util/CharsRef$UTF16SortedAsUTF8Comparator
[patch-cls] Remapped: org/apache/lucene/util/CharsRef
[patch-cls] Remapped: org/apache/lucene/util/IntsRef
[patch-cls] Remapped: org/apache/lucene/util/LongsRef
[patch-cls] Remapped: org/apache/lucene/util/StringHelper
[patch-cls] Remapped: org/apache/lucene/util/automaton/Automaton$Builder
[patch-cls] Remapped: org/apache/lucene/util/automaton/Automaton
[patch-cls] Remapped 20 class files for Java 9 to: /home/jenkins/workspace/Lucene-Solr-7.3-Linux/lucene/build/core/classes/java9
[touch] Creating /home/jenkins/workspace/Lucene-Solr-7.3-Linux/lucene/build/core/patch-mrjar.stamp
install-junit4-taskdef:
validate:
-init-totals:
-test:
[mkdir] Created dir: /home/jenkins/workspace/Lucene-Solr-7.3-Linux/lucene/build/core/test
[loadresource] Do not set property tests.explicitclass as its length is 0.
[mkdir] Created dir: /home/jenkins/workspace/Lucene-Solr-7.3-Linux/lucene/build/core/test/temp
[mkdir] Created dir: /home/jenkins/workspace/Lucene-Solr-7.3-Linux/.caches/test-stats/core
[junit4] <JUnit4> says مرحبا! Master seed: 4856293956D787FD
[junit4] Executing 466 suites with 3 JVMs.
[junit4]
[junit4] Started J2 PID(5903@localhost).
[junit4] Started J0 PID(5905@localhost).
[junit4] Started J1 PID(5904@localhost).
[junit4] Suite: org.apache.lucene.index.TestDirectoryReader
[junit4] Completed [1/466] on J2 in 3.01s, 24 tests
[junit4]
[junit4] Suite: org.apache.lucene.search.spans.TestSpanTermQuery
[junit4] Completed [2/466] on J2 in 0.19s, 2 tests
[junit4]
[junit4] Suite: org.apache.lucene.search.TestTermScorer
[junit4] Completed [3/466] on J2 in 0.40s, 4 tests
[junit4]
[junit4] Suite: org.apache.lucene.search.TestSloppyPhraseQuery
[junit4] Completed [4/466] on J0 in 5.49s, 9 tests
[junit4]
[junit4] Suite: org.apache.lucene.search.TestMatchAllDocsQuery
[junit4] Completed [5/466] on J0 in 0.10s, 2 tests
[junit4]
[junit4] Suite: org.apache.lucene.store.TestSleepingLockWrapper
[junit4] Completed [6/466] on J2 in 5.42s, 6 tests
[junit4]
[junit4] Suite: org.apache.lucene.index.TestNeverDelete
[junit4] Completed [7/466] on J0 in 3.41s, 1 test
[junit4]
[junit4] Suite: org.apache.lucene.util.TestIntsRef
[junit4] Completed [8/466] on J0 in 0.06s, 2 tests
[junit4]
[junit4] Suite: org.apache.lucene.analysis.tokenattributes.TestPackedTokenAttributeImpl
[junit4] Completed [9/466] on J2 in 0.06s, 4 tests
[junit4]
[junit4] Suite: org.apache.lucene.index.TestReaderClosed
[junit4] Completed [10/466] on J2 in 0.22s, 2 tests
[junit4]
[junit4] Suite: org.apache.lucene.util.TestRoaringDocIdSet
[junit4] Completed [11/466] on J2 in 1.27s, 5 tests
[junit4]
[junit4] Suite: org.apache.lucene.index.TestBinaryDocValuesUpdates
[junit4] IGNOR/A 0.00s J1 | TestBinaryDocValuesUpdates.testTonsOfUpdates
[junit4] > Assumption #1: 'nightly' test group is disabled (@Nightly())
[junit4] Completed [12/466] on J1 in 13.24s, 29 tests, 1 skipped
[junit4]
[junit4] Suite: org.apache.lucene.search.spans.TestSpanExplanationsOfNonMatches
[junit4] Completed [13/466] on J1 in 0.38s, 30 tests
[junit4]
[junit4] Suite: org.apache.lucene.search.TestFloatRangeFieldQueries
[junit4] IGNOR/A 0.00s J0 | TestFloatRangeFieldQueries.testRandomBig
[junit4] > Assumption #1: 'nightly' test group is disabled (@Nightly())
[junit4] Completed [14/466] on J0 in 8.07s, 5 tests, 1 skipped
[junit4]
[junit4] Suite: org.apache.lucene.index.TestTermVectorsWriter
[junit4] Completed [15/466] on J0 in 0.47s, 15 tests
[junit4]
[junit4] Suite: org.apache.lucene.codecs.perfield.TestPerFieldPostingsFormat
[junit4] IGNOR/A 0.00s J0 | TestPerFieldPostingsFormat.testPostingsEnumReuse
[junit4] > Assumption #1: The MockRandom PF randomizes content on the fly, so we can't check it
[junit4] IGNOR/A 0.00s J0 | TestPerFieldPostingsFormat.testMergeStability
[junit4] > Assumption #1: The MockRandom PF randomizes content on the fly, so we can't check it
[junit4] Completed [16/466] on J0 in 11.44s, 25 tests, 2 skipped
[junit4]
[junit4] Suite: org.apache.lucene.util.TestInPlaceMergeSorter
[junit4] Completed [17/466] on J0 in 0.15s, 9 tests
[junit4]
[junit4] Suite: org.apache.lucene.search.spans.TestSpansEnum
[junit4] Completed [18/466] on J0 in 0.21s, 7 tests
[junit4]
[junit4] Suite: org.apache.lucene.search.TestNeedsScores
[junit4] Completed [19/466] on J0 in 0.13s, 4 tests
[junit4]
[junit4] Suite: org.apache.lucene.index.TestThreadedForceMerge
[junit4] Completed [20/466] on J0 in 0.76s, 1 test
[junit4]
[junit4] Suite: org.apache.lucene.search.TestSearcherManager
[junit4] Completed [21/466] on J1 in 17.26s, 11 tests
[junit4]
[junit4] Suite: org.apache.lucene.search.TestSearchAfter
[junit4] Completed [22/466] on J0 in 0.99s, 1 test
[junit4]
[junit4] Suite: org.apache.lucene.index.TestExceedMaxTermLength
[junit4] Completed [23/466] on J0 in 0.05s, 1 test
[junit4]
[junit4] Suite: org.apache.lucene.store.TestRAMDirectory
[junit4] IGNOR/A 0.01s J1 | TestRAMDirectory.testPendingDeletions
[junit4] > Assumption #1: we can only install VirusCheckingFS on an FSDirectory
[junit4] IGNOR/A 0.00s J1 | TestRAMDirectory.testFsyncDoesntCreateNewFiles
[junit4] > Assumption #1: test only works for FSDirectory subclasses
[junit4] Completed [24/466] on J1 in 1.53s, 46 tests, 2 skipped
[junit4]
[junit4] Suite: org.apache.lucene.analysis.TestToken
[junit4] Completed [25/466] on J1 in 0.06s, 5 tests
[junit4]
[junit4] Suite: org.apache.lucene.index.TestParallelReaderEmptyIndex
[junit4] Completed [26/466] on J1 in 0.23s, 2 tests
[junit4]
[junit4] Suite: org.apache.lucene.util.TestStringHelper
[junit4] Completed [27/466] on J1 in 0.06s, 7 tests
[junit4]
[junit4] Suite: org.apache.lucene.search.TestMultiThreadTermVectors
[junit4] Completed [28/466] on J0 in 2.95s, 1 test
[junit4]
[junit4] Suite: org.apache.lucene.index.TestIndexFileDeleter
[junit4] Completed [29/466] on J1 in 1.43s, 10 tests
[junit4]
[junit4] Suite: org.apache.lucene.search.TestNot
[junit4] Completed [30/466] on J1 in 0.09s, 1 test
[junit4]
[junit4] Suite: org.apache.lucene.search.TestLiveFieldValues
[junit4] Completed [31/466] on J0 in 1.87s, 1 test
[junit4]
[junit4] Suite: org.apache.lucene.index.TestSegmentMerger
[junit4] Completed [32/466] on J0 in 0.59s, 3 tests
[junit4]
[junit4] Suite: org.apache.lucene.util.TestSmallFloat
[junit4] Completed [33/466] on J0 in 0.35s, 4 tests
[junit4]
[junit4] Suite: org.apache.lucene.search.TestSimilarityProvider
[junit4] Completed [34/466] on J0 in 0.06s, 1 test
[junit4]
[junit4] Suite: org.apache.lucene.search.TestMultiTermQueryRewrites
[junit4] Completed [35/466] on J0 in 0.08s, 3 tests
[junit4]
[junit4] Suite: org.apache.lucene.index.TestIndexWriterWithThreads
[junit4] Completed [36/466] on J0 in 2.69s, 12 tests
[junit4]
[junit4] Suite: org.apache.lucene.index.TestPerSegmentDeletes
[junit4] Completed [37/466] on J0 in 0.07s, 1 test
[junit4]
[junit4] Suite: org.apache.lucene.search.TestDocValuesQueries
[junit4] Completed [38/466] on J1 in 8.86s, 10 tests
[junit4]
[junit4] Suite: org.apache.lucene.store.TestNativeFSLockFactory
[junit4] Completed [39/466] on J0 in 5.42s, 11 tests
[junit4]
[junit4] Suite: org.apache.lucene.index.TestByteSlices
[junit4] Completed [40/466] on J1 in 3.62s, 1 test
[junit4]
[junit4] Suite: org.apache.lucene.util.automaton.TestDeterminizeLexicon
[junit4] Completed [41/466] on J0 in 1.23s, 1 test
[junit4]
[junit4] Suite: org.apache.lucene.search.TestBooleanRewrites
[junit4] Completed [42/466] on J0 in 0.27s, 12 tests
[junit4]
[junit4] Suite: org.apache.lucene.index.TestInfoStream
[junit4] Completed [43/466] on J0 in 0.05s, 2 tests
[junit4]
[junit4] Suite: org.apache.lucene.search.similarities.TestClassicSimilarity
[junit4] Completed [44/466] on J0 in 0.08s, 12 tests
[junit4]
[junit4] Suite: org.apache.lucene.index.TestAddIndexes
[junit4] Completed [45/466] on J1 in 2.52s, 25 tests
[junit4]
[junit4] Suite: org.apache.lucene.util.TestPriorityQueue
[junit4] Completed [46/466] on J1 in 0.41s, 9 tests
[junit4]
[junit4] Suite: org.apache.lucene.index.Test2BPositions
[junit4] IGNOR/A 0.00s J1 | Test2BPositions.test
[junit4] > Assumption #1: 'monster' test group is disabled (@Monster(value="uses lots of space and takes a few minutes"))
[junit4] Completed [47/466] on J1 in 0.00s, 1 test, 1 skipped
[junit4]
[junit4] Suite: org.apache.lucene.search.TestMatchNoDocsQuery
[junit4] Completed [48/466] on J1 in 0.01s, 3 tests
[junit4]
[junit4] Suite: org.apache.lucene.index.TestSizeBoundedForceMerge
[junit4] Completed [49/466] on J1 in 0.08s, 11 tests
[junit4]
[junit4] Suite: org.apache.lucene.document.TestIntRange
[junit4] Completed [50/466] on J1 in 0.01s, 1 test
[junit4]
[junit4] Suite: org.apache.lucene.index.TestTermVectorsReader
[junit4] Completed [51/466] on J1 in 0.14s, 13 tests
[junit4]
[junit4] Suite: org.apache.lucene.store.TestMmapDirectory
[junit4] Completed [52/466] on J1 in 0.36s, 43 tests, 1 skipped
[junit4]
[junit4] Suite: org.apache.lucene.search.TestWildcard
[junit4] Completed [53/466] on J1 in 0.11s, 8 tests
[junit4]
[junit4] Suite: org.apache.lucene.index.TestPrefixCodedTerms
[junit4] Completed [54/466] on J1 in 0.22s, 3 tests
[junit4]
[junit4] Suite: org.apache.lucene.index.TestTragicIndexWriterDeadlock
[junit4] Completed [55/466] on J1 in 0.44s, 2 tests
[junit4]
[junit4] Suite: org.apache.lucene.search.TestBoostQuery
[junit4] Completed [56/466] on J1 in 0.05s, 3 tests
[junit4]
[junit4] Suite: org.apache.lucene.store.TestDirectory
[junit4] IGNOR/A 0.01s J1 | TestDirectory.testListAll
[junit4] > Assumption #1: this test does not expect extra files
[junit4] Completed [57/466] on J1 in 0.77s, 4 tests, 1 skipped
[junit4]
[junit4] Suite: org.apache.lucene.util.TestBytesRefArray
[junit4] Completed [58/466] on J1 in 0.20s, 2 tests
[junit4]
[junit4] Suite: org.apache.lucene.search.TestIntRangeFieldQueries
[junit4] IGNOR/A 0.00s J0 | TestIntRangeFieldQueries.testRandomBig
[junit4] > Assumption #1: 'nightly' test group is disabled (@Nightly())
[junit4] Completed [59/466] on J0 in 5.23s, 5 tests, 1 skipped
[junit4]
[junit4] Suite: org.apache.lucene.index.TestCodecs
[junit4] Completed [60/466] on J0 in 0.52s, 3 tests
[junit4]
[junit4] Suite: org.apache.lucene.index.TestFlex
[junit4] Completed [61/466] on J0 in 0.09s, 2 tests
[junit4]
[junit4] Suite: org.apache.lucene.search.TestSameScoresWithThreads
[junit4] Completed [62/466] on J1 in 1.23s, 1 test
[junit4]
[junit4] Suite: org.apache.lucene.util.Test2BPagedBytes
[junit4] IGNOR/A 0.00s J1 | Test2BPagedBytes.test
[junit4] > Assumption #1: 'monster' test group is disabled (@Monster(value="You must increase heap to > 2 G to run this"))
[junit4] Completed [63/466] on J1 in 0.02s, 1 test, 1 skipped
[junit4]
[junit4] Suite: org.apache.lucene.index.TestStressIndexing
[junit4] Completed [64/466] on J0 in 4.31s, 1 test
[junit4]
[junit4] Suite: org.apache.lucene.util.TestFrequencyTrackingRingBuffer
[junit4] Completed [65/466] on J0 in 0.21s, 2 tests
[junit4]
[junit4] Suite: org.apache.lucene.index.TestIndexingSequenceNumbers
[junit4] Completed [66/466] on J2 in 53.63s, 8 tests
[junit4]
[junit4] Suite: org.apache.lucene.search.TestSearchWithThreads
[junit4] Completed [67/466] on J2 in 5.70s, 1 test
[junit4]
[junit4] Suite: org.apache.lucene.search.TestFilterWeight
[junit4] Completed [68/466] on J2 in 0.03s, 1 test
[junit4]
[junit4] Suite: org.apache.lucene.index.TestDocInverterPerFieldErrorInfo
[junit4] Completed [69/466] on J2 in 0.04s, 2 tests
[junit4]
[junit4] Suite: org.apache.lucene.geo.TestGeoUtils
[junit4] Completed [70/466] on J1 in 17.41s, 7 tests
[junit4]
[junit4] Suite: org.apache.lucene.search.TestReqExclBulkScorer
[junit4] Completed [71/466] on J1 in 0.06s, 1 test
[junit4]
[junit4] Suite: org.apache.lucene.util.TestVirtualMethod
[junit4] Completed [72/466] on J1 in 0.03s, 2 tests
[junit4]
[junit4] Suite: org.apache.lucene.TestMergeSchedulerExternal
[junit4] Completed [73/466] on J1 in 0.42s, 2 tests
[junit4]
[junit4] Suite: org.apache.lucene.index.TestBagOfPostings
[junit4] Completed [74/466] on J2 in 1.82s, 1 test
[junit4]
[junit4] Suite: org.apache.lucene.util.TestIntroSelector
[junit4] Completed [75/466] on J2 in 0.79s, 2 tests
[junit4]
[junit4] Suite: org.apache.lucene.index.Test2BNumericDocValues
[junit4] IGNOR/A 0.00s J2 | Test2BNumericDocValues.testNumerics
[junit4] > Assumption #1: 'monster' test group is disabled (@Monster(value="takes ~ 2 hours if the heap is 5gb"))
[junit4] Completed [76/466] on J2 in 0.01s, 1 test, 1 skipped
[junit4]
[junit4] Suite: org.apache.lucene.search.TestPositiveScoresOnlyCollector
[junit4] Completed [77/466] on J2 in 0.03s, 1 test
[junit4]
[junit4] Suite: org.apache.lucene.index.TestSegmentTermDocs
[junit4] Completed [78/466] on J2 in 0.39s, 4 tests
[junit4]
[junit4] Suite: org.apache.lucene.document.TestField
[junit4] Completed [79/466] on J2 in 0.14s, 23 tests
[junit4]
[junit4] Suite: org.apache.lucene.index.TestTermVectors
[junit4] Completed [80/466] on J2 in 0.54s, 3 tests
[junit4]
[junit4] Suite: org.apache.lucene.store.TestSimpleFSDirectory
[junit4] Completed [81/466] on J2 in 1.03s, 42 tests
[junit4]
[junit4] Suite: org.apache.lucene.index.TestNumericDocValuesUpdates
[junit4] Completed [82/466] on J0 in 17.86s, 32 tests
[junit4]
[junit4] Suite: org.apache.lucene.search.similarities.TestSimilarityBase
[junit4] Completed [83/466] on J2 in 0.57s, 31 tests
[junit4]
[junit4] Suite: org.apache.lucene.index.TestDocValues
[junit4] Completed [84/466] on J0 in 0.24s, 7 tests
[junit4]
[junit4] Suite: org.apache.lucene.index.TestRollingUpdates
[junit4] Completed [85/466] on J2 in 1.74s, 2 tests
[junit4]
[junit4] Suite: org.apache.lucene.util.TestSparseFixedBitSet
[junit4] Completed [86/466] on J0 in 3.16s, 11 tests
[junit4]
[junit4] Suite: org.apache.lucene.search.TermInSetQueryTest
[junit4] Completed [87/466] on J2 in 1.99s, 10 tests
[junit4]
[junit4] Suite: org.apache.lucene.search.TestDocValuesScoring
[junit4] Completed [88/466] on J2 in 0.11s, 1 test
[junit4]
[junit4] Suite: org.apache.lucene.store.TestHugeRamFile
[junit4] Completed [89/466] on J2 in 1.18s, 1 test
[junit4]
[junit4] Suite: org.apache.lucene.util.TestBytesRefHash
[junit4] Completed [90/466] on J2 in 2.08s, 8 tests
[junit4]
[junit4] Suite: org.apache.lucene.search.TestTermRangeQuery
[junit4] Completed [91/466] on J2 in 0.24s, 7 tests
[junit4]
[junit4] Suite: org.apache.lucene.util.TestByteBlockPool
[junit4] Completed [92/466] on J2 in 0.15s, 2 tests
[junit4]
[junit4] Suite: org.apache.lucene.document.TestFieldType
[junit4] Completed [93/466] on J2 in 0.06s, 3 tests
[junit4]
[junit4] Suite: org.apache.lucene.search.TestSynonymQuery
[junit4] Completed [94/466] on J2 in 0.07s, 4 tests
[junit4]
[junit4] Suite: org.apache.lucene.util.TestSetOnce
[junit4] Completed [95/466] on J2 in 0.14s, 4 tests
[junit4]
[junit4] Suite: org.apache.lucene.analysis.TestCachingTokenFilter
[junit4] Completed [96/466] on J2 in 0.06s, 2 tests
[junit4]
[junit4] Suite: org.apache.lucene.document.TestBinaryDocument
[junit4] Completed [97/466] on J2 in 0.04s, 1 test
[junit4]
[junit4] Suite: org.apache.lucene.index.TestIndexWriterNRTIsCurrent
[junit4] Completed [98/466] on J0 in 8.54s, 1 test
[junit4]
[junit4] Suite: org.apache.lucene.search.TestLongRangeFieldQueries
[junit4] IGNOR/A 0.00s J2 | TestLongRangeFieldQueries.testRandomBig
[junit4] > Assumption #1: 'nightly' test group is disabled (@Nightly())
[junit4] Completed [99/466] on J2 in 6.87s, 5 tests, 1 skipped
[junit4]
[junit4] Suite: org.apache.lucene.index.TestPointValues
[junit4] Completed [100/466] on J0 in 5.79s, 32 tests
[junit4]
[junit4] Suite: org.apache.lucene.index.Test4GBStoredFields
[junit4] IGNOR/A 0.00s J0 | Test4GBStoredFields.test
[junit4] > Assumption #1: 'nightly' test group is disabled (@Nightly())
[junit4] Completed [101/466] on J0 in 0.03s, 1 test, 1 skipped
[junit4]
[junit4] Suite: org.apache.lucene.store.TestTrackingDirectoryWrapper
[junit4] IGNOR/A 0.00s J0 | TestTrackingDirectoryWrapper.testPendingDeletions
[junit4] > Assumption #1: we can only install VirusCheckingFS on an FSDirectory
[junit4] IGNOR/A 0.00s J0 | TestTrackingDirectoryWrapper.testFsyncDoesntCreateNewFiles
[junit4] > Assumption #1: test only works for FSDirectory subclasses
[junit4] Completed [102/466] on J0 in 1.21s, 47 tests, 2 skipped
[junit4]
[junit4] Suite: org.apache.lucene.util.TestSPIClassIterator
[junit4] Completed [103/466] on J0 in 0.04s, 1 test
[junit4]
[junit4] Suite: org.apache.lucene.search.TestQueryRescorer
[junit4] Completed [104/466] on J0 in 0.84s, 6 tests
[junit4]
[junit4] Suite: org.apache.lucene.index.TestUniqueTermCount
[junit4] Completed [105/466] on J0 in 0.10s, 1 test
[junit4]
[junit4] Suite: org.apache.lucene.util.TestQueryBuilder
[junit4] Completed [106/466] on J0 in 0.09s, 23 tests
[junit4]
[junit4] Suite: org.apache.lucene.index.TestTwoPhaseCommitTool
[junit4] Completed [107/466] on J0 in 0.06s, 3 tests
[junit4]
[junit4] Suite: org.apache.lucene.search.TestSort
[junit4] Completed [108/466] on J0 in 0.24s, 25 tests
[junit4]
[junit4] Suite: org.apache.lucene.index.TestIndexWriterExceptions2
[junit4] Completed [109/466] on J2 in 12.72s, 1 test
[junit4]
[junit4] Suite: org.apache.lucene.store.TestGrowableByteArrayDataOutput
[junit4] Completed [110/466] on J0 in 9.68s, 2 tests
[junit4]
[junit4] Suite: org.apache.lucene.search.TestMinShouldMatch2
[junit4] Completed [111/466] on J2 in 4.70s, 6 tests
[junit4]
[junit4] Suite: org.apache.lucene.index.TestMixedDocValuesUpdates
[junit4] IGNOR/A 0.00s J0 | TestMixedDocValuesUpdates.testTonsOfUpdates
[junit4] > Assumption #1: 'nightly' test group is disabled (@Nightly())
[junit4] Completed [112/466] on J0 in 2.92s, 4 tests, 1 skipped
[junit4]
[junit4] Suite: org.apache.lucene.search.TestSimilarity
[junit4] Completed [113/466] on J0 in 0.01s, 1 test
[junit4]
[junit4] Suite: org.apache.lucene.index.TestDocsAndPositions
[junit4] Completed [114/466] on J0 in 0.23s, 6 tests
[junit4]
[junit4] Suite: org.apache.lucene.search.similarities.TestAxiomaticSimilarity
[junit4] Completed [115/466] on J0 in 0.01s, 3 tests
[junit4]
[junit4] Suite: org.apache.lucene.search.TestConstantScoreQuery
[junit4] Completed [116/466] on J0 in 0.02s, 5 tests
[junit4]
[junit4] Suite: org.apache.lucene.index.TestDocCount
[junit4] Completed [117/466] on J0 in 0.05s, 1 test
[junit4]
[junit4] Suite: org.apache.lucene.index.TestDemoParallelLeafReader
[junit4] Completed [118/466] on J0 in 4.73s, 5 tests
[junit4]
[junit4] Suite: org.apache.lucene.search.TestSimpleSearchEquivalence
[junit4] Completed [119/466] on J0 in 0.72s, 17 tests
[junit4]
[junit4] Suite: org.apache.lucene.search.TestMultiCollector
[junit4] Completed [120/466] on J0 in 0.25s, 2 tests
[junit4]
[junit4] Suite: org.apache.lucene.index.Test2BBinaryDocValues
[junit4] IGNOR/A 0.00s J0 | Test2BBinaryDocValues.testFixedBinary
[junit4] > Assumption #1: 'monster' test group is disabled (@Monster(value="takes ~ 6 hours if the heap is 5gb"))
[junit4] IGNOR/A 0.00s J0 | Test2BBinaryDocValues.testVariableBinary
[junit4] > Assumption #1: 'monster' test group is disabled (@Monster(value="takes ~ 6 hours if the heap is 5gb"))
[junit4] Completed [121/466] on J0 in 0.01s, 2 tests, 2 skipped
[junit4]
[junit4] Suite: org.apache.lucene.search.TestConjunctionDISI
[junit4] Completed [122/466] on J2 in 7.22s, 5 tests
[junit4]
[junit4] Suite: org.apache.lucene.codecs.perfield.TestPerFieldDocValuesFormat
[junit4] Completed [123/466] on J1 in 43.65s, 110 tests
[junit4]
[junit4] Suite: org.apache.lucene.search.TestElevationComparator
[junit4] Completed [124/466] on J1 in 0.02s, 1 test
[junit4]
[junit4] Suite: org.apache.lucene.index.TestAllFilesHaveCodecHeader
[junit4] Completed [125/466] on J2 in 0.64s, 1 test
[junit4]
[junit4] Suite: org.apache.lucene.index.TestDocumentsWriterDeleteQueue
[junit4] Completed [126/466] on J1 in 0.24s, 5 tests
[junit4]
[junit4] Suite: org.apache.lucene.util.automaton.TestOperations
[junit4] Completed [127/466] on J2 in 1.53s, 7 tests
[junit4]
[junit4] Suite: org.apache.lucene.util.TestMSBRadixSorter
[junit4] Completed [128/466] on J0 in 3.02s, 8 tests
[junit4]
[junit4] Suite: org.apache.lucene.search.TestFieldValueQuery
[junit4] Completed [129/466] on J1 in 2.22s, 6 tests
[junit4]
[junit4] Suite: org.apache.lucene.search.FuzzyTermOnShortTermsTest
[junit4] Completed [130/466] on J1 in 0.07s, 1 test
[junit4]
[junit4] Suite: org.apache.lucene.index.Test2BTerms
[junit4] IGNOR/A 0.00s J1 | Test2BTerms.test2BTerms
[junit4] > Assumption #1: 'monster' test group is disabled (@Monster(value="very slow, use 5g minimum heap"))
[junit4] Completed [131/466] on J1 in 0.00s, 1 test, 1 skipped
[junit4]
[junit4] Suite: org.apache.lucene.util.TestNotDocIdSet
[junit4] Completed [132/466] on J0 in 1.13s, 6 tests
[junit4]
[junit4] Suite: org.apache.lucene.search.TestEarlyTermination
[junit4] Completed [133/466] on J0 in 0.02s, 1 test
[junit4]
[junit4] Suite: org.apache.lucene.index.TestIndexTooManyDocs
[junit4] Completed [134/466] on J0 in 0.41s, 1 test
[junit4]
[junit4] Suite: org.apache.lucene.index.TestTerm
[junit4] Completed [135/466] on J0 in 0.04s, 1 test
[junit4]
[junit4] Suite: org.apache.lucene.search.TestBooleanQueryVisitSubscorers
[junit4] Completed [136/466] on J0 in 0.16s, 7 tests
[junit4]
[junit4] Suite: org.apache.lucene.util.TestUnicodeUtil
[junit4] Completed [138/466] on J0 in 0.52s, 5 tests
[junit4]
[junit4] Suite: org.apache.lucene.search.spans.TestSpanNotQuery
[junit4] Completed [139/466] on J0 in 0.03s, 3 tests
[junit4]
[junit4] Suite: org.apache.lucene.util.automaton.TestMinimize
[junit4] Completed [140/466] on J1 in 2.30s, 3 tests
[junit4]
[junit4] Suite: org.apache.lucene.util.TestIntArrayDocIdSet
[junit4] Completed [141/466] on J1 in 0.65s, 5 tests
[junit4]
[junit4] Suite: org.apache.lucene.util.TestNumericUtils
[junit4] Completed [142/466] on J1 in 1.61s, 24 tests
[junit4]
[junit4] Suite: org.apache.lucene.TestDemo
[junit4] Completed [143/466] on J1 in 0.02s, 1 test
[junit4]
[junit4] Suite: org.apache.lucene.codecs.lucene50.TestBlockPostingsFormat3
[junit4] Completed [144/466] on J1 in 1.06s, 1 test
[junit4]
[junit4] Suite: org.apache.lucene.index.TestNorms
[junit4] Completed [145/466] on J1 in 0.72s, 2 tests
[junit4]
[junit4] Suite: org.apache.lucene.search.TestControlledRealTimeReopenThread
[junit4] IGNOR/A 0.00s J0 | TestControlledRealTimeReopenThread.testCRTReopen
[junit4] > Assumption #1: 'awaitsfix' test group is disabled (@AwaitsFix(bugUrl="https://issues.apache.org/jira/browse/LUCENE-5737"))
[junit4] Completed [146/466] on J0 in 4.93s, 6 tests, 1 skipped
[junit4]
[junit4] Suite: org.apache.lucene.index.TestDocumentWriter
[junit4] Completed [147/466] on J0 in 0.19s, 6 tests
[junit4]
[junit4] Suite: org.apache.lucene.util.TestTimSorter
[junit4] Completed [148/466] on J0 in 0.22s, 9 tests
[junit4]
[junit4] Suite: org.apache.lucene.codecs.compressing.TestFastDecompressionMode
[junit4] Completed [149/466] on J1 in 2.03s, 11 tests
[junit4]
[junit4] Suite: org.apache.lucene.index.TestIndexManyDocuments
[junit4] Completed [150/466] on J0 in 0.98s, 1 test
[junit4]
[junit4] Suite: org.apache.lucene.index.TestCheckIndex
[junit4] Completed [151/466] on J1 in 0.74s, 4 tests
[junit4]
[junit4] Suite: org.apache.lucene.index.TestForTooMuchCloning
[junit4] Completed [152/466] on J1 in 0.06s, 1 test
[junit4]
[junit4] Suite: org.apache.lucene.search.similarities.TestBM25Similarity
[junit4] Completed [153/466] on J1 in 0.06s, 3 tests
[junit4]
[junit4] Suite: org.apache.lucene.index.TestFilterCodecReader
[junit4] Completed [154/466] on J1 in 0.02s, 1 test
[junit4]
[junit4] Suite: org.apache.lucene.search.spans.TestSpanExplanations
[junit4] Completed [155/466] on J1 in 0.57s, 30 tests
[junit4]
[junit4] Suite: org.apache.lucene.index.TestPostingsOffsets
[junit4] Completed [156/466] on J0 in 1.94s, 13 tests
[junit4]
[junit4] Suite: org.apache.lucene.search.TestComplexExplanations
[junit4] Completed [157/466] on J1 in 0.95s, 21 tests
[junit4]
[junit4] Suite: org.apache.lucene.analysis.tokenattributes.TestSimpleAttributeImpl
[junit4] Completed [158/466] on J1 in 0.03s, 1 test
[junit4]
[junit4] Suite: org.apache.lucene.search.TestNGramPhraseQuery
[junit4] Completed [159/466] on J1 in 0.04s, 1 test
[junit4]
[junit4] Suite: org.apache.lucene.util.TestCollectionUtil
[junit4] Completed [160/466] on J2 in 11.60s, 4 tests
[junit4]
[junit4] Suite: org.apache.lucene.util.TestFutureObjects
[junit4] Completed [161/466] on J2 in 0.08s, 3 tests
[junit4]
[junit4] Suite: org.apache.lucene.TestAssertions
[junit4] Completed [162/466] on J2 in 0.03s, 1 test
[junit4]
[junit4] Suite: org.apache.lucene.util.TestFutureArrays
[junit4] Completed [163/466] on J1 in 0.06s, 10 tests
[junit4]
[junit4] Suite: org.apache.lucene.store.TestSingleInstanceLockFactory
[junit4] Completed [164/466] on J1 in 1.23s, 7 tests
[junit4]
[junit4] Suite: org.apache.lucene.index.TestMultiDocValues
[junit4] Completed [165/466] on J1 in 0.27s, 7 tests
[junit4]
[junit4] Suite: org.apache.lucene.index.TestAllFilesCheckIndexHeader
[junit4] Completed [166/466] on J1 in 0.94s, 1 test
[junit4]
[junit4] Suite: org.apache.lucene.util.TestFixedBitDocIdSet
[junit4] Completed [167/466] on J1 in 1.55s, 5 tests
[junit4]
[junit4] Suite: org.apache.lucene.store.TestLockFactory
[junit4] Completed [168/466] on J1 in 0.05s, 2 tests
[junit4]
[junit4] Suite: org.apache.lucene.util.bkd.Test2BBKDPoints
[junit4] IGNOR/A 0.00s J1 | Test2BBKDPoints.test1D
[junit4] > Assumption #1: 'monster' test group is disabled (@Monster(value="takes at least 4 hours and consumes many GB of temp disk space"))
[junit4] IGNOR/A 0.00s J1 | Test2BBKDPoints.test2D
[junit4] > Assumption #1: 'monster' test group is disabled (@Monster(value="takes at least 4 hours and consumes many GB of temp disk space"))
[junit4] Completed [169/466] on J1 in 0.00s, 2 tests, 2 skipped
[junit4]
[junit4] Suite: org.apache.lucene.search.TestSortedSetSortField
[junit4] Completed [170/466] on J1 in 0.09s, 7 tests
[junit4]
[junit4] Suite: org.apache.lucene.codecs.lucene50.TestLucene50StoredFieldsFormatHighCompression
[junit4] IGNOR/A 0.00s J2 | TestLucene50StoredFieldsFormatHighCompression.testBigDocuments
[junit4] > Assumption #1: 'nightly' test group is disabled (@Nightly())
[junit4] Completed [171/466] on J2 in 7.18s, 19 tests, 1 skipped
[junit4]
[junit4] Suite: org.apache.lucene.index.TestNoMergePolicy
[junit4] Completed [172/466] on J2 in 0.03s, 4 tests
[junit4]
[junit4] Suite: org.apache.lucene.codecs.lucene50.TestForUtil
[junit4] Completed [173/466] on J2 in 0.11s, 1 test
[junit4]
[junit4] Suite: org.apache.lucene.index.TestDuelingCodecsAtNight
[junit4] IGNOR/A 0.00s J2 | TestDuelingCodecsAtNight.testCrazyReaderEquals
[junit4] > Assumption #1: 'nightly' test group is disabled (@Nightly())
[junit4] IGNOR/A 0.00s J2 | TestDuelingCodecsAtNight.testBigEquals
[junit4] > Assumption #1: 'nightly' test group is disabled (@Nightly())
[junit4] IGNOR/A 0.00s J2 | TestDuelingCodecsAtNight.testEquals
[junit4] > Assumption #1: 'nightly' test group is disabled (@Nightly())
[junit4] Completed [174/466] on J2 in 0.00s, 3 tests, 3 skipped
[junit4]
[junit4] Suite: org.apache.lucene.index.TestIndexWriterReader
[junit4] IGNOR/A 0.00s J2 | TestIndexWriterReader.testDuringAddIndexes
[junit4] > Assumption #1: 'nightly' test group is disabled (@Nightly())
[junit4] Completed [175/466] on J2 in 4.06s, 23 tests, 1 skipped
[junit4]
[junit4] Suite: org.apache.lucene.search.TestBoolean2
[junit4] Completed [176/466] on J0 in 12.74s, 10 tests
[junit4]
[junit4] Suite: org.apache.lucene.index.TestSnapshotDeletionPolicy
[junit4] Completed [177/466] on J0 in 1.49s, 7 tests
[junit4]
[junit4] Suite: org.apache.lucene.search.spans.TestBasics
[junit4] Completed [178/466] on J2 in 2.35s, 27 tests
[junit4]
[junit4] Suite: org.apache.lucene.index.TestSwappedIndexFiles
[junit4] Completed [179/466] on J0 in 0.30s, 1 test
[junit4]
[junit4] Suite: org.apache.lucene.index.Test2BSortedDocValuesOrds
[junit4] IGNOR/A 0.00s J0 | Test2BSortedDocValuesOrds.test2BOrds
[junit4] > Assumption #1: 'monster' test group is disabled (@Monster(value="Takes ~ 6 hours if the heap is 5gb"))
[junit4] Completed [180/466] on J0 in 0.01s, 1 test, 1 skipped
[junit4]
[junit4] Suite: org.apache.lucene.index.TestIndexWriterOnDiskFull
[junit4] IGNOR/A 0.00s J2 | TestIndexWriterOnDiskFull.testAddIndexOnDiskFull
[junit4] > Assumption #1: This test cannot run with Memory codec
[junit4] Completed [181/466] on J2 in 0.15s, 4 tests, 1 skipped
[junit4]
[junit4] Suite: org.apache.lucene.index.TestIndexInput
[junit4] Completed [182/466] on J0 in 1.13s, 2 tests
[junit4]
[junit4] Suite: org.apache.lucene.search.TestApproximationSearchEquivalence
[junit4] Completed [183/466] on J0 in 0.61s, 10 tests
[junit4]
[junit4] Suite: org.apache.lucene.search.spans.TestSpanSearchEquivalence
[junit4] Completed [184/466] on J2 in 3.06s, 33 tests
[junit4]
[junit4] Suite: org.apache.lucene.index.TestIndexWriterForceMerge
[junit4] Completed [185/466] on J0 in 2.20s, 4 tests
[junit4]
[junit4] Suite: org.apache.lucene.util.TestTimSorterWorstCase
[junit4] Completed [186/466] on J1 in 17.44s, 1 test
[junit4]
[junit4] Suite: org.apache.lucene.search.TestPositionIncrement
[junit4] Completed [187/466] on J1 in 0.03s, 2 tests
[junit4]
[junit4] Suite: org.apache.lucene.index.TestIndexReaderClose
[junit4] Completed [188/466] on J1 in 0.40s, 3 tests
[junit4]
[junit4] Suite: org.apache.lucene.codecs.lucene70.TestIndexedDISI
[junit4] Completed [189/466] on J0 in 4.03s, 10 tests
[junit4]
[junit4] Suite: org.apache.lucene.index.TestForceMergeForever
[junit4] Completed [190/466] on J0 in 0.91s, 1 test
[junit4]
[junit4] Suite: org.apache.lucene.search.TestSortRandom
[junit4] Completed [191/466] on J1 in 0.97s, 2 tests
[junit4]
[junit4] Suite: org.apache.lucene.index.TestOmitTf
[junit4] Completed [192/466] on J1 in 0.43s, 6 tests
[junit4]
[junit4] Suite: org.apache.lucene.util.bkd.TestMutablePointsReaderUtils
[junit4] Completed [193/466] on J1 in 1.86s, 3 tests
[junit4]
[junit4] Suite: org.apache.lucene.util.automaton.TestDeterminism
[junit4] Completed [194/466] on J1 in 0.75s, 2 tests
[junit4]
[junit4] Suite: org.apache.lucene.search.TestAutomatonQueryUnicode
[junit4] Completed [195/466] on J1 in 0.03s, 1 test
[junit4]
[junit4] Suite: org.apache.lucene.index.TestExitableDirectoryReader
[junit4] Completed [196/466] on J1 in 0.00s, 1 test, 1 skipped
[junit4]
[junit4] Suite: org.apache.lucene.index.TestTieredMergePolicy
[junit4] Completed [197/466] on J1 in 3.84s, 6 tests
[junit4]
[junit4] Suite: org.apache.lucene.search.TestCustomSearcherSort
[junit4] Completed [198/466] on J1 in 0.76s, 2 tests
[junit4]
[junit4] Suite: org.apache.lucene.search.TestEarlyTerminatingSortingCollector
[junit4] Completed [199/466] on J2 in 15.43s, 4 tests
[junit4]
[junit4] Suite: org.apache.lucene.index.TestIndexWriter
[junit4] Completed [200/466] on J0 in 10.12s, 76 tests, 1 skipped
[junit4]
[junit4] Suite: org.apache.lucene.search.TestRegexpRandom2
[junit4] Completed [201/466] on J1 in 2.56s, 1 test
[junit4]
[junit4] Suite: org.apache.lucene.codecs.compressing.TestHighCompressionMode
[junit4] Completed [202/466] on J2 in 1.03s, 7 tests
[junit4]
[junit4] Suite: org.apache.lucene.search.TestScoreCachingWrappingScorer
[junit4] Completed [203/466] on J2 in 0.01s, 1 test
[junit4]
[junit4] Suite: org.apache.lucene.util.TestCloseableThreadLocal
[junit4] Completed [204/466] on J2 in 0.03s, 3 tests
[junit4]
[junit4] Suite: org.apache.lucene.util.TestAttributeSource
[junit4] Completed [205/466] on J2 in 0.04s, 7 tests
[junit4]
[junit4] Suite: org.apache.lucene.util.packed.TestDirectMonotonic
[junit4] Completed [206/466] on J1 in 1.70s, 4 tests
[junit4]
[junit4] Suite: org.apache.lucene.index.TestLogMergePolicy
[junit4] Completed [207/466] on J1 in 0.03s, 2 tests
[junit4]
[junit4] Suite: org.apache.lucene.util.TestFilterIterator
[junit4] Completed [208/466] on J1 in 0.08s, 8 tests
[junit4]
[junit4] Suite: org.apache.lucene.document.TestDoubleRange
[junit4] Completed [209/466] on J1 in 0.05s, 1 test
[junit4]
[junit4] Suite: org.apache.lucene.util.TestMathUtil
[junit4] Completed [210/466] on J1 in 0.05s, 5 tests
[junit4]
[junit4] Suite: org.apache.lucene.index.TestNRTReaderWithThreads
[junit4] Completed [211/466] on J2 in 1.52s, 1 test
[junit4]
[junit4] Suite: org.apache.lucene.index.TestParallelTermEnum
[junit4] Completed [212/466] on J1 in 0.06s, 1 test
[junit4]
[junit4] Suite: org.apache.lucene.util.fst.TestBytesStore
[junit4] Completed [213/466] on J1 in 1.38s, 1 test
[junit4]
[junit4] Suite: org.apache.lucene.index.TestConsistentFieldNumbers
[junit4] Completed [214/466] on J2 in 1.87s, 4 tests
[junit4]
[junit4] Suite: org.apache.lucene.util.TestCharsRefBuilder
[junit4] Completed [215/466] on J2 in 0.04s, 2 tests
[junit4]
[junit4] Suite: org.apache.lucene.store.TestNIOFSDirectory
[junit4] Completed [216/466] on J2 in 1.04s, 42 tests
[junit4]
[junit4] Suite: org.apache.lucene.util.fst.TestFSTs
[junit4] IGNOR/A 0.00s J0 | TestFSTs.testBigSet
[junit4] > Assumption #1: 'nightly' test group is disabled (@Nightly())
[junit4] Completed [217/466] on J0 in 8.02s, 20 tests, 1 skipped
[junit4]
[junit4] Suite: org.apache.lucene.analysis.TestGraphTokenizers
[junit4] Completed [218/466] on J1 in 8.87s, 23 tests
[junit4]
[junit4] Suite: org.apache.lucene.util.bkd.TestBKD
[junit4] IGNOR/A 0.00s J2 | TestBKD.testRandomBinaryBig
[junit4] > Assumption #1: 'nightly' test group is disabled (@Nightly())
[junit4] Completed [219/466] on J2 in 9.04s, 19 tests, 1 skipped
[junit4]
[junit4] Suite: org.apache.lucene.search.TestUsageTrackingFilterCachingPolicy
[junit4] Completed [220/466] on J2 in 0.07s, 4 tests
[junit4]
[junit4] Suite: org.apache.lucene.util.TestRollingBuffer
[junit4] Completed [221/466] on J2 in 0.46s, 1 test
[junit4]
[junit4] Suite: org.apache.lucene.search.TestSimpleExplanationsOfNonMatches
[junit4] Completed [222/466] on J2 in 0.16s, 70 tests
[junit4]
[junit4] Suite: org.apache.lucene.index.TestLazyProxSkipping
[junit4] Completed [223/466] on J2 in 0.37s, 2 tests
[junit4]
[junit4] Suite: org.apache.lucene.search.TestTopDocsCollector
[junit4] Completed [224/466] on J2 in 0.10s, 8 tests
[junit4]
[junit4] Suite: org.apache.lucene.index.TestParallelCompositeReader
[junit4] Completed [225/466] on J2 in 0.27s, 11 tests
[junit4]
[junit4] Suite: org.apache.lucene.util.graph.TestGraphTokenStreamFiniteStrings
[junit4] Completed [226/466] on J2 in 0.05s, 12 tests
[junit4]
[junit4] Suite: org.apache.lucene.util.automaton.FiniteStringsIteratorTest
[junit4] Completed [227/466] on J2 in 2.83s, 7 tests
[junit4]
[junit4] Suite: org.apache.lucene.search.TestConjunctions
[junit4] Completed [228/466] on J2 in 0.04s, 2 tests
[junit4]
[junit4] Suite: org.apache.lucene.search.TestShardSearching
[junit4] Completed [229/466] on J0 in 12.46s, 1 test
[junit4]
[junit4] Suite: org.apache.lucene.index.TestIndexWriterExceptions
[junit4] IGNOR/A 0.00s J1 | TestIndexWriterExceptions.testTooManyTokens
[junit4] > Assumption #1: 'nightly' test group is disabled (@Nightly())
[junit4] Completed [230/466] on J1 in 7.96s, 34 tests, 1 skipped
[junit4]
[junit4] Suite: org.apache.lucene.index.TestIndexWriterMerging
[junit4] Completed [231/466] on J2 in 3.06s, 6 tests
[junit4]
[junit4] Suite: org.apache.lucene.index.TestTryDelete
[junit4] Completed [232/466] on J2 in 0.01s, 3 tests
[junit4]
[junit4] Suite: org.apache.lucene.store.TestMultiMMap
[junit4] Completed [233/466] on J0 in 1.09s, 54 tests
[junit4]
[junit4] Suite: org.apache.lucene.search.TestBooleanOr
[junit4] Completed [234/466] on J0 in 0.96s, 7 tests
[junit4]
[junit4] Suite: org.apache.lucene.search.TestFieldCacheRewriteMethod
[junit4] Completed [235/466] on J2 in 1.52s, 2 tests
[junit4]
[junit4] Suite: org.apache.lucene.search.TestSubScorerFreqs
[junit4] Completed [236/466] on J2 in 0.02s, 3 tests
[junit4]
[junit4] Suite: org.apache.lucene.index.TestDeletionPolicy
[junit4] Completed [237/466] on J1 in 2.77s, 6 tests
[junit4]
[junit4] Suite: org.apache.lucene.index.TestFlushByRamOrCountsPolicy
[junit4] Completed [238/466] on J0 in 2.29s, 5 tests
[junit4]
[junit4] Suite: org.apache.lucene.index.TestIndexWriterMergePolicy
[junit4] Completed [239/466] on J0 in 1.24s, 7 tests
[junit4]
[junit4] Suite: org.apache.lucene.index.TestIndexWriterDelete
[junit4] IGNOR/A 0.00s J1 | TestIndexWriterDelete.testApplyDeletesOnFlush
[junit4] > Assumption #1: 'nightly' test group is disabled (@Nightly())
[junit4] Completed [240/466] on J1 in 8.18s, 25 tests, 2 skipped
[junit4]
[junit4] Suite: org.apache.lucene.util.packed.TestPackedInts
[junit4] IGNOR/A 0.00s J2 | TestPackedInts.testBlockReaderOverflow
[junit4] > Assumption #1: 'nightly' test group is disabled (@Nightly())
[junit4] Completed [241/466] on J2 in 9.31s, 28 tests, 3 skipped
[junit4]
[junit4] Suite: org.apache.lucene.index.TestMultiLevelSkipList
[junit4] Completed [242/466] on J2 in 0.22s, 1 test
[junit4]
[junit4] Suite: org.apache.lucene.index.TestNRTThreads
[junit4] Completed [243/466] on J0 in 5.80s, 1 test
[junit4]
[junit4] Suite: org.apache.lucene.util.TestCharsRef
[junit4] Completed [244/466] on J2 in 0.07s, 5 tests
[junit4]
[junit4] Suite: org.apache.lucene.document.TestDocument
[junit4] Completed [245/466] on J2 in 0.04s, 12 tests
[junit4]
[junit4] Suite: org.apache.lucene.util.TestFixedLengthBytesRefArray
[junit4] Completed [246/466] on J2 in 0.10s, 2 tests
[junit4]
[junit4] Suite: org.apache.lucene.index.TestReaderWrapperDVTypeCheck
[junit4] Completed [247/466] on J2 in 0.02s, 1 test
[junit4]
[junit4] Suite: org.apache.lucene.index.TestPersistentSnapshotDeletionPolicy
[junit4] Completed [248/466] on J0 in 1.65s, 13 tests
[junit4]
[junit4] Suite: org.apache.lucene.index.TestStressAdvance
[junit4] Completed [249/466] on J0 in 2.20s, 1 test
[junit4]
[junit4] Suite: org.apache.lucene.index.TestAtomicUpdate
[junit4] Completed [250/466] on J2 in 4.27s, 1 test
[junit4]
[junit4] Suite: org.apache.lucene.index.TestIndexWriterCommit
[junit4] IGNOR/A 0.00s J2 | TestIndexWriterCommit.testCommitOnCloseDiskUsage
[junit4] > Assumption #1: This test cannot run with Memory codec
[junit4] Completed [251/466] on J2 in 0.99s, 14 tests, 1 skipped
[junit4]
[junit4] Suite: org.apache.lucene.index.TestDirectoryReaderReopen
[junit4] Completed [252/466] on J2 in 1.96s, 14 tests
[junit4]
[junit4] Suite: org.apache.lucene.search.TestTimeLimitingCollector
[junit4] Completed [253/466] on J2 in 3.02s, 7 tests
[junit4]
[junit4] Suite: org.apache.lucene.index.TestConcurrentMergeScheduler
[junit4] Completed [254/466] on J2 in 3.20s, 16 tests
[junit4]
[junit4] Suite: org.apache.lucene.index.TestDuelingCodecs
[junit4] Completed [255/466] on J1 in 19.04s, 2 tests
[junit4]
[junit4] Suite: org.apache.lucene.search.TestTopDocsMerge
[junit4] Completed [256/466] on J1 in 1.23s, 4 tests
[junit4]
[junit4] Suite: org.apache.lucene.index.TestLongPostings
[junit4] Completed [257/466] on J1 in 2.14s, 2 tests
[junit4]
[junit4] Suite: org.apache.lucene.analysis.standard.TestStandardAnalyzer
[junit4] Completed [258/466] on J0 in 20.60s, 36 tests
[junit4]
[junit4] Suite: org.apache.lucene.index.TestIndexWriterUnicode
[junit4] Completed [259/466] on J1 in 3.36s, 5 tests
[junit4]
[junit4] Suite: org.apache.lucene.util.automaton.TestLevenshteinAutomata
[junit4] Completed [260/466] on J1 in 0.82s, 4 tests
[junit4]
[junit4] Suite: org.apache.lucene.store.TestBufferedIndexInput
[junit4] Completed [261/466] on J1 in 0.19s, 4 tests
[junit4]
[junit4] Suite: org.apache.lucene.util.TestArrayUtil
[junit4] Completed [262/466] on J0 in 3.45s, 13 tests
[junit4]
[junit4] Suite: org.apache.lucene.index.TestDocumentsWriterStallControl
[junit4] Completed [263/466] on J2 in 17.70s, 3 tests
[junit4]
[junit4] Suite: org.apache.lucene.search.TestSimpleExplanations
[junit4] Completed [264/466] on J2 in 1.87s, 70 tests
[junit4]
[junit4] Suite: org.apache.lucene.search.TestPhraseQuery
[junit4] Completed [265/466] on J2 in 1.15s, 21 tests
[junit4]
[junit4] Suite: org.apache.lucene.util.TestWeakIdentityMap
[junit4] Completed [266/466] on J0 in 8.61s, 2 tests
[junit4]
[junit4] Suite: org.apache.lucene.index.TestOmitNorms
[junit4] Completed [267/466] on J0 in 0.71s, 5 tests
[junit4]
[junit4] Suite: org.apache.lucene.util.TestFixedBitSet
[junit4] Completed [268/466] on J0 in 3.17s, 19 tests
[junit4]
[junit4] Suite: org.apache.lucene.store.TestNRTCachingDirectory
[junit4] IGNOR/A 0.00s J0 | TestNRTCachingDirectory.testPendingDeletions
[junit4] > Assumption #1: we can only install VirusCheckingFS on an FSDirectory
[junit4] IGNOR/A 0.00s J0 | TestNRTCachingDirectory.testFsyncDoesntCreateNewFiles
[junit4] > Assumption #1: test only works for FSDirectory subclasses
[junit4] Completed [269/466] on J0 in 0.71s, 44 tests, 2 skipped
[junit4]
[junit4] Suite: org.apache.lucene.index.TestSegmentReader
[junit4] Completed [270/466] on J0 in 0.47s, 7 tests
[junit4]
[junit4] Suite: org.apache.lucene.util.TestPagedBytes
[junit4] Completed [271/466] on J0 in 1.90s, 4 tests, 1 skipped
[junit4]
[junit4] Suite: org.apache.lucene.index.TestTransactions
[junit4] Completed [272/466] on J0 in 1.84s, 1 test
[junit4]
[junit4] Suite: org.apache.lucene.index.TestCrash
[junit4] Completed [273/466] on J0 in 0.17s, 5 tests
[junit4]
[junit4] Suite: org.apache.lucene.codecs.perfield.TestPerFieldPostingsFormat2
[junit4] Completed [274/466] on J0 in 5.12s, 6 tests
[junit4]
[junit4] Suite: org.apache.lucene.index.TestFieldsReader
[junit4] Completed [275/466] on J0 in 0.24s, 2 tests
[junit4]
[junit4] Suite: org.apache.lucene.index.TestDocValuesIndexing
[junit4] Completed [276/466] on J0 in 0.15s, 34 tests
[junit4]
[junit4] Suite: org.apache.lucene.search.TestBooleanMinShouldMatch
[junit4] Completed [277/466] on J0 in 1.00s, 17 tests
[junit4]
[junit4] Suite: org.apache.lucene.index.TestBagOfPositions
[junit4] Completed [278/466] on J2 in 19.34s, 1 test
[junit4]
[junit4] Suite: org.apache.lucene.index.Test2BDocs
[junit4] IGNOR/A 0.00s J2 | Test2BDocs.test2BDocs
[junit4] > Assumption #1: 'monster' test group is disabled (@Monster(value="Takes ~30min"))
[junit4] Completed [279/466] on J2 in 0.00s, 1 test, 1 skipped
[junit4]
[junit4] Suite: org.apache.lucene.index.TestTermsEnum2
[junit4] Completed [280/466] on J0 in 1.46s, 4 tests
[junit4]
[junit4] Suite: org.apache.lucene.search.spans.TestSpans
[junit4] Completed [281/466] on J2 in 0.29s, 26 tests
[junit4]
[junit4] Suite: org.apache.lucene.index.TestCustomNorms
[junit4] Completed [282/466] on J0 in 1.18s, 1 test
[junit4]
[junit4] Suite: org.apache.lucene.index.TestMixedCodecs
[junit4] Completed [283/466] on J2 in 0.76s, 1 test
[junit4]
[junit4] Suite: org.apache.lucene.index.TestTransactionRollback
[junit4] Completed [284/466] on J0 in 0.08s, 2 tests
[junit4]
[junit4] Suite: org.apache.lucene.codecs.compressing.TestFastCompressionMode
[junit4] Completed [285/466] on J0 in 0.91s, 11 tests
[junit4]
[junit4] Suite: org.apache.lucene.index.TestStressIndexing2
[junit4] Completed [286/466] on J0 in 0.77s, 3 tests
[junit4]
[junit4] Suite: org.apache.lucene.search.TestMultiPhraseQuery
[junit4] Completed [287/466] on J0 in 0.06s, 16 tests, 1 skipped
[junit4]
[junit4] Suite: org.apache.lucene.util.automaton.TestUTF32ToUTF8
[junit4] Completed [288/466] on J2 in 2.40s, 6 tests
[junit4]
[junit4] Suite: org.apache.lucene.analysis.tokenattributes.TestCharTermAttributeImpl
[junit4] Completed [289/466] on J0 in 0.13s, 13 tests
[junit4]
[junit4] Suite: org.apache.lucene.index.TestOmitPositions
[junit4] Completed [290/466] on J2 in 0.07s, 4 tests
[junit4]
[junit4] Suite: org.apache.lucene.index.TestParallelLeafReader
[junit4] Completed [291/466] on J0 in 0.07s, 10 tests
[junit4]
[junit4] Suite: org.apache.lucene.index.TestStressNRT
[junit4] Completed [292/466] on J2 in 0.92s, 1 test
[junit4]
[junit4] Suite: org.apache.lucene.search.TestDisjunctionMaxQuery
[junit4] Completed [293/466] on J2 in 0.20s, 13 tests
[junit4]
[junit4] Suite: org.apache.lucene.search.spans.TestNearSpansOrdered
[junit4] Completed [294/466] on J2 in 0.15s, 19 tests
[junit4]
[junit4] Suite: org.apache.lucene.search.TestSloppyPhraseQuery2
[junit4] Completed [295/466] on J0 in 1.67s, 9 tests
[junit4]
[junit4] Suite: org.apache.lucene.index.TestCrashCausesCorruptIndex
[junit4] Completed [296/466] on J0 in 0.05s, 1 test
[junit4]
[junit4] Suite: org.apache.lucene.index.TestMultiFields
[junit4] Completed [297/466] on J2 in 0.87s, 3 tests
[junit4]
[junit4] Suite: org.apache.lucene.search.TestMultiTermConstantScore
[junit4] Completed [298/466] on J2 in 0.41s, 7 tests
[junit4]
[junit4] Suite: org.apache.lucene.search.TestFuzzyQuery
[junit4] Completed [299/466] on J2 in 3.26s, 11 tests
[junit4]
[junit4] Suite: org.apache.lucene.index.TestPayloads
[junit4] Completed [300/466] on J2 in 0.11s, 7 tests
[junit4]
[junit4] Suite: org.apache.lucene.index.TestDoc
[junit4] Completed [301/466] on J2 in 0.07s, 1 test
[junit4]
[junit4] Suite: org.apache.lucene.search.similarities.TestSimilarity2
[junit4] Completed [302/466] on J2 in 0.06s, 8 tests
[junit4]
[junit4] Suite: org.apache.lucene.search.spans.TestFieldMaskingSpanQuery
[junit4] IGNOR/A 0.00s J2 | TestFieldMaskingSpanQuery.testSpans2
[junit4] > Assumption #1: Broken scoring: LUCENE-3723
[junit4] IGNOR/A 0.00s J2 | TestFieldMaskingSpanQuery.testSimple2
[junit4] > Assumption #1: Broken scoring: LUCENE-3723
[junit4] Completed [303/466] on J2 in 0.05s, 11 tests, 2 skipped
[junit4]
[junit4] Suite: org.apache.lucene.search.TestScorerPerf
[junit4] Completed [304/466] on J0 in 5.27s, 1 test
[junit4]
[junit4] Suite: org.apache.lucene.TestExternalCodecs
[junit4] Completed [305/466] on J2 in 0.13s, 1 test
[junit4]
[junit4] Suite: org.apache.lucene.index.TestNoDeletionPolicy
[junit4] Completed [306/466] on J0 in 0.02s, 4 tests
[junit4]
[junit4] Suite: org.apache.lucene.search.TestRegexpQuery
[junit4] Completed [307/466] on J2 in 0.03s, 7 tests
[junit4]
[junit4] Suite: org.apache.lucene.index.TestIntBlockPool
[junit4] Completed [308/466] on J0 in 0.25s, 2 tests
[junit4]
[junit4] Suite: org.apache.lucene.search.TestPrefixInBooleanQuery
[junit4] Completed [309/466] on J2 in 0.18s, 4 tests
[junit4]
[junit4] Suite: org.apache.lucene.index.TestSegmentTermEnum
[junit4] Completed [310/466] on J0 in 0.01s, 2 tests
[junit4]
[junit4] Suite: org.apache.lucene.search.TestBooleanQuery
[junit4] Completed [311/466] on J2 in 0.12s, 22 tests
[junit4]
[junit4] Suite: org.apache.lucene.search.TestComplexExplanationsOfNonMatches
[junit4] Completed [312/466] on J0 in 0.02s, 21 tests
[junit4]
[junit4] Suite: org.apache.lucene.index.TestMaxTermFrequency
[junit4] Completed [313/466] on J0 in 0.09s, 1 test
[junit4]
[junit4] Suite: org.apache.lucene.search.TestTopFieldCollector
[junit4] Completed [314/466] on J0 in 0.11s, 8 tests
[junit4]
[junit4] Suite: org.apache.lucene.search.TestAutomatonQuery
[junit4] Completed [315/466] on J2 in 0.94s, 8 tests
[junit4]
[junit4] Suite: org.apache.lucene.index.TestSumDocFreq
[junit4] Completed [316/466] on J2 in 0.07s, 1 test
[junit4]
[junit4] Suite: org.apache.lucene.index.TestIndexableField
[junit4] Completed [317/466] on J2 in 0.70s, 2 tests
[junit4]
[junit4] Suite: org.apache.lucene.store.TestFileSwitchDirectory
[junit4] IGNOR/A 0.00s J0 | TestFileSwitchDirectory.testPendingDeletions
[junit4] > Assumption #1: we can only install VirusCheckingFS on an FSDirectory
[junit4] IGNOR/A 0.01s J0 | TestFileSwitchDirectory.testFsyncDoesntCreateNewFiles
[junit4] > Assumption #1: test only works for FSDirectory subclasses
[junit4] Completed [318/466] on J0 in 1.29s, 43 tests, 2 skipped
[junit4]
[junit4] Suite: org.apache.lucene.util.TestSentinelIntSet
[junit4] Completed [319/466] on J2 in 0.08s, 2 tests
[junit4]
[junit4] Suite: org.apache.lucene.search.TestWildcardRandom
[junit4] Completed [320/466] on J0 in 0.13s, 1 test
[junit4]
[junit4] Suite: org.apache.lucene.search.TestRegexpRandom
[junit4] Completed [321/466] on J0 in 0.13s, 1 test
[junit4]
[junit4] Suite: org.apache.lucene.index.TestPayloadsOnVectors
[junit4] Completed [322/466] on J0 in 0.05s, 3 tests
[junit4]
[junit4] Suite: org.apache.lucene.search.spans.TestSpanMultiTermQueryWrapper
[junit4] Completed [323/466] on J0 in 0.06s, 9 tests
[junit4]
[junit4] Suite: org.apache.lucene.TestSearchForDuplicates
[junit4] Completed [324/466] on J0 in 0.08s, 1 test
[junit4]
[junit4] Suite: org.apache.lucene.util.automaton.TestCompiledAutomaton
[junit4] Completed [325/466] on J0 in 0.19s, 6 tests
[junit4]
[junit4] Suite: org.apache.lucene.search.TestPrefixRandom
[junit4] Completed [326/466] on J2 in 1.42s, 1 test
[junit4]
[junit4] Suite: org.apache.lucene.index.TestBinaryTerms
[junit4] Completed [327/466] on J2 in 0.05s, 2 tests
[junit4]
[junit4] Suite: org.apache.lucene.util.TestRecyclingIntBlockAllocator
[junit4] Completed [328/466] on J2 in 0.04s, 3 tests
[junit4]
[junit4] Suite: org.apache.lucene.index.TestIndexWriterConfig
[junit4] Completed [329/466] on J2 in 0.03s, 8 tests
[junit4]
[junit4] Suite: org.apache.lucene.search.TestDateSort
[junit4] Completed [330/466] on J2 in 0.02s, 1 test
[junit4]
[junit4] Suite: org.apache.lucene.index.TestFilterLeafReader
[junit4] Completed [331/466] on J2 in 0.02s, 3 tests
[junit4]
[junit4] Suite: org.apache.lucene.TestSearch
[junit4] Completed [332/466] on J2 in 0.02s, 2 tests
[junit4]
[junit4] Suite: org.apache.lucene.document.TestDateTools
[junit4] Completed [333/466] on J2 in 0.05s, 5 tests
[junit4]
[junit4] Suite: org.apache.lucene.index.Test2BPostings
[junit4] IGNOR/A 0.00s J2 | Test2BPostings.test
[junit4] > Assumption #1: 'nightly' test group is disabled (@Nightly())
[junit4] Completed [334/466] on J2 in 0.00s, 1 test, 1 skipped
[junit4]
[junit4] Suite: org.apache.lucene.index.TestSameTokenSamePosition
[junit4] Completed [335/466] on J2 in 0.03s, 2 tests
[junit4]
[junit4] Suite: org.apache.lucene.search.TestPrefixQuery
[junit4] Completed [336/466] on J0 in 2.27s, 3 tests
[junit4]
[junit4] Suite: org.apache.lucene.search.TestCachingCollector
[junit4] Completed [337/466] on J2 in 0.01s, 4 tests
[junit4]
[junit4] Suite: org.apache.lucene.search.TestTotalHitCountCollector
[junit4] Completed [338/466] on J0 in 0.01s, 1 test
[junit4]
[junit4] Suite: org.apache.lucene.util.TestRecyclingByteBlockAllocator
[junit4] Completed [339/466] on J2 in 0.02s, 3 tests
[junit4]
[junit4] Suite: org.apache.lucene.util.TestRamUsageEstimator
[junit4] IGNOR/A 0.00s J2 | TestRamUsageEstimator.testPrintValues
[junit4] > Assumption #1: Specify -Dtests.verbose=true to print constants of RamUsageEstimator.
[junit4] Completed [340/466] on J2 in 0.01s, 5 tests, 1 skipped
[junit4]
[junit4] Suite: org.apache.lucene.search.spans.TestSpanFirstQuery
[junit4] Completed [341/466] on J2 in 0.01s, 1 test
[junit4]
[junit4] Suite: org.apache.lucene.index.TestIsCurrent
[junit4] Completed [342/466] on J2 in 0.01s, 2 tests
[junit4]
[junit4] Suite: org.apache.lucene.index.TestNoMergeScheduler
[junit4] Completed [343/466] on J2 in 0.01s, 3 tests
[junit4]
[junit4] Suite: org.apache.lucene.util.TestNamedSPILoader
[junit4] Completed [344/466] on J2 in 0.01s, 3 tests
[junit4]
[junit4] Suite: org.apache.lucene.index.TestIndexWriterLockRelease
[junit4] Completed [345/466] on J2 in 0.01s, 1 test
[junit4]
[junit4] Suite: org.apache.lucene.search.TestBooleanScorer
[junit4] Completed [346/466] on J0 in 1.71s, 5 tests
[junit4]
[junit4] Suite: org.apache.lucene.search.TestPhrasePrefixQuery
[junit4] Completed [347/466] on J2 in 0.01s, 1 test
[junit4]
[junit4] Suite: org.apache.lucene.util.TestBytesRef
[junit4] Completed [348/466] on J0 in 0.01s, 3 tests
[junit4]
[junit4] Suite: org.apache.lucene.analysis.TestCharFilter
[junit4] Completed [349/466] on J2 in 0.10s, 4 tests
[junit4]
[junit4] Suite: org.apache.lucene.index.TestRollback
[junit4] Completed [350/466] on J0 in 0.01s, 1 test
[junit4]
[junit4] Suite: org.apache.lucene.index.TestFieldInfos
[junit4] Completed [351/466] on J2 in 0.01s, 1 test
[junit4]
[junit4] Suite: org.apache.lucene.index.TestIndexWriterOnJRECrash
[junit4] IGNOR/A 0.00s J0 | TestIndexWriterOnJRECrash.testNRTThreads
[junit4] > Assumption #1: 'nightly' test group is disabled (@Nightly())
[junit4] Completed [352/466] on J0 in 0.00s, 1 test, 1 skipped
[junit4]
[junit4] Suite: org.apache.lucene.util.TestVersion
[junit4] Completed [353/466] on J2 in 0.02s, 11 tests
[junit4]
[junit4] Suite: org.apache.lucene.index.TestCodecHoldsOpenFiles
[junit4] Completed [354/466] on J0 in 0.02s, 1 test
[junit4]
[junit4] Suite: org.apache.lucene.search.MultiCollectorTest
[junit4] Completed [355/466] on J2 in 0.01s, 4 tests
[junit4]
[junit4] Suite: org.apache.lucene.index.TestTermdocPerf
[junit4] Completed [356/466] on J0 in 0.01s, 1 test
[junit4]
[junit4] Suite: org.apache.lucene.index.TestIndexCommit
[junit4] Completed [357/466] on J2 in 0.01s, 1 test
[junit4]
[junit4] Suite: org.apache.lucene.index.Test2BPostingsBytes
[junit4] IGNOR/A 0.00s J0 | Test2BPostingsBytes.test
[junit4] > Assumption #1: 'monster' test group is disabled (@Monster(value="takes ~20GB-30GB of space and 10 minutes"))
[junit4] Completed [358/466] on J0 in 0.00s, 1 test, 1 skipped
[junit4]
[junit4] Suite: org.apache.lucene.util.TestIOUtils
[junit4] Completed [359/466] on J2 in 0.15s, 18 tests
[junit4]
[junit4] Suite: org.apache.lucene.index.TestNewestSegment
[junit4] Completed [360/466] on J0 in 0.01s, 1 test
[junit4]
[junit4] Suite: org.apache.lucene.store.TestByteArrayDataInput
[junit4] Completed [361/466] on J2 in 0.01s, 1 test
[junit4]
[junit4] Suite: org.apache.lucene.analysis.TestCharArrayMap
[junit4] Completed [362/466] on J0 in 0.08s, 4 tests
[junit4]
[junit4] Suite: org.apache.lucene.analysis.TestCharArraySet
[junit4] Completed [363/466] on J2 in 0.02s, 15 tests
[junit4]
[junit4] Suite: org.apache.lucene.analysis.TestCharacterUtils
[junit4] Completed [364/466] on J0 in 0.01s, 4 tests
[junit4]
[junit4] Suite: org.apache.lucene.analysis.TestDelegatingAnalyzerWrapper
[junit4] Completed [365/466] on J2 in 0.01s, 3 tests
[junit4]
[junit4] Suite: org.apache.lucene.analysis.TestReusableStringReader
[junit4] Completed [366/466] on J0 in 0.01s, 1 test
[junit4]
[junit4] Suite: org.apache.lucene.analysis.TestStopFilter
[junit4] Completed [367/466] on J2 in 0.01s, 4 tests
[junit4]
[junit4] Suite: org.apache.lucene.analysis.TestWordlistLoader
[junit4] Completed [368/466] on J0 in 0.01s, 3 tests
[junit4]
[junit4] Suite: org.apache.lucene.analysis.tokenattributes.TestBytesRefAttImpl
[junit4] Completed [369/466] on J2 in 0.01s, 1 test
[junit4]
[junit4] Suite: org.apache.lucene.codecs.TestCodecUtil
[junit4] Completed [370/466] on J2 in 0.06s, 16 tests
[junit4]
[junit4] Suite: org.apache.lucene.codecs.TestCodecLoadingDeadlock
[junit4] Completed [371/466] on J0 in 0.37s, 1 test
[junit4]
[junit4] Suite: org.apache.lucene.codecs.lucene50.TestBlockPostingsFormat2
[junit4] Completed [372/466] on J0 in 1.93s, 4 tests
[junit4]
[junit4] Suite: org.apache.lucene.codecs.lucene50.TestBlockPostingsFormat
[junit4] Completed [373/466] on J2 in 4.24s, 27 tests
[junit4]
[junit4] Suite: org.apache.lucene.codecs.lucene50.TestLucene50CompoundFormat
[junit4] Completed [374/466] on J0 in 2.90s, 26 tests
[junit4]
[junit4] Suite: org.apache.lucene.codecs.lucene50.TestLucene50StoredFieldsFormat
[junit4] IGNOR/A 0.00s J2 | TestLucene50StoredFieldsFormat.testBigDocuments
[junit4] > Assumption #1: 'nightly' test group is disabled (@Nightly())
[junit4] Completed [375/466] on J2 in 1.73s, 17 tests, 1 skipped
[junit4]
[junit4] Suite: org.apache.lucene.codecs.lucene50.TestLucene60FieldInfoFormat
[junit4] Completed [376/466] on J2 in 0.52s, 11 tests
[junit4]
[junit4] Suite: org.apache.lucene.index.TestTermsEnum
[junit4] Completed [377/466] on J1 in 62.76s, 13 tests
[junit4]
[junit4] Suite: org.apache.lucene.codecs.lucene60.TestLucene60PointsFormat
[junit4] IGNOR/A 0.00s J2 | TestLucene60PointsFormat.testMergeStability
[junit4] > Assumption #1: merge is not stable
[junit4] IGNOR/A 0.00s J2 | TestLucene60PointsFormat.testRandomBinaryBig
[junit4] > Assumption #1: 'nightly' test group is disabled (@Nightly())
[junit4] Completed [378/466] on J2 in 4.75s, 20 tests, 2 skipped
[junit4]
[junit4] Suite: org.apache.lucene.codecs.lucene50.TestLucene50TermVectorsFormat
[junit4] Completed [379/466] on J0 in 14.37s, 17 tests
[junit4]
[junit4] Suite: org.apache.lucene.codecs.lucene70.TestLucene70SegmentInfoFormat
[junit4] Completed [380/466] on J0 in 0.24s, 16 tests
[junit4]
[junit4] Suite: org.apache.lucene.document.TestFloatRange
[junit4] Completed [381/466] on J0 in 0.01s, 1 test
[junit4]
[junit4] Suite: org.apache.lucene.document.TestLongRange
[junit4] Completed [382/466] on J0 in 0.01s, 1 test
[junit4]
[junit4] Suite: org.apache.lucene.geo.TestGeoEncodingUtils
[junit4] Completed [383/466] on J0 in 0.48s, 3 tests
[junit4]
[junit4] Suite: org.apache.lucene.geo.TestPolygon
[junit4] Completed [384/466] on J0 in 0.01s, 15 tests
[junit4]
[junit4] Suite: org.apache.lucene.codecs.lucene70.TestLucene70NormsFormat
[junit4] IGNOR/A 0.00s J2 | TestLucene70NormsFormat.testSparseNCommonBig
[junit4] > Assumption #1: 'nightly' test group is disabled (@Nightly())
[junit4] IGNOR/A 0.00s J2 | TestLucene70NormsFormat.testMergeStability
[junit4] > Assumption #1: The MockRandom PF randomizes content on the fly, so we can't check it
[junit4] IGNOR/A 0.00s J2 | TestLucene70NormsFormat.testNCommonBig
[junit4] > Assumption #1: 'nightly' test group is disabled (@Nightly())
[junit4] Completed [385/466] on J2 in 13.61s, 29 tests, 3 skipped
[junit4]
[junit4] Suite: org.apache.lucene.index.Test2BPoints
[junit4] IGNOR/A 0.00s J2 | Test2BPoints.test1D
[junit4] > Assumption #1: 'monster' test group is disabled (@Monster(value="takes at least 4 hours and consumes many GB of temp disk space"))
[junit4] IGNOR/A 0.00s J2 | Test2BPoints.test2D
[junit4] > Assumption #1: 'monster' test group is disabled (@Monster(value="takes at least 4 hours and consumes many GB of temp disk space"))
[junit4] Completed [386/466] on J2 in 0.01s, 2 tests, 2 skipped
[junit4]
[junit4] Suite: org.apache.lucene.index.Test2BSortedDocValuesFixedSorted
[junit4] IGNOR/A 0.00s J2 | Test2BSortedDocValuesFixedSorted.testFixedSorted
[junit4] > Assumption #1: 'monster' test group is disabled (@Monster(value="Takes ~ 6 hours if the heap is 5gb"))
[junit4] Completed [387/466] on J2 in 0.00s, 1 test, 1 skipped
[junit4]
[junit4] Suite: org.apache.lucene.index.TestAllFilesDetectTruncation
[junit4] Completed [388/466] on J2 in 0.46s, 1 test
[junit4]
[junit4] Suite: org.apache.lucene.index.TestAllFilesHaveChecksumFooter
[junit4] Completed [389/466] on J2 in 0.19s, 1 test
[junit4]
[junit4] Suite: org.apache.lucene.index.TestCustomTermFreq
[junit4] Completed [390/466] on J2 in 0.03s, 12 tests
[junit4]
[junit4] Suite: org.apache.lucene.index.TestDocIDMerger
[junit4] Completed [391/466] on J2 in 0.01s, 2 tests
[junit4]
[junit4] Suite: org.apache.lucene.index.TestDocsWithFieldSet
[junit4] Completed [392/466] on J2 in 0.00s, 3 tests
[junit4]
[junit4] Suite: org.apache.lucene.geo.TestPolygon2D
[junit4] Completed [393/466] on J0 in 6.24s, 10 tests
[junit4]
[junit4] Suite: org.apache.lucene.index.TestFieldInvertState
[junit4] Completed [394/466] on J2 in 0.05s, 2 tests
[junit4]
[junit4] Suite: org.apache.lucene.index.TestFieldReuse
[junit4] Completed [395/466] on J0 in 0.01s, 2 tests
[junit4]
[junit4] Suite: org.apache.lucene.index.TestFilterDirectoryReader
[junit4] Completed [396/466] on J2 in 0.01s, 1 test
[junit4]
[junit4] Suite: org.apache.lucene.index.TestIndexWriterDeleteByQuery
[junit4] Completed [397/466] on J2 in 0.01s, 1 test
[junit4]
[junit4] Suite: org.apache.lucene.index.TestIndexWriterFromReader
[junit4] Completed [398/466] on J2 in 0.20s, 12 tests
[junit4]
[junit4] Suite: org.apache.lucene.index.TestIndexWriterMaxDocs
[junit4] IGNOR/A 0.00s J2 | TestIndexWriterMaxDocs.testExactlyAtTrueLimit
[junit4] > Assumption #1: 'monster' test group is disabled (@Monster(value="takes over two hours"))
[junit4] Completed [399/466] on J2 in 1.52s, 21 tests, 1 skipped
[junit4]
[junit4] Suite: org.apache.lucene.index.TestIndexWriterOnVMError
[junit4] IGNOR/A 0.00s J2 | TestIndexWriterOnVMError.testCheckpoint
[junit4] > Assumption #1: 'nightly' test group is disabled (@Nightly())
[junit4] Completed [400/466] on J2 in 0.33s, 3 tests, 1 skipped
[junit4]
[junit4] Suite: org.apache.lucene.index.TestIndexWriterOutOfFileDescriptors
[junit4] Completed [401/466] on J2 in 1.31s, 1 test
[junit4]
[junit4] Suite: org.apache.lucene.index.TestIndexWriterThreadsToSegments
[junit4] Completed [402/466] on J2 in 0.67s, 4 tests
[junit4]
[junit4] Suite: org.apache.lucene.index.TestManyFields
[junit4] Completed [403/466] on J2 in 0.43s, 3 tests
[junit4]
[junit4] Suite: org.apache.lucene.index.TestMaxPosition
[junit4] Completed [404/466] on J2 in 0.02s, 2 tests
[junit4]
[junit4] Suite: org.apache.lucene.index.TestMergePolicyWrapper
[junit4] Completed [405/466] on J2 in 0.01s, 1 test
[junit4]
[junit4] Suite: org.apache.lucene.index.TestMergeRateLimiter
[junit4] Completed [406/466] on J2 in 0.01s, 1 test
[junit4]
[junit4] Suite: org.apache.lucene.index.TestMultiTermsEnum
[junit4] Completed [407/466] on J2 in 0.01s, 1 test
[junit4]
[junit4] Suite: org.apache.lucene.index.TestNRTReaderCleanup
[junit4] Completed [408/466] on J2 in 0.02s, 1 test
[junit4]
[junit4] Suite: org.apache.lucene.index.TestOneMergeWrappingMergePolicy
[junit4] Completed [409/466] on J2 in 0.01s, 1 test
[junit4]
[junit4] Suite: org.apache.lucene.index.TestOrdinalMap
[junit4] Completed [410/466] on J2 in 0.04s, 1 test
[junit4]
[junit4] Suite: org.apache.lucene.index.TestReadOnlyIndex
[junit4] Completed [411/466] on J2 in 0.20s, 1 test
[junit4]
[junit4] Suite: org.apache.lucene.index.TestSegmentInfos
[junit4] Completed [412/466] on J2 in 0.03s, 4 tests
[junit4]
[junit4] Suite: org.apache.lucene.index.TestSortedSetDocValues
[junit4] Completed [413/466] on J2 in 0.01s, 1 test
[junit4]
[junit4] Suite: org.apache.lucene.index.TestStressDeletes
[junit4] Completed [414/466] on J2 in 0.44s, 1 test
[junit4]
[junit4] Suite: org.apache.lucene.index.TestTermContext
[junit4] Completed [415/466] on J2 in 0.00s, 1 test
[junit4]
[junit4] Suite: org.apache.lucene.index.TestTerms
[junit4] Completed [416/466] on J2 in 0.10s, 2 tests
[junit4]
[junit4] Suite: org.apache.lucene.index.TestUpgradeIndexMergePolicy
[junit4] Completed [417/466] on J2 in 0.01s, 1 test
[junit4]
[junit4] Suite: org.apache.lucene.search.TestBlendedTermQuery
[junit4] Completed [418/466] on J2 in 0.01s, 3 tests
[junit4]
[junit4] Suite: org.apache.lucene.search.TestBoolean2ScorerSupplier
[junit4] Completed [419/466] on J2 in 0.17s, 10 tests
[junit4]
[...truncated too long message...]
Solr-7.3-Linux/solr/build/solr-core/classes/test
[javac] Compiling 875 source files to /home/jenkins/workspace/Lucene-Solr-7.3-Linux/solr/build/solr-core/classes/test
[javac] Note: Some input files use or override a deprecated API.
[javac] Note: Recompile with -Xlint:deprecation for details.
[javac] Note: Some input files use unchecked or unsafe operations.
[javac] Note: Recompile with -Xlint:unchecked for details.
[javac] Creating empty /home/jenkins/workspace/Lucene-Solr-7.3-Linux/solr/build/solr-core/classes/test/org/apache/solr/cloud/autoscaling/sim/package-info.class
[copy] Copying 1 file to /home/jenkins/workspace/Lucene-Solr-7.3-Linux/solr/build/solr-core/classes/test
common-solr.compile-test:
compile-test:
BUILD SUCCESSFUL
Total time: 1 minute 2 seconds
[repro] ant test-nocompile -Dtests.dups=5 -Dtests.maxfailures=5 -Dtests.class="*.MoveReplicaHDFSTest" -Dtests.showOutput=onerror "-Dargs=-XX:+UseCompressedOops -XX:+UseSerialGC" -Dtests.seed=421018B9561C4A9B -Dtests.multiplier=3 -Dtests.slow=true -Dtests.locale=ak-GH -Dtests.timezone=America/Puerto_Rico -Dtests.asserts=true -Dtests.file.encoding=UTF-8
Buildfile: /home/jenkins/workspace/Lucene-Solr-7.3-Linux/solr/core/build.xml
-clover.disable:
ivy-configure:
[ivy:configure] :: Apache Ivy 2.4.0 - 20141213170938 :: http://ant.apache.org/ivy/ ::
[ivy:configure] :: loading settings :: file = /home/jenkins/workspace/Lucene-Solr-7.3-Linux/lucene/top-level-ivy-settings.xml
install-junit4-taskdef:
ivy-availability-check:
[loadresource] Do not set property disallowed.ivy.jars.list as its length is 0.
-ivy-fail-disallowed-ivy-version:
ivy-fail:
resolve-groovy:
[ivy:cachepath] :: resolving dependencies :: org.codehaus.groovy#groovy-all-caller;working
[ivy:cachepath] confs: [default]
[ivy:cachepath] found org.codehaus.groovy#groovy-all;2.4.13 in public
[ivy:cachepath] :: resolution report :: resolve 19ms :: artifacts dl 1ms
---------------------------------------------------------------------
| | modules || artifacts |
| conf | number| search|dwnlded|evicted|| number|dwnlded|
---------------------------------------------------------------------
| default | 1 | 0 | 0 | 0 || 1 | 0 |
---------------------------------------------------------------------
-init-totals:
-test:
[mkdir] Created dir: /home/jenkins/workspace/Lucene-Solr-7.3-Linux/solr/build/solr-core/test
[junit4:pickseed] Seed property 'tests.seed' already defined: 421018B9561C4A9B
[mkdir] Created dir: /home/jenkins/workspace/Lucene-Solr-7.3-Linux/solr/build/solr-core/test/temp
[junit4] <JUnit4> says olá! Master seed: 421018B9561C4A9B
[junit4] Executing 5 suites with 3 JVMs.
[junit4]
[junit4] Started J0 PID(8459@serv1.sd-datasolutions.de).
[junit4] Started J2 PID(8457@serv1.sd-datasolutions.de).
[junit4] Started J1 PID(8458@serv1.sd-datasolutions.de).
[junit4] Suite: org.apache.solr.cloud.MoveReplicaHDFSTest
[junit4] OK 20.3s J1 | MoveReplicaHDFSTest.testNormalMove
[junit4] OK 14.8s J1 | MoveReplicaHDFSTest.testFailedMove
[junit4] OK 23.4s J1 | MoveReplicaHDFSTest.test
[junit4] OK 11.8s J1 | MoveReplicaHDFSTest.testNormalFailedMove
[junit4] Completed [1/5] on J1 in 92.05s, 4 tests
[junit4]
[junit4] Suite: org.apache.solr.cloud.MoveReplicaHDFSTest
[junit4] OK 22.3s J2 | MoveReplicaHDFSTest.testNormalMove
[junit4] OK 13.0s J2 | MoveReplicaHDFSTest.testFailedMove
[junit4] OK 24.5s J2 | MoveReplicaHDFSTest.test
[junit4] OK 12.2s J2 | MoveReplicaHDFSTest.testNormalFailedMove
[junit4] Completed [2/5] on J2 in 93.54s, 4 tests
[junit4]
[junit4] Duplicate suite name used with XML reports: org.apache.solr.cloud.MoveReplicaHDFSTest. This may confuse tools that process XML reports. Set 'ignoreDuplicateSuites' to true to skip this message.
[junit4] Suite: org.apache.solr.cloud.MoveReplicaHDFSTest
[junit4] OK 22.8s J0 | MoveReplicaHDFSTest.testNormalMove
[junit4] OK 16.7s J0 | MoveReplicaHDFSTest.testFailedMove
[junit4] OK 21.5s J0 | MoveReplicaHDFSTest.test
[junit4] OK 12.5s J0 | MoveReplicaHDFSTest.testNormalFailedMove
[junit4] Completed [3/5] on J0 in 96.51s, 4 tests
[junit4]
[junit4] Suite: org.apache.solr.cloud.MoveReplicaHDFSTest
[junit4] OK 16.0s J1 | MoveReplicaHDFSTest.testNormalMove
[junit4] OK 13.0s J1 | MoveReplicaHDFSTest.testFailedMove
[junit4] OK 21.9s J1 | MoveReplicaHDFSTest.test
[junit4] OK 11.1s J1 | MoveReplicaHDFSTest.testNormalFailedMove
[junit4] Completed [4/5] on J1 in 75.78s, 4 tests
[junit4]
[junit4] Suite: org.apache.solr.cloud.MoveReplicaHDFSTest
[junit4] OK 18.9s J2 | MoveReplicaHDFSTest.testNormalMove
[junit4] OK 15.0s J2 | MoveReplicaHDFSTest.testFailedMove
[junit4] OK 19.9s J2 | MoveReplicaHDFSTest.test
[junit4] OK 11.2s J2 | MoveReplicaHDFSTest.testNormalFailedMove
[junit4] Completed [5/5] on J2 in 77.75s, 4 tests
[junit4]
[junit4] JVM J0: 0.70 .. 98.17 = 97.47s
[junit4] JVM J1: 0.72 .. 169.62 = 168.90s
[junit4] JVM J2: 0.70 .. 172.78 = 172.08s
[junit4] Execution time total: 2 minutes 52 seconds
[junit4] Tests summary: 5 suites, 20 tests
[junit4] Could not remove temporary path: /home/jenkins/workspace/Lucene-Solr-7.3-Linux/solr/build/solr-core/test/J2 (java.nio.file.DirectoryNotEmptyException: Remaining files: [/home/jenkins/workspace/Lucene-Solr-7.3-Linux/solr/build/solr-core/test/J2/temp])
[junit4] Could not remove temporary path: /home/jenkins/workspace/Lucene-Solr-7.3-Linux/solr/build/solr-core/test/J0 (java.nio.file.DirectoryNotEmptyException: Remaining files: [/home/jenkins/workspace/Lucene-Solr-7.3-Linux/solr/build/solr-core/test/J0/temp])
[junit4] Could not remove temporary path: /home/jenkins/workspace/Lucene-Solr-7.3-Linux/solr/build/solr-core/test/J1 (java.nio.file.DirectoryNotEmptyException: Remaining files: [/home/jenkins/workspace/Lucene-Solr-7.3-Linux/solr/build/solr-core/test/J1/temp])
[echo] 5 slowest tests:
[junit4:tophints] 1310.13s | org.apache.solr.cloud.BasicDistributedZkTest
[junit4:tophints] 229.08s | org.apache.solr.cloud.autoscaling.TriggerIntegrationTest
[junit4:tophints] 212.67s | org.apache.solr.update.TestInPlaceUpdatesDistrib
[junit4:tophints] 130.39s | org.apache.solr.cloud.api.collections.ShardSplitTest
[junit4:tophints] 117.00s | org.apache.solr.update.SoftAutoCommitTest
-check-totals:
WARNING: An illegal reflective access operation has occurred
WARNING: Illegal reflective access by org.codehaus.groovy.reflection.CachedClass (file:/home/jenkins/.ivy2/cache/org.codehaus.groovy/groovy-all/jars/groovy-all-2.4.13.jar) to method java.lang.Object.finalize()
WARNING: Please consider reporting this to the maintainers of org.codehaus.groovy.reflection.CachedClass
WARNING: Use --illegal-access=warn to enable warnings of further illegal reflective access operations
WARNING: All illegal access operations will be denied in a future release
test-nocompile:
BUILD SUCCESSFUL
Total time: 2 minutes 54 seconds
[repro] Failures:
[repro] 0/5 failed: org.apache.solr.cloud.MoveReplicaHDFSTest
[repro] Exiting with code 0
+ mv lucene/build lucene/build.repro
+ mv solr/build solr/build.repro
+ mv lucene/build.orig lucene/build
+ mv solr/build.orig solr/build
Archiving artifacts
Setting ANT_1_8_2_HOME=/var/lib/jenkins/tools/hudson.tasks.Ant_AntInstallation/ANT_1.8.2
java.lang.InterruptedException: no matches found within 10000
at hudson.FilePath$34.hasMatch(FilePath.java:2633)
at hudson.FilePath$34.invoke(FilePath.java:2512)
at hudson.FilePath$34.invoke(FilePath.java:2502)
at hudson.FilePath.act(FilePath.java:1008)
at hudson.FilePath.act(FilePath.java:986)
at hudson.FilePath.validateAntFileMask(FilePath.java:2502)
at hudson.tasks.ArtifactArchiver.perform(ArtifactArchiver.java:243)
at hudson.tasks.BuildStepCompatibilityLayer.perform(BuildStepCompatibilityLayer.java:81)
at hudson.tasks.BuildStepMonitor$1.perform(BuildStepMonitor.java:20)
at hudson.model.AbstractBuild$AbstractBuildExecution.perform(AbstractBuild.java:744)
at hudson.model.AbstractBuild$AbstractBuildExecution.performAllBuildSteps(AbstractBuild.java:690)
at hudson.model.Build$BuildExecution.post2(Build.java:186)
at hudson.model.AbstractBuild$AbstractBuildExecution.post(AbstractBuild.java:635)
at hudson.model.Run.execute(Run.java:1752)
at hudson.model.FreeStyleBuild.run(FreeStyleBuild.java:43)
at hudson.model.ResourceController.execute(ResourceController.java:97)
at hudson.model.Executor.run(Executor.java:429)
No artifacts found that match the file pattern "**/*.events,heapdumps/**,**/*_pid*.log". Configuration error?
[WARNINGS] Parsing warnings in console log with parser Java Compiler (javac)
Setting ANT_1_8_2_HOME=/var/lib/jenkins/tools/hudson.tasks.Ant_AntInstallation/ANT_1.8.2
Setting ANT_1_8_2_HOME=/var/lib/jenkins/tools/hudson.tasks.Ant_AntInstallation/ANT_1.8.2
<Git Blamer> Using GitBlamer to create author and commit information for all warnings.
<Git Blamer> GIT_COMMIT=98a6b3d642928b1ac9076c6c5a369472581f7633, workspace=/var/lib/jenkins/workspace/Lucene-Solr-7.3-Linux
[WARNINGS] Computing warning deltas based on reference build #81
Recording test results
Setting ANT_1_8_2_HOME=/var/lib/jenkins/tools/hudson.tasks.Ant_AntInstallation/ANT_1.8.2
Build step 'Publish JUnit test result report' changed build result to UNSTABLE
Email was triggered for: Unstable (Test Failures)
Sending email for trigger: Unstable (Test Failures)
Setting ANT_1_8_2_HOME=/var/lib/jenkins/tools/hudson.tasks.Ant_AntInstallation/ANT_1.8.2
Setting ANT_1_8_2_HOME=/var/lib/jenkins/tools/hudson.tasks.Ant_AntInstallation/ANT_1.8.2
Setting ANT_1_8_2_HOME=/var/lib/jenkins/tools/hudson.tasks.Ant_AntInstallation/ANT_1.8.2
Setting ANT_1_8_2_HOME=/var/lib/jenkins/tools/hudson.tasks.Ant_AntInstallation/ANT_1.8.2