You are viewing a plain text version of this content. The canonical link for it is here.
Posted to builds@mesos.apache.org by Apache Jenkins Server <je...@builds.apache.org> on 2017/06/29 05:50:04 UTC

Build failed in Jenkins: Mesos-Buildbot » cmake,gcc,--verbose,GLOG_v=1 MESOS_VERBOSE=1,ubuntu:14.04,(ubuntu)&&(!ubuntu-us1)&&(!ubuntu-eu2) #3849

See <https://builds.apache.org/job/Mesos-Buildbot/BUILDTOOL=cmake,COMPILER=gcc,CONFIGURATION=--verbose,ENVIRONMENT=GLOG_v=1%20MESOS_VERBOSE=1,OS=ubuntu%3A14.04,label_exp=(ubuntu)&&(!ubuntu-us1)&&(!ubuntu-eu2)/3849/display/redirect?page=changes>

Changes:

[vinodkone] Fixed parameters in JNI call for disconnected event.

------------------------------------------
[...truncated 24.75 MB...]
I0629 05:49:53.645548 25306 http.cpp:936] Authorizing principal 'test-principal' to GET the '/monitor/statistics.json' endpoint
I0629 05:49:53.649598 25307 slave.cpp:796] Agent terminating
[       OK ] Endpoint/SlaveEndpointTest.AuthorizedRequest/1 (15 ms)
[ RUN      ] Endpoint/SlaveEndpointTest.AuthorizedRequest/2
I0629 05:49:53.653934 25301 containerizer.cpp:221] Using isolation: posix/cpu,posix/mem,filesystem/posix,network/cni
W0629 05:49:53.654335 25301 backend.cpp:76] Failed to create 'aufs' backend: AufsBackend requires root privileges
W0629 05:49:53.654487 25301 backend.cpp:76] Failed to create 'bind' backend: BindBackend requires root privileges
I0629 05:49:53.654505 25301 provisioner.cpp:249] Using default backend 'copy'
I0629 05:49:53.655522 25304 slave.cpp:231] Mesos agent started on (737)@172.17.0.3:45726
I0629 05:49:53.655544 25304 slave.cpp:232] Flags at startup: --acls="" --appc_simple_discovery_uri_prefix="http://" --appc_store_dir="/tmp/mesos/store/appc" --authenticate_http_readonly="true" --authenticate_http_readwrite="true" --authenticatee="crammd5" --authentication_backoff_factor="1secs" --authorizer="local" --cgroups_cpu_enable_pids_and_tids_count="false" --cgroups_enable_cfs="false" --cgroups_hierarchy="/sys/fs/cgroup" --cgroups_limit_swap="false" --cgroups_root="mesos" --container_disk_watch_interval="15secs" --containerizers="mesos" --credential="/tmp/Endpoint_SlaveEndpointTest_AuthorizedRequest_2_8YD0sg/credential" --default_role="*" --disk_watch_interval="1mins" --docker="docker" --docker_kill_orphans="true" --docker_registry="https://registry-1.docker.io" --docker_remove_delay="6hrs" --docker_socket="/var/run/docker.sock" --docker_stop_timeout="0ns" --docker_store_dir="/tmp/mesos/store/docker" --docker_volume_checkpoint_dir="/var/run/mesos/isolators/docker/volume" --enforce_container_disk_quota="false" --executor_registration_timeout="1mins" --executor_reregistration_timeout="2secs" --executor_shutdown_grace_period="5secs" --fetcher_cache_dir="/tmp/Endpoint_SlaveEndpointTest_AuthorizedRequest_2_8YD0sg/fetch" --fetcher_cache_size="2GB" --frameworks_home="" --gc_delay="1weeks" --gc_disk_headroom="0.1" --hadoop_home="" --help="false" --hostname_lookup="true" --http_command_executor="false" --http_credentials="/tmp/Endpoint_SlaveEndpointTest_AuthorizedRequest_2_8YD0sg/http_credentials" --http_heartbeat_interval="30secs" --initialize_driver_logging="true" --isolation="posix/cpu,posix/mem" --launcher="posix" --launcher_dir="/mesos/build/src" --logbufsecs="0" --logging_level="INFO" --max_completed_executors_per_framework="150" --oversubscribed_resources_interval="15secs" --perf_duration="10secs" --perf_interval="1mins" --port="5051" --qos_correction_interval_min="0ns" --quiet="false" --recover="reconnect" --recovery_timeout="15mins" --registration_backoff_factor="10ms" --resources="cpus:2;gpus:0;mem:1024;disk:1024;ports:[31000-32000]" --revocable_cpu_low_priority="true" --runtime_dir="/tmp/Endpoint_SlaveEndpointTest_AuthorizedRequest_2_8YD0sg" --sandbox_directory="/mnt/mesos/sandbox" --strict="true" --switch_user="true" --systemd_enable_support="true" --systemd_runtime_directory="/run/systemd/system" --version="false" --work_dir="/tmp/Endpoint_SlaveEndpointTest_AuthorizedRequest_2_EV4hMR"
I0629 05:49:53.655704 25304 credentials.hpp:86] Loading credential for authentication from '/tmp/Endpoint_SlaveEndpointTest_AuthorizedRequest_2_8YD0sg/credential'
I0629 05:49:53.655797 25304 slave.cpp:264] Agent using credential for: test-principal
I0629 05:49:53.655812 25304 credentials.hpp:37] Loading credentials for authentication from '/tmp/Endpoint_SlaveEndpointTest_AuthorizedRequest_2_8YD0sg/http_credentials'
I0629 05:49:53.655900 25304 http.cpp:975] Creating default 'basic' HTTP authenticator for realm 'mesos-agent-readonly'
I0629 05:49:53.655956 25304 http.cpp:975] Creating default 'basic' HTTP authenticator for realm 'mesos-agent-readwrite'
I0629 05:49:53.656311 25304 slave.cpp:531] Agent resources: cpus(*):2; mem(*):1024; disk(*):1024; ports(*):[31000-32000]
I0629 05:49:53.656347 25304 slave.cpp:539] Agent attributes: [  ]
I0629 05:49:53.656353 25304 slave.cpp:544] Agent hostname: 296af9b598c3
I0629 05:49:53.656481 25303 status_update_manager.cpp:177] Pausing sending status updates
I0629 05:49:53.658208 25304 state.cpp:62] Recovering state from '/tmp/Endpoint_SlaveEndpointTest_AuthorizedRequest_2_EV4hMR/meta'
I0629 05:49:53.658341 25304 status_update_manager.cpp:203] Recovering status update manager
I0629 05:49:53.658394 25304 containerizer.cpp:608] Recovering containerizer
I0629 05:49:53.658881 25306 provisioner.cpp:410] Provisioner recovery complete
I0629 05:49:53.658998 25306 slave.cpp:6075] Finished recovery
I0629 05:49:53.659319 25306 slave.cpp:6257] Querying resource estimator for oversubscribable resources
I0629 05:49:53.659471 25306 slave.cpp:6271] Received oversubscribable resources {} from the resource estimator
I0629 05:49:53.661026 25309 process.cpp:3731] Handling HTTP event for process 'slave(737)' with path: '/slave(737)/containers'
I0629 05:49:53.661311 25309 http.cpp:1115] HTTP GET for /slave(737)/containers from 172.17.0.3:39094
I0629 05:49:53.661357 25309 http.cpp:936] Authorizing principal 'test-principal' to GET the '/containers' endpoint
I0629 05:49:53.663591 25301 slave.cpp:796] Agent terminating
[       OK ] Endpoint/SlaveEndpointTest.AuthorizedRequest/2 (13 ms)
[ RUN      ] Endpoint/SlaveEndpointTest.UnauthorizedRequest/0
I0629 05:49:53.667862 25301 containerizer.cpp:221] Using isolation: posix/cpu,posix/mem,filesystem/posix,network/cni
W0629 05:49:53.668267 25301 backend.cpp:76] Failed to create 'aufs' backend: AufsBackend requires root privileges
W0629 05:49:53.668313 25301 backend.cpp:76] Failed to create 'bind' backend: BindBackend requires root privileges
I0629 05:49:53.668421 25301 provisioner.cpp:249] Using default backend 'copy'
I0629 05:49:53.669613 25302 slave.cpp:231] Mesos agent started on (738)@172.17.0.3:45726
I0629 05:49:53.669637 25302 slave.cpp:232] Flags at startup: --acls="" --appc_simple_discovery_uri_prefix="http://" --appc_store_dir="/tmp/mesos/store/appc" --authenticate_http_readonly="true" --authenticate_http_readwrite="true" --authenticatee="crammd5" --authentication_backoff_factor="1secs" --authorizer="local" --cgroups_cpu_enable_pids_and_tids_count="false" --cgroups_enable_cfs="false" --cgroups_hierarchy="/sys/fs/cgroup" --cgroups_limit_swap="false" --cgroups_root="mesos" --container_disk_watch_interval="15secs" --containerizers="mesos" --credential="/tmp/Endpoint_SlaveEndpointTest_UnauthorizedRequest_0_XVg7lR/credential" --default_role="*" --disk_watch_interval="1mins" --docker="docker" --docker_kill_orphans="true" --docker_registry="https://registry-1.docker.io" --docker_remove_delay="6hrs" --docker_socket="/var/run/docker.sock" --docker_stop_timeout="0ns" --docker_store_dir="/tmp/mesos/store/docker" --docker_volume_checkpoint_dir="/var/run/mesos/isolators/docker/volume" --enforce_container_disk_quota="false" --executor_registration_timeout="1mins" --executor_reregistration_timeout="2secs" --executor_shutdown_grace_period="5secs" --fetcher_cache_dir="/tmp/Endpoint_SlaveEndpointTest_UnauthorizedRequest_0_XVg7lR/fetch" --fetcher_cache_size="2GB" --frameworks_home="" --gc_delay="1weeks" --gc_disk_headroom="0.1" --hadoop_home="" --help="false" --hostname_lookup="true" --http_command_executor="false" --http_credentials="/tmp/Endpoint_SlaveEndpointTest_UnauthorizedRequest_0_XVg7lR/http_credentials" --http_heartbeat_interval="30secs" --initialize_driver_logging="true" --isolation="posix/cpu,posix/mem" --launcher="posix" --launcher_dir="/mesos/build/src" --logbufsecs="0" --logging_level="INFO" --max_completed_executors_per_framework="150" --oversubscribed_resources_interval="15secs" --perf_duration="10secs" --perf_interval="1mins" --port="5051" --qos_correction_interval_min="0ns" --quiet="false" --recover="reconnect" --recovery_timeout="15mins" --registration_backoff_factor="10ms" --resources="cpus:2;gpus:0;mem:1024;disk:1024;ports:[31000-32000]" --revocable_cpu_low_priority="true" --runtime_dir="/tmp/Endpoint_SlaveEndpointTest_UnauthorizedRequest_0_XVg7lR" --sandbox_directory="/mnt/mesos/sandbox" --strict="true" --switch_user="true" --systemd_enable_support="true" --systemd_runtime_directory="/run/systemd/system" --version="false" --work_dir="/tmp/Endpoint_SlaveEndpointTest_UnauthorizedRequest_0_oCSWCs"
I0629 05:49:53.669841 25302 credentials.hpp:86] Loading credential for authentication from '/tmp/Endpoint_SlaveEndpointTest_UnauthorizedRequest_0_XVg7lR/credential'
I0629 05:49:53.669945 25302 slave.cpp:264] Agent using credential for: test-principal
I0629 05:49:53.669965 25302 credentials.hpp:37] Loading credentials for authentication from '/tmp/Endpoint_SlaveEndpointTest_UnauthorizedRequest_0_XVg7lR/http_credentials'
I0629 05:49:53.670053 25302 http.cpp:975] Creating default 'basic' HTTP authenticator for realm 'mesos-agent-readonly'
I0629 05:49:53.670099 25302 http.cpp:975] Creating default 'basic' HTTP authenticator for realm 'mesos-agent-readwrite'
I0629 05:49:53.670439 25302 slave.cpp:531] Agent resources: cpus(*):2; mem(*):1024; disk(*):1024; ports(*):[31000-32000]
I0629 05:49:53.670478 25302 slave.cpp:539] Agent attributes: [  ]
I0629 05:49:53.670485 25302 slave.cpp:544] Agent hostname: 296af9b598c3
I0629 05:49:53.670915 25308 status_update_manager.cpp:177] Pausing sending status updates
I0629 05:49:53.670928 25309 state.cpp:62] Recovering state from '/tmp/Endpoint_SlaveEndpointTest_UnauthorizedRequest_0_oCSWCs/meta'
I0629 05:49:53.671056 25309 status_update_manager.cpp:203] Recovering status update manager
I0629 05:49:53.671108 25309 containerizer.cpp:608] Recovering containerizer
I0629 05:49:53.672487 25307 provisioner.cpp:410] Provisioner recovery complete
I0629 05:49:53.672580 25307 slave.cpp:6075] Finished recovery
I0629 05:49:53.672919 25307 slave.cpp:6257] Querying resource estimator for oversubscribable resources
I0629 05:49:53.673030 25307 slave.cpp:6271] Received oversubscribable resources {} from the resource estimator
I0629 05:49:53.674294 25307 process.cpp:3731] Handling HTTP event for process 'slave(738)' with path: '/slave(738)/monitor/statistics'
I0629 05:49:53.674698 25307 http.cpp:1115] HTTP GET for /slave(738)/monitor/statistics from 172.17.0.3:39096
I0629 05:49:53.674819 25307 http.cpp:936] Authorizing principal 'test-principal' to GET the '/monitor/statistics' endpoint
I0629 05:49:53.676779 25301 slave.cpp:796] Agent terminating
[       OK ] Endpoint/SlaveEndpointTest.UnauthorizedRequest/0 (13 ms)
[ RUN      ] Endpoint/SlaveEndpointTest.UnauthorizedRequest/1
I0629 05:49:53.681234 25301 containerizer.cpp:221] Using isolation: posix/cpu,posix/mem,filesystem/posix,network/cni
W0629 05:49:53.681578 25301 backend.cpp:76] Failed to create 'aufs' backend: AufsBackend requires root privileges
W0629 05:49:53.681618 25301 backend.cpp:76] Failed to create 'bind' backend: BindBackend requires root privileges
I0629 05:49:53.681643 25301 provisioner.cpp:249] Using default backend 'copy'
I0629 05:49:53.682768 25308 slave.cpp:231] Mesos agent started on (739)@172.17.0.3:45726
I0629 05:49:53.682791 25308 slave.cpp:232] Flags at startup: --acls="" --appc_simple_discovery_uri_prefix="http://" --appc_store_dir="/tmp/mesos/store/appc" --authenticate_http_readonly="true" --authenticate_http_readwrite="true" --authenticatee="crammd5" --authentication_backoff_factor="1secs" --authorizer="local" --cgroups_cpu_enable_pids_and_tids_count="false" --cgroups_enable_cfs="false" --cgroups_hierarchy="/sys/fs/cgroup" --cgroups_limit_swap="false" --cgroups_root="mesos" --container_disk_watch_interval="15secs" --containerizers="mesos" --credential="/tmp/Endpoint_SlaveEndpointTest_UnauthorizedRequest_1_GCUFos/credential" --default_role="*" --disk_watch_interval="1mins" --docker="docker" --docker_kill_orphans="true" --docker_registry="https://registry-1.docker.io" --docker_remove_delay="6hrs" --docker_socket="/var/run/docker.sock" --docker_stop_timeout="0ns" --docker_store_dir="/tmp/mesos/store/docker" --docker_volume_checkpoint_dir="/var/run/mesos/isolators/docker/volume" --enforce_container_disk_quota="false" --executor_registration_timeout="1mins" --executor_reregistration_timeout="2secs" --executor_shutdown_grace_period="5secs" --fetcher_cache_dir="/tmp/Endpoint_SlaveEndpointTest_UnauthorizedRequest_1_GCUFos/fetch" --fetcher_cache_size="2GB" --frameworks_home="" --gc_delay="1weeks" --gc_disk_headroom="0.1" --hadoop_home="" --help="false" --hostname_lookup="true" --http_command_executor="false" --http_credentials="/tmp/Endpoint_SlaveEndpointTest_UnauthorizedRequest_1_GCUFos/http_credentials" --http_heartbeat_interval="30secs" --initialize_driver_logging="true" --isolation="posix/cpu,posix/mem" --launcher="posix" --launcher_dir="/mesos/build/src" --logbufsecs="0" --logging_level="INFO" --max_completed_executors_per_framework="150" --oversubscribed_resources_interval="15secs" --perf_duration="10secs" --perf_interval="1mins" --port="5051" --qos_correction_interval_min="0ns" --quiet="false" --recover="reconnect" --recovery_timeout="15mins" --registration_backoff_factor="10ms" --resources="cpus:2;gpus:0;mem:1024;disk:1024;ports:[31000-32000]" --revocable_cpu_low_priority="true" --runtime_dir="/tmp/Endpoint_SlaveEndpointTest_UnauthorizedRequest_1_GCUFos" --sandbox_directory="/mnt/mesos/sandbox" --strict="true" --switch_user="true" --systemd_enable_support="true" --systemd_runtime_directory="/run/systemd/system" --version="false" --work_dir="/tmp/Endpoint_SlaveEndpointTest_UnauthorizedRequest_1_ShbaD3"
I0629 05:49:53.682962 25308 credentials.hpp:86] Loading credential for authentication from '/tmp/Endpoint_SlaveEndpointTest_UnauthorizedRequest_1_GCUFos/credential'
I0629 05:49:53.683046 25308 slave.cpp:264] Agent using credential for: test-principal
I0629 05:49:53.683063 25308 credentials.hpp:37] Loading credentials for authentication from '/tmp/Endpoint_SlaveEndpointTest_UnauthorizedRequest_1_GCUFos/http_credentials'
I0629 05:49:53.683151 25308 http.cpp:975] Creating default 'basic' HTTP authenticator for realm 'mesos-agent-readonly'
I0629 05:49:53.683197 25308 http.cpp:975] Creating default 'basic' HTTP authenticator for realm 'mesos-agent-readwrite'
I0629 05:49:53.683532 25308 slave.cpp:531] Agent resources: cpus(*):2; mem(*):1024; disk(*):1024; ports(*):[31000-32000]
I0629 05:49:53.683568 25308 slave.cpp:539] Agent attributes: [  ]
I0629 05:49:53.683573 25308 slave.cpp:544] Agent hostname: 296af9b598c3
I0629 05:49:53.683616 25307 status_update_manager.cpp:177] Pausing sending status updates
I0629 05:49:53.683876 25307 state.cpp:62] Recovering state from '/tmp/Endpoint_SlaveEndpointTest_UnauthorizedRequest_1_ShbaD3/meta'
I0629 05:49:53.684007 25307 status_update_manager.cpp:203] Recovering status update manager
I0629 05:49:53.684057 25307 containerizer.cpp:608] Recovering containerizer
I0629 05:49:53.685274 25308 provisioner.cpp:410] Provisioner recovery complete
I0629 05:49:53.685392 25308 slave.cpp:6075] Finished recovery
I0629 05:49:53.685690 25308 slave.cpp:6257] Querying resource estimator for oversubscribable resources
I0629 05:49:53.685811 25308 slave.cpp:6271] Received oversubscribable resources {} from the resource estimator
I0629 05:49:53.687459 25308 process.cpp:3731] Handling HTTP event for process 'slave(739)' with path: '/slave(739)/monitor/statistics.json'
I0629 05:49:53.687731 25308 http.cpp:1115] HTTP GET for /slave(739)/monitor/statistics.json from 172.17.0.3:39098
I0629 05:49:53.687774 25308 http.cpp:936] Authorizing principal 'test-principal' to GET the '/monitor/statistics.json' endpoint
I0629 05:49:53.691315 25301 slave.cpp:796] Agent terminating
[       OK ] Endpoint/SlaveEndpointTest.UnauthorizedRequest/1 (13 ms)
[ RUN      ] Endpoint/SlaveEndpointTest.UnauthorizedRequest/2
I0629 05:49:53.695322 25301 containerizer.cpp:221] Using isolation: posix/cpu,posix/mem,filesystem/posix,network/cni
W0629 05:49:53.695632 25301 backend.cpp:76] Failed to create 'aufs' backend: AufsBackend requires root privileges
W0629 05:49:53.695742 25301 backend.cpp:76] Failed to create 'bind' backend: BindBackend requires root privileges
I0629 05:49:53.695755 25301 provisioner.cpp:249] Using default backend 'copy'
I0629 05:49:53.696617 25304 slave.cpp:231] Mesos agent started on (740)@172.17.0.3:45726
I0629 05:49:53.696632 25304 slave.cpp:232] Flags at startup: --acls="" --appc_simple_discovery_uri_prefix="http://" --appc_store_dir="/tmp/mesos/store/appc" --authenticate_http_readonly="true" --authenticate_http_readwrite="true" --authenticatee="crammd5" --authentication_backoff_factor="1secs" --authorizer="local" --cgroups_cpu_enable_pids_and_tids_count="false" --cgroups_enable_cfs="false" --cgroups_hierarchy="/sys/fs/cgroup" --cgroups_limit_swap="false" --cgroups_root="mesos" --container_disk_watch_interval="15secs" --containerizers="mesos" --credential="/tmp/Endpoint_SlaveEndpointTest_UnauthorizedRequest_2_s13TA3/credential" --default_role="*" --disk_watch_interval="1mins" --docker="docker" --docker_kill_orphans="true" --docker_registry="https://registry-1.docker.io" --docker_remove_delay="6hrs" --docker_socket="/var/run/docker.sock" --docker_stop_timeout="0ns" --docker_store_dir="/tmp/mesos/store/docker" --docker_volume_checkpoint_dir="/var/run/mesos/isolators/docker/volume" --enforce_container_disk_quota="false" --executor_registration_timeout="1mins" --executor_reregistration_timeout="2secs" --executor_shutdown_grace_period="5secs" --fetcher_cache_dir="/tmp/Endpoint_SlaveEndpointTest_UnauthorizedRequest_2_s13TA3/fetch" --fetcher_cache_size="2GB" --frameworks_home="" --gc_delay="1weeks" --gc_disk_headroom="0.1" --hadoop_home="" --help="false" --hostname_lookup="true" --http_command_executor="false" --http_credentials="/tmp/Endpoint_SlaveEndpointTest_UnauthorizedRequest_2_s13TA3/http_credentials" --http_heartbeat_interval="30secs" --initialize_driver_logging="true" --isolation="posix/cpu,posix/mem" --launcher="posix" --launcher_dir="/mesos/build/src" --logbufsecs="0" --logging_level="INFO" --max_completed_executors_per_framework="150" --oversubscribed_resources_interval="15secs" --perf_duration="10secs" --perf_interval="1mins" --port="5051" --qos_correction_interval_min="0ns" --quiet="false" --recover="reconnect" --recovery_timeout="15mins" --registration_backoff_factor="10ms" --resources="cpus:2;gpus:0;mem:1024;disk:1024;ports:[31000-32000]" --revocable_cpu_low_priority="true" --runtime_dir="/tmp/Endpoint_SlaveEndpointTest_UnauthorizedRequest_2_s13TA3" --sandbox_directory="/mnt/mesos/sandbox" --strict="true" --switch_user="true" --systemd_enable_support="true" --systemd_runtime_directory="/run/systemd/system" --version="false" --work_dir="/tmp/Endpoint_SlaveEndpointTest_UnauthorizedRequest_2_iEbVME"
I0629 05:49:53.696775 25304 credentials.hpp:86] Loading credential for authentication from '/tmp/Endpoint_SlaveEndpointTest_UnauthorizedRequest_2_s13TA3/credential'
I0629 05:49:53.696869 25304 slave.cpp:264] Agent using credential for: test-principal
I0629 05:49:53.696879 25304 credentials.hpp:37] Loading credentials for authentication from '/tmp/Endpoint_SlaveEndpointTest_UnauthorizedRequest_2_s13TA3/http_credentials'
I0629 05:49:53.696965 25304 http.cpp:975] Creating default 'basic' HTTP authenticator for realm 'mesos-agent-readonly'
I0629 05:49:53.697011 25304 http.cpp:975] Creating default 'basic' HTTP authenticator for realm 'mesos-agent-readwrite'
I0629 05:49:53.697386 25304 slave.cpp:531] Agent resources: cpus(*):2; mem(*):1024; disk(*):1024; ports(*):[31000-32000]
I0629 05:49:53.697417 25304 slave.cpp:539] Agent attributes: [  ]
I0629 05:49:53.697422 25304 slave.cpp:544] Agent hostname: 296af9b598c3
I0629 05:49:53.697686 25304 status_update_manager.cpp:177] Pausing sending status updates
I0629 05:49:53.697845 25304 state.cpp:62] Recovering state from '/tmp/Endpoint_SlaveEndpointTest_UnauthorizedRequest_2_iEbVME/meta'
I0629 05:49:53.697975 25304 status_update_manager.cpp:203] Recovering status update manager
I0629 05:49:53.698012 25304 containerizer.cpp:608] Recovering containerizer
I0629 05:49:53.698374 25304 provisioner.cpp:410] Provisioner recovery complete
I0629 05:49:53.698463 25304 slave.cpp:6075] Finished recovery
I0629 05:49:53.698804 25304 slave.cpp:6257] Querying resource estimator for oversubscribable resources
I0629 05:49:53.698997 25309 slave.cpp:6271] Received oversubscribable resources {} from the resource estimator
I0629 05:49:53.700052 25305 process.cpp:3731] Handling HTTP event for process 'slave(740)' with path: '/slave(740)/containers'
I0629 05:49:53.700367 25305 http.cpp:1115] HTTP GET for /slave(740)/containers from 172.17.0.3:39100
I0629 05:49:53.700419 25305 http.cpp:936] Authorizing principal 'test-principal' to GET the '/containers' endpoint
I0629 05:49:53.701385 25303 slave.cpp:796] Agent terminating
[       OK ] Endpoint/SlaveEndpointTest.UnauthorizedRequest/2 (10 ms)
[ RUN      ] Endpoint/SlaveEndpointTest.NoAuthorizer/0
I0629 05:49:53.705674 25301 containerizer.cpp:221] Using isolation: posix/cpu,posix/mem,filesystem/posix,network/cni
W0629 05:49:53.705943 25301 backend.cpp:76] Failed to create 'aufs' backend: AufsBackend requires root privileges
W0629 05:49:53.706027 25301 backend.cpp:76] Failed to create 'bind' backend: BindBackend requires root privileges
I0629 05:49:53.706046 25301 provisioner.cpp:249] Using default backend 'copy'
I0629 05:49:53.706645 25301 cluster.cpp:448] Creating default 'local' authorizer
I0629 05:49:53.707120 25309 slave.cpp:231] Mesos agent started on (741)@172.17.0.3:45726
I0629 05:49:53.707157 25309 slave.cpp:232] Flags at startup: --acls="" --appc_simple_discovery_uri_prefix="http://" --appc_store_dir="/tmp/mesos/store/appc" --authenticate_http_readonly="true" --authenticate_http_readwrite="true" --authenticatee="crammd5" --authentication_backoff_factor="1secs" --authorizer="local" --cgroups_cpu_enable_pids_and_tids_count="false" --cgroups_enable_cfs="false" --cgroups_hierarchy="/sys/fs/cgroup" --cgroups_limit_swap="false" --cgroups_root="mesos" --container_disk_watch_interval="15secs" --containerizers="mesos" --credential="/tmp/Endpoint_SlaveEndpointTest_NoAuthorizer_0_aiTVUE/credential" --default_role="*" --disk_watch_interval="1mins" --docker="docker" --docker_kill_orphans="true" --docker_registry="https://registry-1.docker.io" --docker_remove_delay="6hrs" --docker_socket="/var/run/docker.sock" --docker_stop_timeout="0ns" --docker_store_dir="/tmp/mesos/store/docker" --docker_volume_checkpoint_dir="/var/run/mesos/isolators/docker/volume" --enforce_container_disk_quota="false" --executor_registration_timeout="1mins" --executor_reregistration_timeout="2secs" --executor_shutdown_grace_period="5secs" --fetcher_cache_dir="/tmp/Endpoint_SlaveEndpointTest_NoAuthorizer_0_aiTVUE/fetch" --fetcher_cache_size="2GB" --frameworks_home="" --gc_delay="1weeks" --gc_disk_headroom="0.1" --hadoop_home="" --help="false" --hostname_lookup="true" --http_command_executor="false" --http_credentials="/tmp/Endpoint_SlaveEndpointTest_NoAuthorizer_0_aiTVUE/http_credentials" --http_heartbeat_interval="30secs" --initialize_driver_logging="true" --isolation="posix/cpu,posix/mem" --launcher="posix" --launcher_dir="/mesos/build/src" --logbufsecs="0" --logging_level="INFO" --max_completed_executors_per_framework="150" --oversubscribed_resources_interval="15secs" --perf_duration="10secs" --perf_interval="1mins" --port="5051" --qos_correction_interval_min="0ns" --quiet="false" --recover="reconnect" --recovery_timeout="15mins" --registration_backoff_factor="10ms" --resources="cpus:2;gpus:0;mem:1024;disk:1024;ports:[31000-32000]" --revocable_cpu_low_priority="true" --runtime_dir="/tmp/Endpoint_SlaveEndpointTest_NoAuthorizer_0_aiTVUE" --sandbox_directory="/mnt/mesos/sandbox" --strict="true" --switch_user="true" --systemd_enable_support="true" --systemd_runtime_directory="/run/systemd/system" --version="false" --work_dir="/tmp/Endpoint_SlaveEndpointTest_NoAuthorizer_0_l4U74f"
I0629 05:49:53.707392 25309 credentials.hpp:86] Loading credential for authentication from '/tmp/Endpoint_SlaveEndpointTest_NoAuthorizer_0_aiTVUE/credential'
I0629 05:49:53.707577 25309 slave.cpp:264] Agent using credential for: test-principal
I0629 05:49:53.707598 25309 credentials.hpp:37] Loading credentials for authentication from '/tmp/Endpoint_SlaveEndpointTest_NoAuthorizer_0_aiTVUE/http_credentials'
I0629 05:49:53.707705 25309 http.cpp:975] Creating default 'basic' HTTP authenticator for realm 'mesos-agent-readonly'
I0629 05:49:53.707782 25309 http.cpp:975] Creating default 'basic' HTTP authenticator for realm 'mesos-agent-readwrite'
I0629 05:49:53.708197 25309 slave.cpp:531] Agent resources: cpus(*):2; mem(*):1024; disk(*):1024; ports(*):[31000-32000]
I0629 05:49:53.708238 25309 slave.cpp:539] Agent attributes: [  ]
I0629 05:49:53.708245 25309 slave.cpp:544] Agent hostname: 296af9b598c3
I0629 05:49:53.708559 25309 status_update_manager.cpp:177] Pausing sending status updates
I0629 05:49:53.708694 25302 state.cpp:62] Recovering state from '/tmp/Endpoint_SlaveEndpointTest_NoAuthorizer_0_l4U74f/meta'
I0629 05:49:53.708870 25302 status_update_manager.cpp:203] Recovering status update manager
I0629 05:49:53.708920 25302 containerizer.cpp:608] Recovering containerizer
I0629 05:49:53.709400 25302 provisioner.cpp:410] Provisioner recovery complete
I0629 05:49:53.709506 25302 slave.cpp:6075] Finished recovery
I0629 05:49:53.709995 25302 slave.cpp:6257] Querying resource estimator for oversubscribable resources
I0629 05:49:53.710165 25305 slave.cpp:6271] Received oversubscribable resources {} from the resource estimator
I0629 05:49:53.710994 25302 process.cpp:3731] Handling HTTP event for process 'slave(741)' with path: '/slave(741)/monitor/statistics'
I0629 05:49:53.711457 25307 http.cpp:1115] HTTP GET for /slave(741)/monitor/statistics from 172.17.0.3:39102
I0629 05:49:53.711518 25307 http.cpp:936] Authorizing principal 'test-principal' to GET the '/monitor/statistics' endpoint
I0629 05:49:53.715399 25301 slave.cpp:796] Agent terminating
[       OK ] Endpoint/SlaveEndpointTest.NoAuthorizer/0 (16 ms)
[ RUN      ] Endpoint/SlaveEndpointTest.NoAuthorizer/1
I0629 05:49:53.721704 25301 containerizer.cpp:221] Using isolation: posix/cpu,posix/mem,filesystem/posix,network/cni
W0629 05:49:53.722072 25301 backend.cpp:76] Failed to create 'aufs' backend: AufsBackend requires root privileges
W0629 05:49:53.722115 25301 backend.cpp:76] Failed to create 'bind' backend: BindBackend requires root privileges
I0629 05:49:53.722127 25301 provisioner.cpp:249] Using default backend 'copy'
I0629 05:49:53.722766 25301 cluster.cpp:448] Creating default 'local' authorizer
I0629 05:49:53.723348 25305 slave.cpp:231] Mesos agent started on (742)@172.17.0.3:45726
I0629 05:49:53.723381 25305 slave.cpp:232] Flags at startup: --acls="" --appc_simple_discovery_uri_prefix="http://" --appc_store_dir="/tmp/mesos/store/appc" --authenticate_http_readonly="true" --authenticate_http_readwrite="true" --authenticatee="crammd5" --authentication_backoff_factor="1secs" --authorizer="local" --cgroups_cpu_enable_pids_and_tids_count="false" --cgroups_enable_cfs="false" --cgroups_hierarchy="/sys/fs/cgroup" --cgroups_limit_swap="false" --cgroups_root="mesos" --container_disk_watch_interval="15secs" --containerizers="mesos" --credential="/tmp/Endpoint_SlaveEndpointTest_NoAuthorizer_1_v7fjpg/credential" --default_role="*" --disk_watch_interval="1mins" --docker="docker" --docker_kill_orphans="true" --docker_registry="https://registry-1.docker.io" --docker_remove_delay="6hrs" --docker_socket="/var/run/docker.sock" --docker_stop_timeout="0ns" --docker_store_dir="/tmp/mesos/store/docker" --docker_volume_checkpoint_dir="/var/run/mesos/isolators/docker/volume" --enforce_container_disk_quota="false" --executor_registration_timeout="1mins" --executor_reregistration_timeout="2secs" --executor_shutdown_grace_period="5secs" --fetcher_cache_dir="/tmp/Endpoint_SlaveEndpointTest_NoAuthorizer_1_v7fjpg/fetch" --fetcher_cache_size="2GB" --frameworks_home="" --gc_delay="1weeks" --gc_disk_headroom="0.1" --hadoop_home="" --help="false" --hostname_lookup="true" --http_command_executor="false" --http_credentials="/tmp/Endpoint_SlaveEndpointTest_NoAuthorizer_1_v7fjpg/http_credentials" --http_heartbeat_interval="30secs" --initialize_driver_logging="true" --isolation="posix/cpu,posix/mem" --launcher="posix" --launcher_dir="/mesos/build/src" --logbufsecs="0" --logging_level="INFO" --max_completed_executors_per_framework="150" --oversubscribed_resources_interval="15secs" --perf_duration="10secs" --perf_interval="1mins" --port="5051" --qos_correction_interval_min="0ns" --quiet="false" --recover="reconnect" --recovery_timeout="15mins" --registration_backoff_factor="10ms" --resources="cpus:2;gpus:0;mem:1024;disk:1024;ports:[31000-32000]" --revocable_cpu_low_priority="true" --runtime_dir="/tmp/Endpoint_SlaveEndpointTest_NoAuthorizer_1_v7fjpg" --sandbox_directory="/mnt/mesos/sandbox" --strict="true" --switch_user="true" --systemd_enable_support="true" --systemd_runtime_directory="/run/systemd/system" --version="false" --work_dir="/tmp/Endpoint_SlaveEndpointTest_NoAuthorizer_1_QGDHwR"
I0629 05:49:53.723630 25305 credentials.hpp:86] Loading credential for authentication from '/tmp/Endpoint_SlaveEndpointTest_NoAuthorizer_1_v7fjpg/credential'
I0629 05:49:53.723791 25305 slave.cpp:264] Agent using credential for: test-principal
I0629 05:49:53.723808 25305 credentials.hpp:37] Loading credentials for authentication from '/tmp/Endpoint_SlaveEndpointTest_NoAuthorizer_1_v7fjpg/http_credentials'
I0629 05:49:53.723917 25305 http.cpp:975] Creating default 'basic' HTTP authenticator for realm 'mesos-agent-readonly'
I0629 05:49:53.724011 25305 http.cpp:975] Creating default 'basic' HTTP authenticator for realm 'mesos-agent-readwrite'
I0629 05:49:53.724465 25305 slave.cpp:531] Agent resources: cpus(*):2; mem(*):1024; disk(*):1024; ports(*):[31000-32000]
I0629 05:49:53.724509 25305 slave.cpp:539] Agent attributes: [  ]
I0629 05:49:53.724514 25305 slave.cpp:544] Agent hostname: 296af9b598c3
I0629 05:49:53.724616 25306 status_update_manager.cpp:177] Pausing sending status updates
I0629 05:49:53.724869 25305 state.cpp:62] Recovering state from '/tmp/Endpoint_SlaveEndpointTest_NoAuthorizer_1_QGDHwR/meta'
I0629 05:49:53.725054 25306 status_update_manager.cpp:203] Recovering status update manager
I0629 05:49:53.725172 25303 containerizer.cpp:608] Recovering containerizer
I0629 05:49:53.725760 25307 provisioner.cpp:410] Provisioner recovery complete
I0629 05:49:53.726493 25307 slave.cpp:6075] Finished recovery
I0629 05:49:53.726954 25307 slave.cpp:6257] Querying resource estimator for oversubscribable resources
I0629 05:49:53.727090 25307 slave.cpp:6271] Received oversubscribable resources {} from the resource estimator
I0629 05:49:53.728965 25307 process.cpp:3731] Handling HTTP event for process 'slave(742)' with path: '/slave(742)/monitor/statistics.json'
I0629 05:49:53.729315 25307 http.cpp:1115] HTTP GET for /slave(742)/monitor/statistics.json from 172.17.0.3:39104
I0629 05:49:53.729365 25307 http.cpp:936] Authorizing principal 'test-principal' to GET the '/monitor/statistics.json' endpoint
I0629 05:49:53.732332 25307 slave.cpp:796] Agent terminating
[       OK ] Endpoint/SlaveEndpointTest.NoAuthorizer/1 (15 ms)
[ RUN      ] Endpoint/SlaveEndpointTest.NoAuthorizer/2
I0629 05:49:53.737143 25301 containerizer.cpp:221] Using isolation: posix/cpu,posix/mem,filesystem/posix,network/cni
W0629 05:49:53.738217 25301 backend.cpp:76] Failed to create 'aufs' backend: AufsBackend requires root privileges
W0629 05:49:53.738263 25301 backend.cpp:76] Failed to create 'bind' backend: BindBackend requires root privileges
I0629 05:49:53.738276 25301 provisioner.cpp:249] Using default backend 'copy'
I0629 05:49:53.738947 25301 cluster.cpp:448] Creating default 'local' authorizer
I0629 05:49:53.739575 25304 slave.cpp:231] Mesos agent started on (743)@172.17.0.3:45726
I0629 05:49:53.739599 25304 slave.cpp:232] Flags at startup: --acls="" --appc_simple_discovery_uri_prefix="http://" --appc_store_dir="/tmp/mesos/store/appc" --authenticate_http_readonly="true" --authenticate_http_readwrite="true" --authenticatee="crammd5" --authentication_backoff_factor="1secs" --authorizer="local" --cgroups_cpu_enable_pids_and_tids_count="false" --cgroups_enable_cfs="false" --cgroups_hierarchy="/sys/fs/cgroup" --cgroups_limit_swap="false" --cgroups_root="mesos" --container_disk_watch_interval="15secs" --containerizers="mesos" --credential="/tmp/Endpoint_SlaveEndpointTest_NoAuthorizer_2_bzID4R/credential" --default_role="*" --disk_watch_interval="1mins" --docker="docker" --docker_kill_orphans="true" --docker_registry="https://registry-1.docker.io" --docker_remove_delay="6hrs" --docker_socket="/var/run/docker.sock" --docker_stop_timeout="0ns" --docker_store_dir="/tmp/mesos/store/docker" --docker_volume_checkpoint_dir="/var/run/mesos/isolators/docker/volume" --enforce_container_disk_quota="false" --executor_registration_timeout="1mins" --executor_reregistration_timeout="2secs" --executor_shutdown_grace_period="5secs" --fetcher_cache_dir="/tmp/Endpoint_SlaveEndpointTest_NoAuthorizer_2_bzID4R/fetch" --fetcher_cache_size="2GB" --frameworks_home="" --gc_delay="1weeks" --gc_disk_headroom="0.1" --hadoop_home="" --help="false" --hostname_lookup="true" --http_command_executor="false" --http_credentials="/tmp/Endpoint_SlaveEndpointTest_NoAuthorizer_2_bzID4R/http_credentials" --http_heartbeat_interval="30secs" --initialize_driver_logging="true" --isolation="posix/cpu,posix/mem" --launcher="posix" --launcher_dir="/mesos/build/src" --logbufsecs="0" --logging_level="INFO" --max_completed_executors_per_framework="150" --oversubscribed_resources_interval="15secs" --perf_duration="10secs" --perf_interval="1mins" --port="5051" --qos_correction_interval_min="0ns" --quiet="false" --recover="reconnect" --recovery_timeout="15mins" --registration_backoff_factor="10ms" --resources="cpus:2;gpus:0;mem:1024;disk:1024;ports:[31000-32000]" --revocable_cpu_low_priority="true" --runtime_dir="/tmp/Endpoint_SlaveEndpointTest_NoAuthorizer_2_bzID4R" --sandbox_directory="/mnt/mesos/sandbox" --strict="true" --switch_user="true" --systemd_enable_support="true" --systemd_runtime_directory="/run/systemd/system" --version="false" --work_dir="/tmp/Endpoint_SlaveEndpointTest_NoAuthorizer_2_L8tm9s"
I0629 05:49:53.739795 25304 credentials.hpp:86] Loading credential for authentication from '/tmp/Endpoint_SlaveEndpointTest_NoAuthorizer_2_bzID4R/credential'
I0629 05:49:53.739910 25304 slave.cpp:264] Agent using credential for: test-principal
I0629 05:49:53.739920 25304 credentials.hpp:37] Loading credentials for authentication from '/tmp/Endpoint_SlaveEndpointTest_NoAuthorizer_2_bzID4R/http_credentials'
I0629 05:49:53.740015 25304 http.cpp:975] Creating default 'basic' HTTP authenticator for realm 'mesos-agent-readonly'
I0629 05:49:53.740094 25304 http.cpp:975] Creating default 'basic' HTTP authenticator for realm 'mesos-agent-readwrite'
I0629 05:49:53.740551 25304 slave.cpp:531] Agent resources: cpus(*):2; mem(*):1024; disk(*):1024; ports(*):[31000-32000]
I0629 05:49:53.740594 25304 slave.cpp:539] Agent attributes: [  ]
I0629 05:49:53.740605 25304 slave.cpp:544] Agent hostname: 296af9b598c3
I0629 05:49:53.740738 25309 status_update_manager.cpp:177] Pausing sending status updates
I0629 05:49:53.741035 25303 state.cpp:62] Recovering state from '/tmp/Endpoint_SlaveEndpointTest_NoAuthorizer_2_L8tm9s/meta'
I0629 05:49:53.741199 25303 status_update_manager.cpp:203] Recovering status update manager
I0629 05:49:53.741251 25303 containerizer.cpp:608] Recovering containerizer
I0629 05:49:53.741658 25303 provisioner.cpp:410] Provisioner recovery complete
I0629 05:49:53.741758 25303 slave.cpp:6075] Finished recovery
I0629 05:49:53.742224 25303 slave.cpp:6257] Querying resource estimator for oversubscribable resources
I0629 05:49:53.742897 25308 slave.cpp:6271] Received oversubscribable resources {} from the resource estimator
I0629 05:49:53.743950 25302 process.cpp:3731] Handling HTTP event for process 'slave(743)' with path: '/slave(743)/containers'
I0629 05:49:53.744254 25302 http.cpp:1115] HTTP GET for /slave(743)/containers from 172.17.0.3:39106
I0629 05:49:53.744302 25302 http.cpp:936] Authorizing principal 'test-principal' to GET the '/containers' endpoint
I0629 05:49:53.745640 25302 slave.cpp:796] Agent terminating
[       OK ] Endpoint/SlaveEndpointTest.NoAuthorizer/2 (13 ms)
[----------] 9 tests from Endpoint/SlaveEndpointTest (127 ms total)

[----------] Global test environment tear-down
[==========] 1520 tests from 167 test cases ran. (246465 ms total)
[  PASSED  ] 1518 tests.
[  FAILED  ] 2 tests, listed below:
[  FAILED  ] HierarchicalAllocatorTest.NestedRoleQuota
[  FAILED  ] ContentType/AgentAPIStreamingTest.AttachInputToNestedContainerSession/0, where GetParam() = application/x-protobuf

 2 FAILED TESTS
  YOU HAVE 22 DISABLED TESTS

E0629 05:49:53.787487 25310 process.cpp:951] Failed to accept socket: future discarded
make[3]: *** [CMakeFiles/check] Error 1
make[3]: Leaving directory `/mesos/build'
make[2]: *** [CMakeFiles/check.dir/all] Error 2
make[2]: Leaving directory `/mesos/build'
make[1]: *** [CMakeFiles/check.dir/rule] Error 2
make[1]: Leaving directory `/mesos/build'
make: *** [check] Error 2
+ docker rmi mesos-1498711682-12019
Untagged: mesos-1498711682-12019:latest
Deleted: sha256:d4edd238483b264a17ad4d03d545fd264e9754782c9518e8fba472134236a87d
Deleted: sha256:c8544ae79f696a492da076e8acac80c162b20794c94db7b53e5109265190ff34
Deleted: sha256:39eae4a5e9e7f62573708f799b4fc09915ef111e48307fcb95f9647ba4ad719e
Deleted: sha256:7a7efa7aba9ecd6859477c74c5c4858661a5a0e038c7a1be3c0a687f733af14c
Deleted: sha256:4cc6b6ef8bc48f1365f15c9e954fa50b1357df030feeee568e04f9ef7e03e1b7
Deleted: sha256:186ece471aacbdb853133878ae624ac9a38f4a673c917b347c70dd56b72167f3
Deleted: sha256:d0ec4eadb8adb18c0dd37b52dbdec218b4f91f253f362c6a72f836e20d96a718
Deleted: sha256:192954a06d9b0052ac68225b8d5022e3f360f7a9ef4756b151b8f621d8028795
Deleted: sha256:4dec8c46ac7f7403c68d0474f4ccc0680cfe2e024ad7b4a38ad65bfcfa76362c
Deleted: sha256:a824d5a4df96a041e5d1b76626b712b75bf41a8e1244bb25c0f8222d3c16915b
Deleted: sha256:fa9dde8f2b31c05b60dbb06147076c6c9b77b1df526c0b700cfff1ab201fa83e
Deleted: sha256:7e3c61676c38b39aa2498dd04f52a9748775ca4237c7c02fa1b0553a7bb97ebb
Deleted: sha256:054f1f4008240876c2af4b68dea3c987be20a3c0268e63970d8cce81463cc75c
Deleted: sha256:b7eae816d6831f7dee2957bd8241250fa3b2af8b4e925ab7355b91d3ea415207
Deleted: sha256:35c11ab7819c783e4a726da8749ec8c09195b34d7926f574de923898bd1c5667
Deleted: sha256:296ccdc8a8357a0cc7e8d3fc0607966319437406970b637a893f3b89d22c6077
Deleted: sha256:bc9ac2aee0b342b5d365e352b5669fca0d1b24b06934e45737aad6995bea3222
Deleted: sha256:d4d18e60b14e229a73e77cb7cd9aff8aafef95da617eaa7ce6858bfa6ed9aa58
Deleted: sha256:278b1d4c6b223b3c4fab5c1fac2b9b3bb02217e3296d6a66672180c3918cd4c3
Deleted: sha256:c5e9779da1bc9142af936ee57f41a41ea5a04130d8ab79fcb862092ddf7b1100
Deleted: sha256:1c521dce223cad68e6420485b9c2fd2cf9c8416eb68c62123fe11bdedae44592
Deleted: sha256:9fb83548d95ace032aedb35275c1d22a22011dd4267e19764ee983aa1add0b6f
Deleted: sha256:07a255fb1d555263b7f581d9db1e3cc59936abf1d8ed452f0579c397dd248419
Deleted: sha256:f604ee9842ed9345685ba43a0379638af5d874eabe7816b1167267392ae5e9fa
Build step 'Execute shell' marked build as failure

Re: Build failed in Jenkins: Mesos-Buildbot » cmake,gcc,--verbose,GLOG_v=1 MESOS_VERBOSE=1,ubuntu:14.04,(ubuntu)&&(!ubuntu-us1)&&(!ubuntu-eu2) #3849

Posted by Vinod Kone <vi...@apache.org>.
filed https://issues.apache.org/jira/browse/MESOS-7742 for nested container
test.

already filed one for nested role quota.

On Wed, Jun 28, 2017 at 10:50 PM, Apache Jenkins Server <
jenkins@builds.apache.org> wrote:

> See <https://builds.apache.org/job/Mesos-Buildbot/BUILDTOOL=
> cmake,COMPILER=gcc,CONFIGURATION=--verbose,ENVIRONMENT=GLOG_v=1%20MESOS_
> VERBOSE=1,OS=ubuntu%3A14.04,label_exp=(ubuntu)&&(!ubuntu-
> us1)&&(!ubuntu-eu2)/3849/display/redirect?page=changes>
>
> Changes:
>
> [vinodkone] Fixed parameters in JNI call for disconnected event.
>
> ------------------------------------------
> [...truncated 24.75 MB...]
> I0629 05:49:53.645548 25306 http.cpp:936] Authorizing principal
> 'test-principal' to GET the '/monitor/statistics.json' endpoint
> I0629 05:49:53.649598 25307 slave.cpp:796] Agent terminating
> [       OK ] Endpoint/SlaveEndpointTest.AuthorizedRequest/1 (15 ms)
> [ RUN      ] Endpoint/SlaveEndpointTest.AuthorizedRequest/2
> I0629 05:49:53.653934 25301 containerizer.cpp:221] Using isolation:
> posix/cpu,posix/mem,filesystem/posix,network/cni
> W0629 05:49:53.654335 25301 backend.cpp:76] Failed to create 'aufs'
> backend: AufsBackend requires root privileges
> W0629 05:49:53.654487 25301 backend.cpp:76] Failed to create 'bind'
> backend: BindBackend requires root privileges
> I0629 05:49:53.654505 25301 provisioner.cpp:249] Using default backend
> 'copy'
> I0629 05:49:53.655522 25304 slave.cpp:231] Mesos agent started on (737)@
> 172.17.0.3:45726
> I0629 05:49:53.655544 25304 slave.cpp:232] Flags at startup: --acls=""
> --appc_simple_discovery_uri_prefix="http://" --appc_store_dir="/tmp/mesos/store/appc"
> --authenticate_http_readonly="true" --authenticate_http_readwrite="true"
> --authenticatee="crammd5" --authentication_backoff_factor="1secs"
> --authorizer="local" --cgroups_cpu_enable_pids_and_tids_count="false"
> --cgroups_enable_cfs="false" --cgroups_hierarchy="/sys/fs/cgroup"
> --cgroups_limit_swap="false" --cgroups_root="mesos" --container_disk_watch_interval="15secs"
> --containerizers="mesos" --credential="/tmp/Endpoint_SlaveEndpointTest_
> AuthorizedRequest_2_8YD0sg/credential" --default_role="*"
> --disk_watch_interval="1mins" --docker="docker"
> --docker_kill_orphans="true" --docker_registry="https://
> registry-1.docker.io" --docker_remove_delay="6hrs"
> --docker_socket="/var/run/docker.sock" --docker_stop_timeout="0ns"
> --docker_store_dir="/tmp/mesos/store/docker" --docker_volume_checkpoint_
> dir="/var/run/mesos/isolators/docker/volume" --enforce_container_disk_quota="false"
> --executor_registration_timeout="1mins" --executor_reregistration_timeout="2secs"
> --executor_shutdown_grace_period="5secs" --fetcher_cache_dir="/tmp/
> Endpoint_SlaveEndpointTest_AuthorizedRequest_2_8YD0sg/fetch"
> --fetcher_cache_size="2GB" --frameworks_home="" --gc_delay="1weeks"
> --gc_disk_headroom="0.1" --hadoop_home="" --help="false"
> --hostname_lookup="true" --http_command_executor="false"
> --http_credentials="/tmp/Endpoint_SlaveEndpointTest_
> AuthorizedRequest_2_8YD0sg/http_credentials" --http_heartbeat_interval="30secs"
> --initialize_driver_logging="true" --isolation="posix/cpu,posix/mem"
> --launcher="posix" --launcher_dir="/mesos/build/src" --logbufsecs="0"
> --logging_level="INFO" --max_completed_executors_per_framework="150"
> --oversubscribed_resources_interval="15secs" --perf_duration="10secs"
> --perf_interval="1mins" --port="5051" --qos_correction_interval_min="0ns"
> --quiet="false" --recover="reconnect" --recovery_timeout="15mins"
> --registration_backoff_factor="10ms" --resources="cpus:2;gpus:0;
> mem:1024;disk:1024;ports:[31000-32000]" --revocable_cpu_low_priority="true"
> --runtime_dir="/tmp/Endpoint_SlaveEndpointTest_AuthorizedRequest_2_8YD0sg"
> --sandbox_directory="/mnt/mesos/sandbox" --strict="true"
> --switch_user="true" --systemd_enable_support="true"
> --systemd_runtime_directory="/run/systemd/system" --version="false"
> --work_dir="/tmp/Endpoint_SlaveEndpointTest_AuthorizedRequest_2_EV4hMR"
> I0629 05:49:53.655704 25304 credentials.hpp:86] Loading credential for
> authentication from '/tmp/Endpoint_SlaveEndpointTest_
> AuthorizedRequest_2_8YD0sg/credential'
> I0629 05:49:53.655797 25304 slave.cpp:264] Agent using credential for:
> test-principal
> I0629 05:49:53.655812 25304 credentials.hpp:37] Loading credentials for
> authentication from '/tmp/Endpoint_SlaveEndpointTest_
> AuthorizedRequest_2_8YD0sg/http_credentials'
> I0629 05:49:53.655900 25304 http.cpp:975] Creating default 'basic' HTTP
> authenticator for realm 'mesos-agent-readonly'
> I0629 05:49:53.655956 25304 http.cpp:975] Creating default 'basic' HTTP
> authenticator for realm 'mesos-agent-readwrite'
> I0629 05:49:53.656311 25304 slave.cpp:531] Agent resources: cpus(*):2;
> mem(*):1024; disk(*):1024; ports(*):[31000-32000]
> I0629 05:49:53.656347 25304 slave.cpp:539] Agent attributes: [  ]
> I0629 05:49:53.656353 25304 slave.cpp:544] Agent hostname: 296af9b598c3
> I0629 05:49:53.656481 25303 status_update_manager.cpp:177] Pausing sending
> status updates
> I0629 05:49:53.658208 25304 state.cpp:62] Recovering state from
> '/tmp/Endpoint_SlaveEndpointTest_AuthorizedRequest_2_EV4hMR/meta'
> I0629 05:49:53.658341 25304 status_update_manager.cpp:203] Recovering
> status update manager
> I0629 05:49:53.658394 25304 containerizer.cpp:608] Recovering containerizer
> I0629 05:49:53.658881 25306 provisioner.cpp:410] Provisioner recovery
> complete
> I0629 05:49:53.658998 25306 slave.cpp:6075] Finished recovery
> I0629 05:49:53.659319 25306 slave.cpp:6257] Querying resource estimator
> for oversubscribable resources
> I0629 05:49:53.659471 25306 slave.cpp:6271] Received oversubscribable
> resources {} from the resource estimator
> I0629 05:49:53.661026 25309 process.cpp:3731] Handling HTTP event for
> process 'slave(737)' with path: '/slave(737)/containers'
> I0629 05:49:53.661311 25309 http.cpp:1115] HTTP GET for
> /slave(737)/containers from 172.17.0.3:39094
> I0629 05:49:53.661357 25309 http.cpp:936] Authorizing principal
> 'test-principal' to GET the '/containers' endpoint
> I0629 05:49:53.663591 25301 slave.cpp:796] Agent terminating
> [       OK ] Endpoint/SlaveEndpointTest.AuthorizedRequest/2 (13 ms)
> [ RUN      ] Endpoint/SlaveEndpointTest.UnauthorizedRequest/0
> I0629 05:49:53.667862 25301 containerizer.cpp:221] Using isolation:
> posix/cpu,posix/mem,filesystem/posix,network/cni
> W0629 05:49:53.668267 25301 backend.cpp:76] Failed to create 'aufs'
> backend: AufsBackend requires root privileges
> W0629 05:49:53.668313 25301 backend.cpp:76] Failed to create 'bind'
> backend: BindBackend requires root privileges
> I0629 05:49:53.668421 25301 provisioner.cpp:249] Using default backend
> 'copy'
> I0629 05:49:53.669613 25302 slave.cpp:231] Mesos agent started on (738)@
> 172.17.0.3:45726
> I0629 05:49:53.669637 25302 slave.cpp:232] Flags at startup: --acls=""
> --appc_simple_discovery_uri_prefix="http://" --appc_store_dir="/tmp/mesos/store/appc"
> --authenticate_http_readonly="true" --authenticate_http_readwrite="true"
> --authenticatee="crammd5" --authentication_backoff_factor="1secs"
> --authorizer="local" --cgroups_cpu_enable_pids_and_tids_count="false"
> --cgroups_enable_cfs="false" --cgroups_hierarchy="/sys/fs/cgroup"
> --cgroups_limit_swap="false" --cgroups_root="mesos" --container_disk_watch_interval="15secs"
> --containerizers="mesos" --credential="/tmp/Endpoint_SlaveEndpointTest_
> UnauthorizedRequest_0_XVg7lR/credential" --default_role="*"
> --disk_watch_interval="1mins" --docker="docker"
> --docker_kill_orphans="true" --docker_registry="https://
> registry-1.docker.io" --docker_remove_delay="6hrs"
> --docker_socket="/var/run/docker.sock" --docker_stop_timeout="0ns"
> --docker_store_dir="/tmp/mesos/store/docker" --docker_volume_checkpoint_
> dir="/var/run/mesos/isolators/docker/volume" --enforce_container_disk_quota="false"
> --executor_registration_timeout="1mins" --executor_reregistration_timeout="2secs"
> --executor_shutdown_grace_period="5secs" --fetcher_cache_dir="/tmp/
> Endpoint_SlaveEndpointTest_UnauthorizedRequest_0_XVg7lR/fetch"
> --fetcher_cache_size="2GB" --frameworks_home="" --gc_delay="1weeks"
> --gc_disk_headroom="0.1" --hadoop_home="" --help="false"
> --hostname_lookup="true" --http_command_executor="false"
> --http_credentials="/tmp/Endpoint_SlaveEndpointTest_
> UnauthorizedRequest_0_XVg7lR/http_credentials" --http_heartbeat_interval="30secs"
> --initialize_driver_logging="true" --isolation="posix/cpu,posix/mem"
> --launcher="posix" --launcher_dir="/mesos/build/src" --logbufsecs="0"
> --logging_level="INFO" --max_completed_executors_per_framework="150"
> --oversubscribed_resources_interval="15secs" --perf_duration="10secs"
> --perf_interval="1mins" --port="5051" --qos_correction_interval_min="0ns"
> --quiet="false" --recover="reconnect" --recovery_timeout="15mins"
> --registration_backoff_factor="10ms" --resources="cpus:2;gpus:0;
> mem:1024;disk:1024;ports:[31000-32000]" --revocable_cpu_low_priority="true"
> --runtime_dir="/tmp/Endpoint_SlaveEndpointTest_UnauthorizedRequest_0_XVg7lR"
> --sandbox_directory="/mnt/mesos/sandbox" --strict="true"
> --switch_user="true" --systemd_enable_support="true"
> --systemd_runtime_directory="/run/systemd/system" --version="false"
> --work_dir="/tmp/Endpoint_SlaveEndpointTest_UnauthorizedRequest_0_oCSWCs"
> I0629 05:49:53.669841 25302 credentials.hpp:86] Loading credential for
> authentication from '/tmp/Endpoint_SlaveEndpointTest_
> UnauthorizedRequest_0_XVg7lR/credential'
> I0629 05:49:53.669945 25302 slave.cpp:264] Agent using credential for:
> test-principal
> I0629 05:49:53.669965 25302 credentials.hpp:37] Loading credentials for
> authentication from '/tmp/Endpoint_SlaveEndpointTest_
> UnauthorizedRequest_0_XVg7lR/http_credentials'
> I0629 05:49:53.670053 25302 http.cpp:975] Creating default 'basic' HTTP
> authenticator for realm 'mesos-agent-readonly'
> I0629 05:49:53.670099 25302 http.cpp:975] Creating default 'basic' HTTP
> authenticator for realm 'mesos-agent-readwrite'
> I0629 05:49:53.670439 25302 slave.cpp:531] Agent resources: cpus(*):2;
> mem(*):1024; disk(*):1024; ports(*):[31000-32000]
> I0629 05:49:53.670478 25302 slave.cpp:539] Agent attributes: [  ]
> I0629 05:49:53.670485 25302 slave.cpp:544] Agent hostname: 296af9b598c3
> I0629 05:49:53.670915 25308 status_update_manager.cpp:177] Pausing sending
> status updates
> I0629 05:49:53.670928 25309 state.cpp:62] Recovering state from
> '/tmp/Endpoint_SlaveEndpointTest_UnauthorizedRequest_0_oCSWCs/meta'
> I0629 05:49:53.671056 25309 status_update_manager.cpp:203] Recovering
> status update manager
> I0629 05:49:53.671108 25309 containerizer.cpp:608] Recovering containerizer
> I0629 05:49:53.672487 25307 provisioner.cpp:410] Provisioner recovery
> complete
> I0629 05:49:53.672580 25307 slave.cpp:6075] Finished recovery
> I0629 05:49:53.672919 25307 slave.cpp:6257] Querying resource estimator
> for oversubscribable resources
> I0629 05:49:53.673030 25307 slave.cpp:6271] Received oversubscribable
> resources {} from the resource estimator
> I0629 05:49:53.674294 25307 process.cpp:3731] Handling HTTP event for
> process 'slave(738)' with path: '/slave(738)/monitor/statistics'
> I0629 05:49:53.674698 25307 http.cpp:1115] HTTP GET for
> /slave(738)/monitor/statistics from 172.17.0.3:39096
> I0629 05:49:53.674819 25307 http.cpp:936] Authorizing principal
> 'test-principal' to GET the '/monitor/statistics' endpoint
> I0629 05:49:53.676779 25301 slave.cpp:796] Agent terminating
> [       OK ] Endpoint/SlaveEndpointTest.UnauthorizedRequest/0 (13 ms)
> [ RUN      ] Endpoint/SlaveEndpointTest.UnauthorizedRequest/1
> I0629 05:49:53.681234 25301 containerizer.cpp:221] Using isolation:
> posix/cpu,posix/mem,filesystem/posix,network/cni
> W0629 05:49:53.681578 25301 backend.cpp:76] Failed to create 'aufs'
> backend: AufsBackend requires root privileges
> W0629 05:49:53.681618 25301 backend.cpp:76] Failed to create 'bind'
> backend: BindBackend requires root privileges
> I0629 05:49:53.681643 25301 provisioner.cpp:249] Using default backend
> 'copy'
> I0629 05:49:53.682768 25308 slave.cpp:231] Mesos agent started on (739)@
> 172.17.0.3:45726
> I0629 05:49:53.682791 25308 slave.cpp:232] Flags at startup: --acls=""
> --appc_simple_discovery_uri_prefix="http://" --appc_store_dir="/tmp/mesos/store/appc"
> --authenticate_http_readonly="true" --authenticate_http_readwrite="true"
> --authenticatee="crammd5" --authentication_backoff_factor="1secs"
> --authorizer="local" --cgroups_cpu_enable_pids_and_tids_count="false"
> --cgroups_enable_cfs="false" --cgroups_hierarchy="/sys/fs/cgroup"
> --cgroups_limit_swap="false" --cgroups_root="mesos" --container_disk_watch_interval="15secs"
> --containerizers="mesos" --credential="/tmp/Endpoint_SlaveEndpointTest_
> UnauthorizedRequest_1_GCUFos/credential" --default_role="*"
> --disk_watch_interval="1mins" --docker="docker"
> --docker_kill_orphans="true" --docker_registry="https://
> registry-1.docker.io" --docker_remove_delay="6hrs"
> --docker_socket="/var/run/docker.sock" --docker_stop_timeout="0ns"
> --docker_store_dir="/tmp/mesos/store/docker" --docker_volume_checkpoint_
> dir="/var/run/mesos/isolators/docker/volume" --enforce_container_disk_quota="false"
> --executor_registration_timeout="1mins" --executor_reregistration_timeout="2secs"
> --executor_shutdown_grace_period="5secs" --fetcher_cache_dir="/tmp/
> Endpoint_SlaveEndpointTest_UnauthorizedRequest_1_GCUFos/fetch"
> --fetcher_cache_size="2GB" --frameworks_home="" --gc_delay="1weeks"
> --gc_disk_headroom="0.1" --hadoop_home="" --help="false"
> --hostname_lookup="true" --http_command_executor="false"
> --http_credentials="/tmp/Endpoint_SlaveEndpointTest_
> UnauthorizedRequest_1_GCUFos/http_credentials" --http_heartbeat_interval="30secs"
> --initialize_driver_logging="true" --isolation="posix/cpu,posix/mem"
> --launcher="posix" --launcher_dir="/mesos/build/src" --logbufsecs="0"
> --logging_level="INFO" --max_completed_executors_per_framework="150"
> --oversubscribed_resources_interval="15secs" --perf_duration="10secs"
> --perf_interval="1mins" --port="5051" --qos_correction_interval_min="0ns"
> --quiet="false" --recover="reconnect" --recovery_timeout="15mins"
> --registration_backoff_factor="10ms" --resources="cpus:2;gpus:0;
> mem:1024;disk:1024;ports:[31000-32000]" --revocable_cpu_low_priority="true"
> --runtime_dir="/tmp/Endpoint_SlaveEndpointTest_UnauthorizedRequest_1_GCUFos"
> --sandbox_directory="/mnt/mesos/sandbox" --strict="true"
> --switch_user="true" --systemd_enable_support="true"
> --systemd_runtime_directory="/run/systemd/system" --version="false"
> --work_dir="/tmp/Endpoint_SlaveEndpointTest_UnauthorizedRequest_1_ShbaD3"
> I0629 05:49:53.682962 25308 credentials.hpp:86] Loading credential for
> authentication from '/tmp/Endpoint_SlaveEndpointTest_
> UnauthorizedRequest_1_GCUFos/credential'
> I0629 05:49:53.683046 25308 slave.cpp:264] Agent using credential for:
> test-principal
> I0629 05:49:53.683063 25308 credentials.hpp:37] Loading credentials for
> authentication from '/tmp/Endpoint_SlaveEndpointTest_
> UnauthorizedRequest_1_GCUFos/http_credentials'
> I0629 05:49:53.683151 25308 http.cpp:975] Creating default 'basic' HTTP
> authenticator for realm 'mesos-agent-readonly'
> I0629 05:49:53.683197 25308 http.cpp:975] Creating default 'basic' HTTP
> authenticator for realm 'mesos-agent-readwrite'
> I0629 05:49:53.683532 25308 slave.cpp:531] Agent resources: cpus(*):2;
> mem(*):1024; disk(*):1024; ports(*):[31000-32000]
> I0629 05:49:53.683568 25308 slave.cpp:539] Agent attributes: [  ]
> I0629 05:49:53.683573 25308 slave.cpp:544] Agent hostname: 296af9b598c3
> I0629 05:49:53.683616 25307 status_update_manager.cpp:177] Pausing sending
> status updates
> I0629 05:49:53.683876 25307 state.cpp:62] Recovering state from
> '/tmp/Endpoint_SlaveEndpointTest_UnauthorizedRequest_1_ShbaD3/meta'
> I0629 05:49:53.684007 25307 status_update_manager.cpp:203] Recovering
> status update manager
> I0629 05:49:53.684057 25307 containerizer.cpp:608] Recovering containerizer
> I0629 05:49:53.685274 25308 provisioner.cpp:410] Provisioner recovery
> complete
> I0629 05:49:53.685392 25308 slave.cpp:6075] Finished recovery
> I0629 05:49:53.685690 25308 slave.cpp:6257] Querying resource estimator
> for oversubscribable resources
> I0629 05:49:53.685811 25308 slave.cpp:6271] Received oversubscribable
> resources {} from the resource estimator
> I0629 05:49:53.687459 25308 process.cpp:3731] Handling HTTP event for
> process 'slave(739)' with path: '/slave(739)/monitor/statistics.json'
> I0629 05:49:53.687731 25308 http.cpp:1115] HTTP GET for
> /slave(739)/monitor/statistics.json from 172.17.0.3:39098
> I0629 05:49:53.687774 25308 http.cpp:936] Authorizing principal
> 'test-principal' to GET the '/monitor/statistics.json' endpoint
> I0629 05:49:53.691315 25301 slave.cpp:796] Agent terminating
> [       OK ] Endpoint/SlaveEndpointTest.UnauthorizedRequest/1 (13 ms)
> [ RUN      ] Endpoint/SlaveEndpointTest.UnauthorizedRequest/2
> I0629 05:49:53.695322 25301 containerizer.cpp:221] Using isolation:
> posix/cpu,posix/mem,filesystem/posix,network/cni
> W0629 05:49:53.695632 25301 backend.cpp:76] Failed to create 'aufs'
> backend: AufsBackend requires root privileges
> W0629 05:49:53.695742 25301 backend.cpp:76] Failed to create 'bind'
> backend: BindBackend requires root privileges
> I0629 05:49:53.695755 25301 provisioner.cpp:249] Using default backend
> 'copy'
> I0629 05:49:53.696617 25304 slave.cpp:231] Mesos agent started on (740)@
> 172.17.0.3:45726
> I0629 05:49:53.696632 25304 slave.cpp:232] Flags at startup: --acls=""
> --appc_simple_discovery_uri_prefix="http://" --appc_store_dir="/tmp/mesos/store/appc"
> --authenticate_http_readonly="true" --authenticate_http_readwrite="true"
> --authenticatee="crammd5" --authentication_backoff_factor="1secs"
> --authorizer="local" --cgroups_cpu_enable_pids_and_tids_count="false"
> --cgroups_enable_cfs="false" --cgroups_hierarchy="/sys/fs/cgroup"
> --cgroups_limit_swap="false" --cgroups_root="mesos" --container_disk_watch_interval="15secs"
> --containerizers="mesos" --credential="/tmp/Endpoint_SlaveEndpointTest_
> UnauthorizedRequest_2_s13TA3/credential" --default_role="*"
> --disk_watch_interval="1mins" --docker="docker"
> --docker_kill_orphans="true" --docker_registry="https://
> registry-1.docker.io" --docker_remove_delay="6hrs"
> --docker_socket="/var/run/docker.sock" --docker_stop_timeout="0ns"
> --docker_store_dir="/tmp/mesos/store/docker" --docker_volume_checkpoint_
> dir="/var/run/mesos/isolators/docker/volume" --enforce_container_disk_quota="false"
> --executor_registration_timeout="1mins" --executor_reregistration_timeout="2secs"
> --executor_shutdown_grace_period="5secs" --fetcher_cache_dir="/tmp/
> Endpoint_SlaveEndpointTest_UnauthorizedRequest_2_s13TA3/fetch"
> --fetcher_cache_size="2GB" --frameworks_home="" --gc_delay="1weeks"
> --gc_disk_headroom="0.1" --hadoop_home="" --help="false"
> --hostname_lookup="true" --http_command_executor="false"
> --http_credentials="/tmp/Endpoint_SlaveEndpointTest_
> UnauthorizedRequest_2_s13TA3/http_credentials" --http_heartbeat_interval="30secs"
> --initialize_driver_logging="true" --isolation="posix/cpu,posix/mem"
> --launcher="posix" --launcher_dir="/mesos/build/src" --logbufsecs="0"
> --logging_level="INFO" --max_completed_executors_per_framework="150"
> --oversubscribed_resources_interval="15secs" --perf_duration="10secs"
> --perf_interval="1mins" --port="5051" --qos_correction_interval_min="0ns"
> --quiet="false" --recover="reconnect" --recovery_timeout="15mins"
> --registration_backoff_factor="10ms" --resources="cpus:2;gpus:0;
> mem:1024;disk:1024;ports:[31000-32000]" --revocable_cpu_low_priority="true"
> --runtime_dir="/tmp/Endpoint_SlaveEndpointTest_UnauthorizedRequest_2_s13TA3"
> --sandbox_directory="/mnt/mesos/sandbox" --strict="true"
> --switch_user="true" --systemd_enable_support="true"
> --systemd_runtime_directory="/run/systemd/system" --version="false"
> --work_dir="/tmp/Endpoint_SlaveEndpointTest_UnauthorizedRequest_2_iEbVME"
> I0629 05:49:53.696775 25304 credentials.hpp:86] Loading credential for
> authentication from '/tmp/Endpoint_SlaveEndpointTest_
> UnauthorizedRequest_2_s13TA3/credential'
> I0629 05:49:53.696869 25304 slave.cpp:264] Agent using credential for:
> test-principal
> I0629 05:49:53.696879 25304 credentials.hpp:37] Loading credentials for
> authentication from '/tmp/Endpoint_SlaveEndpointTest_
> UnauthorizedRequest_2_s13TA3/http_credentials'
> I0629 05:49:53.696965 25304 http.cpp:975] Creating default 'basic' HTTP
> authenticator for realm 'mesos-agent-readonly'
> I0629 05:49:53.697011 25304 http.cpp:975] Creating default 'basic' HTTP
> authenticator for realm 'mesos-agent-readwrite'
> I0629 05:49:53.697386 25304 slave.cpp:531] Agent resources: cpus(*):2;
> mem(*):1024; disk(*):1024; ports(*):[31000-32000]
> I0629 05:49:53.697417 25304 slave.cpp:539] Agent attributes: [  ]
> I0629 05:49:53.697422 25304 slave.cpp:544] Agent hostname: 296af9b598c3
> I0629 05:49:53.697686 25304 status_update_manager.cpp:177] Pausing sending
> status updates
> I0629 05:49:53.697845 25304 state.cpp:62] Recovering state from
> '/tmp/Endpoint_SlaveEndpointTest_UnauthorizedRequest_2_iEbVME/meta'
> I0629 05:49:53.697975 25304 status_update_manager.cpp:203] Recovering
> status update manager
> I0629 05:49:53.698012 25304 containerizer.cpp:608] Recovering containerizer
> I0629 05:49:53.698374 25304 provisioner.cpp:410] Provisioner recovery
> complete
> I0629 05:49:53.698463 25304 slave.cpp:6075] Finished recovery
> I0629 05:49:53.698804 25304 slave.cpp:6257] Querying resource estimator
> for oversubscribable resources
> I0629 05:49:53.698997 25309 slave.cpp:6271] Received oversubscribable
> resources {} from the resource estimator
> I0629 05:49:53.700052 25305 process.cpp:3731] Handling HTTP event for
> process 'slave(740)' with path: '/slave(740)/containers'
> I0629 05:49:53.700367 25305 http.cpp:1115] HTTP GET for
> /slave(740)/containers from 172.17.0.3:39100
> I0629 05:49:53.700419 25305 http.cpp:936] Authorizing principal
> 'test-principal' to GET the '/containers' endpoint
> I0629 05:49:53.701385 25303 slave.cpp:796] Agent terminating
> [       OK ] Endpoint/SlaveEndpointTest.UnauthorizedRequest/2 (10 ms)
> [ RUN      ] Endpoint/SlaveEndpointTest.NoAuthorizer/0
> I0629 05:49:53.705674 25301 containerizer.cpp:221] Using isolation:
> posix/cpu,posix/mem,filesystem/posix,network/cni
> W0629 05:49:53.705943 25301 backend.cpp:76] Failed to create 'aufs'
> backend: AufsBackend requires root privileges
> W0629 05:49:53.706027 25301 backend.cpp:76] Failed to create 'bind'
> backend: BindBackend requires root privileges
> I0629 05:49:53.706046 25301 provisioner.cpp:249] Using default backend
> 'copy'
> I0629 05:49:53.706645 25301 cluster.cpp:448] Creating default 'local'
> authorizer
> I0629 05:49:53.707120 25309 slave.cpp:231] Mesos agent started on (741)@
> 172.17.0.3:45726
> I0629 05:49:53.707157 25309 slave.cpp:232] Flags at startup: --acls=""
> --appc_simple_discovery_uri_prefix="http://" --appc_store_dir="/tmp/mesos/store/appc"
> --authenticate_http_readonly="true" --authenticate_http_readwrite="true"
> --authenticatee="crammd5" --authentication_backoff_factor="1secs"
> --authorizer="local" --cgroups_cpu_enable_pids_and_tids_count="false"
> --cgroups_enable_cfs="false" --cgroups_hierarchy="/sys/fs/cgroup"
> --cgroups_limit_swap="false" --cgroups_root="mesos" --container_disk_watch_interval="15secs"
> --containerizers="mesos" --credential="/tmp/Endpoint_SlaveEndpointTest_
> NoAuthorizer_0_aiTVUE/credential" --default_role="*"
> --disk_watch_interval="1mins" --docker="docker"
> --docker_kill_orphans="true" --docker_registry="https://
> registry-1.docker.io" --docker_remove_delay="6hrs"
> --docker_socket="/var/run/docker.sock" --docker_stop_timeout="0ns"
> --docker_store_dir="/tmp/mesos/store/docker" --docker_volume_checkpoint_
> dir="/var/run/mesos/isolators/docker/volume" --enforce_container_disk_quota="false"
> --executor_registration_timeout="1mins" --executor_reregistration_timeout="2secs"
> --executor_shutdown_grace_period="5secs" --fetcher_cache_dir="/tmp/
> Endpoint_SlaveEndpointTest_NoAuthorizer_0_aiTVUE/fetch"
> --fetcher_cache_size="2GB" --frameworks_home="" --gc_delay="1weeks"
> --gc_disk_headroom="0.1" --hadoop_home="" --help="false"
> --hostname_lookup="true" --http_command_executor="false"
> --http_credentials="/tmp/Endpoint_SlaveEndpointTest_
> NoAuthorizer_0_aiTVUE/http_credentials" --http_heartbeat_interval="30secs"
> --initialize_driver_logging="true" --isolation="posix/cpu,posix/mem"
> --launcher="posix" --launcher_dir="/mesos/build/src" --logbufsecs="0"
> --logging_level="INFO" --max_completed_executors_per_framework="150"
> --oversubscribed_resources_interval="15secs" --perf_duration="10secs"
> --perf_interval="1mins" --port="5051" --qos_correction_interval_min="0ns"
> --quiet="false" --recover="reconnect" --recovery_timeout="15mins"
> --registration_backoff_factor="10ms" --resources="cpus:2;gpus:0;
> mem:1024;disk:1024;ports:[31000-32000]" --revocable_cpu_low_priority="true"
> --runtime_dir="/tmp/Endpoint_SlaveEndpointTest_NoAuthorizer_0_aiTVUE"
> --sandbox_directory="/mnt/mesos/sandbox" --strict="true"
> --switch_user="true" --systemd_enable_support="true"
> --systemd_runtime_directory="/run/systemd/system" --version="false"
> --work_dir="/tmp/Endpoint_SlaveEndpointTest_NoAuthorizer_0_l4U74f"
> I0629 05:49:53.707392 25309 credentials.hpp:86] Loading credential for
> authentication from '/tmp/Endpoint_SlaveEndpointTest_
> NoAuthorizer_0_aiTVUE/credential'
> I0629 05:49:53.707577 25309 slave.cpp:264] Agent using credential for:
> test-principal
> I0629 05:49:53.707598 25309 credentials.hpp:37] Loading credentials for
> authentication from '/tmp/Endpoint_SlaveEndpointTest_
> NoAuthorizer_0_aiTVUE/http_credentials'
> I0629 05:49:53.707705 25309 http.cpp:975] Creating default 'basic' HTTP
> authenticator for realm 'mesos-agent-readonly'
> I0629 05:49:53.707782 25309 http.cpp:975] Creating default 'basic' HTTP
> authenticator for realm 'mesos-agent-readwrite'
> I0629 05:49:53.708197 25309 slave.cpp:531] Agent resources: cpus(*):2;
> mem(*):1024; disk(*):1024; ports(*):[31000-32000]
> I0629 05:49:53.708238 25309 slave.cpp:539] Agent attributes: [  ]
> I0629 05:49:53.708245 25309 slave.cpp:544] Agent hostname: 296af9b598c3
> I0629 05:49:53.708559 25309 status_update_manager.cpp:177] Pausing sending
> status updates
> I0629 05:49:53.708694 25302 state.cpp:62] Recovering state from
> '/tmp/Endpoint_SlaveEndpointTest_NoAuthorizer_0_l4U74f/meta'
> I0629 05:49:53.708870 25302 status_update_manager.cpp:203] Recovering
> status update manager
> I0629 05:49:53.708920 25302 containerizer.cpp:608] Recovering containerizer
> I0629 05:49:53.709400 25302 provisioner.cpp:410] Provisioner recovery
> complete
> I0629 05:49:53.709506 25302 slave.cpp:6075] Finished recovery
> I0629 05:49:53.709995 25302 slave.cpp:6257] Querying resource estimator
> for oversubscribable resources
> I0629 05:49:53.710165 25305 slave.cpp:6271] Received oversubscribable
> resources {} from the resource estimator
> I0629 05:49:53.710994 25302 process.cpp:3731] Handling HTTP event for
> process 'slave(741)' with path: '/slave(741)/monitor/statistics'
> I0629 05:49:53.711457 25307 http.cpp:1115] HTTP GET for
> /slave(741)/monitor/statistics from 172.17.0.3:39102
> I0629 05:49:53.711518 25307 http.cpp:936] Authorizing principal
> 'test-principal' to GET the '/monitor/statistics' endpoint
> I0629 05:49:53.715399 25301 slave.cpp:796] Agent terminating
> [       OK ] Endpoint/SlaveEndpointTest.NoAuthorizer/0 (16 ms)
> [ RUN      ] Endpoint/SlaveEndpointTest.NoAuthorizer/1
> I0629 05:49:53.721704 25301 containerizer.cpp:221] Using isolation:
> posix/cpu,posix/mem,filesystem/posix,network/cni
> W0629 05:49:53.722072 25301 backend.cpp:76] Failed to create 'aufs'
> backend: AufsBackend requires root privileges
> W0629 05:49:53.722115 25301 backend.cpp:76] Failed to create 'bind'
> backend: BindBackend requires root privileges
> I0629 05:49:53.722127 25301 provisioner.cpp:249] Using default backend
> 'copy'
> I0629 05:49:53.722766 25301 cluster.cpp:448] Creating default 'local'
> authorizer
> I0629 05:49:53.723348 25305 slave.cpp:231] Mesos agent started on (742)@
> 172.17.0.3:45726
> I0629 05:49:53.723381 25305 slave.cpp:232] Flags at startup: --acls=""
> --appc_simple_discovery_uri_prefix="http://" --appc_store_dir="/tmp/mesos/store/appc"
> --authenticate_http_readonly="true" --authenticate_http_readwrite="true"
> --authenticatee="crammd5" --authentication_backoff_factor="1secs"
> --authorizer="local" --cgroups_cpu_enable_pids_and_tids_count="false"
> --cgroups_enable_cfs="false" --cgroups_hierarchy="/sys/fs/cgroup"
> --cgroups_limit_swap="false" --cgroups_root="mesos" --container_disk_watch_interval="15secs"
> --containerizers="mesos" --credential="/tmp/Endpoint_SlaveEndpointTest_
> NoAuthorizer_1_v7fjpg/credential" --default_role="*"
> --disk_watch_interval="1mins" --docker="docker"
> --docker_kill_orphans="true" --docker_registry="https://
> registry-1.docker.io" --docker_remove_delay="6hrs"
> --docker_socket="/var/run/docker.sock" --docker_stop_timeout="0ns"
> --docker_store_dir="/tmp/mesos/store/docker" --docker_volume_checkpoint_
> dir="/var/run/mesos/isolators/docker/volume" --enforce_container_disk_quota="false"
> --executor_registration_timeout="1mins" --executor_reregistration_timeout="2secs"
> --executor_shutdown_grace_period="5secs" --fetcher_cache_dir="/tmp/
> Endpoint_SlaveEndpointTest_NoAuthorizer_1_v7fjpg/fetch"
> --fetcher_cache_size="2GB" --frameworks_home="" --gc_delay="1weeks"
> --gc_disk_headroom="0.1" --hadoop_home="" --help="false"
> --hostname_lookup="true" --http_command_executor="false"
> --http_credentials="/tmp/Endpoint_SlaveEndpointTest_
> NoAuthorizer_1_v7fjpg/http_credentials" --http_heartbeat_interval="30secs"
> --initialize_driver_logging="true" --isolation="posix/cpu,posix/mem"
> --launcher="posix" --launcher_dir="/mesos/build/src" --logbufsecs="0"
> --logging_level="INFO" --max_completed_executors_per_framework="150"
> --oversubscribed_resources_interval="15secs" --perf_duration="10secs"
> --perf_interval="1mins" --port="5051" --qos_correction_interval_min="0ns"
> --quiet="false" --recover="reconnect" --recovery_timeout="15mins"
> --registration_backoff_factor="10ms" --resources="cpus:2;gpus:0;
> mem:1024;disk:1024;ports:[31000-32000]" --revocable_cpu_low_priority="true"
> --runtime_dir="/tmp/Endpoint_SlaveEndpointTest_NoAuthorizer_1_v7fjpg"
> --sandbox_directory="/mnt/mesos/sandbox" --strict="true"
> --switch_user="true" --systemd_enable_support="true"
> --systemd_runtime_directory="/run/systemd/system" --version="false"
> --work_dir="/tmp/Endpoint_SlaveEndpointTest_NoAuthorizer_1_QGDHwR"
> I0629 05:49:53.723630 25305 credentials.hpp:86] Loading credential for
> authentication from '/tmp/Endpoint_SlaveEndpointTest_
> NoAuthorizer_1_v7fjpg/credential'
> I0629 05:49:53.723791 25305 slave.cpp:264] Agent using credential for:
> test-principal
> I0629 05:49:53.723808 25305 credentials.hpp:37] Loading credentials for
> authentication from '/tmp/Endpoint_SlaveEndpointTest_
> NoAuthorizer_1_v7fjpg/http_credentials'
> I0629 05:49:53.723917 25305 http.cpp:975] Creating default 'basic' HTTP
> authenticator for realm 'mesos-agent-readonly'
> I0629 05:49:53.724011 25305 http.cpp:975] Creating default 'basic' HTTP
> authenticator for realm 'mesos-agent-readwrite'
> I0629 05:49:53.724465 25305 slave.cpp:531] Agent resources: cpus(*):2;
> mem(*):1024; disk(*):1024; ports(*):[31000-32000]
> I0629 05:49:53.724509 25305 slave.cpp:539] Agent attributes: [  ]
> I0629 05:49:53.724514 25305 slave.cpp:544] Agent hostname: 296af9b598c3
> I0629 05:49:53.724616 25306 status_update_manager.cpp:177] Pausing sending
> status updates
> I0629 05:49:53.724869 25305 state.cpp:62] Recovering state from
> '/tmp/Endpoint_SlaveEndpointTest_NoAuthorizer_1_QGDHwR/meta'
> I0629 05:49:53.725054 25306 status_update_manager.cpp:203] Recovering
> status update manager
> I0629 05:49:53.725172 25303 containerizer.cpp:608] Recovering containerizer
> I0629 05:49:53.725760 25307 provisioner.cpp:410] Provisioner recovery
> complete
> I0629 05:49:53.726493 25307 slave.cpp:6075] Finished recovery
> I0629 05:49:53.726954 25307 slave.cpp:6257] Querying resource estimator
> for oversubscribable resources
> I0629 05:49:53.727090 25307 slave.cpp:6271] Received oversubscribable
> resources {} from the resource estimator
> I0629 05:49:53.728965 25307 process.cpp:3731] Handling HTTP event for
> process 'slave(742)' with path: '/slave(742)/monitor/statistics.json'
> I0629 05:49:53.729315 25307 http.cpp:1115] HTTP GET for
> /slave(742)/monitor/statistics.json from 172.17.0.3:39104
> I0629 05:49:53.729365 25307 http.cpp:936] Authorizing principal
> 'test-principal' to GET the '/monitor/statistics.json' endpoint
> I0629 05:49:53.732332 25307 slave.cpp:796] Agent terminating
> [       OK ] Endpoint/SlaveEndpointTest.NoAuthorizer/1 (15 ms)
> [ RUN      ] Endpoint/SlaveEndpointTest.NoAuthorizer/2
> I0629 05:49:53.737143 25301 containerizer.cpp:221] Using isolation:
> posix/cpu,posix/mem,filesystem/posix,network/cni
> W0629 05:49:53.738217 25301 backend.cpp:76] Failed to create 'aufs'
> backend: AufsBackend requires root privileges
> W0629 05:49:53.738263 25301 backend.cpp:76] Failed to create 'bind'
> backend: BindBackend requires root privileges
> I0629 05:49:53.738276 25301 provisioner.cpp:249] Using default backend
> 'copy'
> I0629 05:49:53.738947 25301 cluster.cpp:448] Creating default 'local'
> authorizer
> I0629 05:49:53.739575 25304 slave.cpp:231] Mesos agent started on (743)@
> 172.17.0.3:45726
> I0629 05:49:53.739599 25304 slave.cpp:232] Flags at startup: --acls=""
> --appc_simple_discovery_uri_prefix="http://" --appc_store_dir="/tmp/mesos/store/appc"
> --authenticate_http_readonly="true" --authenticate_http_readwrite="true"
> --authenticatee="crammd5" --authentication_backoff_factor="1secs"
> --authorizer="local" --cgroups_cpu_enable_pids_and_tids_count="false"
> --cgroups_enable_cfs="false" --cgroups_hierarchy="/sys/fs/cgroup"
> --cgroups_limit_swap="false" --cgroups_root="mesos" --container_disk_watch_interval="15secs"
> --containerizers="mesos" --credential="/tmp/Endpoint_SlaveEndpointTest_
> NoAuthorizer_2_bzID4R/credential" --default_role="*"
> --disk_watch_interval="1mins" --docker="docker"
> --docker_kill_orphans="true" --docker_registry="https://
> registry-1.docker.io" --docker_remove_delay="6hrs"
> --docker_socket="/var/run/docker.sock" --docker_stop_timeout="0ns"
> --docker_store_dir="/tmp/mesos/store/docker" --docker_volume_checkpoint_
> dir="/var/run/mesos/isolators/docker/volume" --enforce_container_disk_quota="false"
> --executor_registration_timeout="1mins" --executor_reregistration_timeout="2secs"
> --executor_shutdown_grace_period="5secs" --fetcher_cache_dir="/tmp/
> Endpoint_SlaveEndpointTest_NoAuthorizer_2_bzID4R/fetch"
> --fetcher_cache_size="2GB" --frameworks_home="" --gc_delay="1weeks"
> --gc_disk_headroom="0.1" --hadoop_home="" --help="false"
> --hostname_lookup="true" --http_command_executor="false"
> --http_credentials="/tmp/Endpoint_SlaveEndpointTest_
> NoAuthorizer_2_bzID4R/http_credentials" --http_heartbeat_interval="30secs"
> --initialize_driver_logging="true" --isolation="posix/cpu,posix/mem"
> --launcher="posix" --launcher_dir="/mesos/build/src" --logbufsecs="0"
> --logging_level="INFO" --max_completed_executors_per_framework="150"
> --oversubscribed_resources_interval="15secs" --perf_duration="10secs"
> --perf_interval="1mins" --port="5051" --qos_correction_interval_min="0ns"
> --quiet="false" --recover="reconnect" --recovery_timeout="15mins"
> --registration_backoff_factor="10ms" --resources="cpus:2;gpus:0;
> mem:1024;disk:1024;ports:[31000-32000]" --revocable_cpu_low_priority="true"
> --runtime_dir="/tmp/Endpoint_SlaveEndpointTest_NoAuthorizer_2_bzID4R"
> --sandbox_directory="/mnt/mesos/sandbox" --strict="true"
> --switch_user="true" --systemd_enable_support="true"
> --systemd_runtime_directory="/run/systemd/system" --version="false"
> --work_dir="/tmp/Endpoint_SlaveEndpointTest_NoAuthorizer_2_L8tm9s"
> I0629 05:49:53.739795 25304 credentials.hpp:86] Loading credential for
> authentication from '/tmp/Endpoint_SlaveEndpointTest_
> NoAuthorizer_2_bzID4R/credential'
> I0629 05:49:53.739910 25304 slave.cpp:264] Agent using credential for:
> test-principal
> I0629 05:49:53.739920 25304 credentials.hpp:37] Loading credentials for
> authentication from '/tmp/Endpoint_SlaveEndpointTest_
> NoAuthorizer_2_bzID4R/http_credentials'
> I0629 05:49:53.740015 25304 http.cpp:975] Creating default 'basic' HTTP
> authenticator for realm 'mesos-agent-readonly'
> I0629 05:49:53.740094 25304 http.cpp:975] Creating default 'basic' HTTP
> authenticator for realm 'mesos-agent-readwrite'
> I0629 05:49:53.740551 25304 slave.cpp:531] Agent resources: cpus(*):2;
> mem(*):1024; disk(*):1024; ports(*):[31000-32000]
> I0629 05:49:53.740594 25304 slave.cpp:539] Agent attributes: [  ]
> I0629 05:49:53.740605 25304 slave.cpp:544] Agent hostname: 296af9b598c3
> I0629 05:49:53.740738 25309 status_update_manager.cpp:177] Pausing sending
> status updates
> I0629 05:49:53.741035 25303 state.cpp:62] Recovering state from
> '/tmp/Endpoint_SlaveEndpointTest_NoAuthorizer_2_L8tm9s/meta'
> I0629 05:49:53.741199 25303 status_update_manager.cpp:203] Recovering
> status update manager
> I0629 05:49:53.741251 25303 containerizer.cpp:608] Recovering containerizer
> I0629 05:49:53.741658 25303 provisioner.cpp:410] Provisioner recovery
> complete
> I0629 05:49:53.741758 25303 slave.cpp:6075] Finished recovery
> I0629 05:49:53.742224 25303 slave.cpp:6257] Querying resource estimator
> for oversubscribable resources
> I0629 05:49:53.742897 25308 slave.cpp:6271] Received oversubscribable
> resources {} from the resource estimator
> I0629 05:49:53.743950 25302 process.cpp:3731] Handling HTTP event for
> process 'slave(743)' with path: '/slave(743)/containers'
> I0629 05:49:53.744254 25302 http.cpp:1115] HTTP GET for
> /slave(743)/containers from 172.17.0.3:39106
> I0629 05:49:53.744302 25302 http.cpp:936] Authorizing principal
> 'test-principal' to GET the '/containers' endpoint
> I0629 05:49:53.745640 25302 slave.cpp:796] Agent terminating
> [       OK ] Endpoint/SlaveEndpointTest.NoAuthorizer/2 (13 ms)
> [----------] 9 tests from Endpoint/SlaveEndpointTest (127 ms total)
>
> [----------] Global test environment tear-down
> [==========] 1520 tests from 167 test cases ran. (246465 ms total)
> [  PASSED  ] 1518 tests.
> [  FAILED  ] 2 tests, listed below:
> [  FAILED  ] HierarchicalAllocatorTest.NestedRoleQuota
> [  FAILED  ] ContentType/AgentAPIStreamingTest.
> AttachInputToNestedContainerSession/0, where GetParam() =
> application/x-protobuf
>
>  2 FAILED TESTS
>   YOU HAVE 22 DISABLED TESTS
>
> E0629 05:49:53.787487 25310 process.cpp:951] Failed to accept socket:
> future discarded
> make[3]: *** [CMakeFiles/check] Error 1
> make[3]: Leaving directory `/mesos/build'
> make[2]: *** [CMakeFiles/check.dir/all] Error 2
> make[2]: Leaving directory `/mesos/build'
> make[1]: *** [CMakeFiles/check.dir/rule] Error 2
> make[1]: Leaving directory `/mesos/build'
> make: *** [check] Error 2
> + docker rmi mesos-1498711682-12019
> Untagged: mesos-1498711682-12019:latest
> Deleted: sha256:d4edd238483b264a17ad4d03d545fd
> 264e9754782c9518e8fba472134236a87d
> Deleted: sha256:c8544ae79f696a492da076e8acac80
> c162b20794c94db7b53e5109265190ff34
> Deleted: sha256:39eae4a5e9e7f62573708f799b4fc0
> 9915ef111e48307fcb95f9647ba4ad719e
> Deleted: sha256:7a7efa7aba9ecd6859477c74c5c485
> 8661a5a0e038c7a1be3c0a687f733af14c
> Deleted: sha256:4cc6b6ef8bc48f1365f15c9e954fa5
> 0b1357df030feeee568e04f9ef7e03e1b7
> Deleted: sha256:186ece471aacbdb853133878ae624a
> c9a38f4a673c917b347c70dd56b72167f3
> Deleted: sha256:d0ec4eadb8adb18c0dd37b52dbdec2
> 18b4f91f253f362c6a72f836e20d96a718
> Deleted: sha256:192954a06d9b0052ac68225b8d5022
> e3f360f7a9ef4756b151b8f621d8028795
> Deleted: sha256:4dec8c46ac7f7403c68d0474f4ccc0
> 680cfe2e024ad7b4a38ad65bfcfa76362c
> Deleted: sha256:a824d5a4df96a041e5d1b76626b712
> b75bf41a8e1244bb25c0f8222d3c16915b
> Deleted: sha256:fa9dde8f2b31c05b60dbb06147076c
> 6c9b77b1df526c0b700cfff1ab201fa83e
> Deleted: sha256:7e3c61676c38b39aa2498dd04f52a9
> 748775ca4237c7c02fa1b0553a7bb97ebb
> Deleted: sha256:054f1f4008240876c2af4b68dea3c9
> 87be20a3c0268e63970d8cce81463cc75c
> Deleted: sha256:b7eae816d6831f7dee2957bd824125
> 0fa3b2af8b4e925ab7355b91d3ea415207
> Deleted: sha256:35c11ab7819c783e4a726da8749ec8
> c09195b34d7926f574de923898bd1c5667
> Deleted: sha256:296ccdc8a8357a0cc7e8d3fc060796
> 6319437406970b637a893f3b89d22c6077
> Deleted: sha256:bc9ac2aee0b342b5d365e352b5669f
> ca0d1b24b06934e45737aad6995bea3222
> Deleted: sha256:d4d18e60b14e229a73e77cb7cd9aff
> 8aafef95da617eaa7ce6858bfa6ed9aa58
> Deleted: sha256:278b1d4c6b223b3c4fab5c1fac2b9b
> 3bb02217e3296d6a66672180c3918cd4c3
> Deleted: sha256:c5e9779da1bc9142af936ee57f41a4
> 1ea5a04130d8ab79fcb862092ddf7b1100
> Deleted: sha256:1c521dce223cad68e6420485b9c2fd
> 2cf9c8416eb68c62123fe11bdedae44592
> Deleted: sha256:9fb83548d95ace032aedb35275c1d2
> 2a22011dd4267e19764ee983aa1add0b6f
> Deleted: sha256:07a255fb1d555263b7f581d9db1e3c
> c59936abf1d8ed452f0579c397dd248419
> Deleted: sha256:f604ee9842ed9345685ba43a037963
> 8af5d874eabe7816b1167267392ae5e9fa
> Build step 'Execute shell' marked build as failure
>

Jenkins build is back to normal : Mesos-Buildbot » cmake,gcc,--verbose,GLOG_v=1 MESOS_VERBOSE=1,ubuntu:14.04,(ubuntu)&&(!ubuntu-us1)&&(!ubuntu-eu2) #3851

Posted by Apache Jenkins Server <je...@builds.apache.org>.
See <https://builds.apache.org/job/Mesos-Buildbot/BUILDTOOL=cmake,COMPILER=gcc,CONFIGURATION=--verbose,ENVIRONMENT=GLOG_v=1%20MESOS_VERBOSE=1,OS=ubuntu%3A14.04,label_exp=(ubuntu)&&(!ubuntu-us1)&&(!ubuntu-eu2)/3851/display/redirect>


Build failed in Jenkins: Mesos-Buildbot » cmake,gcc,--verbose,GLOG_v=1 MESOS_VERBOSE=1,ubuntu:14.04,(ubuntu)&&(!ubuntu-us1)&&(!ubuntu-eu2) #3850

Posted by Apache Jenkins Server <je...@builds.apache.org>.
See <https://builds.apache.org/job/Mesos-Buildbot/BUILDTOOL=cmake,COMPILER=gcc,CONFIGURATION=--verbose,ENVIRONMENT=GLOG_v=1%20MESOS_VERBOSE=1,OS=ubuntu%3A14.04,label_exp=(ubuntu)&&(!ubuntu-us1)&&(!ubuntu-eu2)/3850/display/redirect?page=changes>

Changes:

[vinodkone] Fixed parameters in JNI call for disconnected event.

[vinodkone] Logged operator API subscribed removal.

[bmahler] Fixed a regression in support/apply-reviews.py.

------------------------------------------
[...truncated 27.31 MB...]
I0629 10:47:06.949993 32474 http.cpp:1114] HTTP GET for /slave(766)/monitor/statistics.json from 172.17.0.5:52502
I0629 10:47:06.950105 32474 http.cpp:935] Authorizing principal 'test-principal' to GET the '/monitor/statistics.json' endpoint
I0629 10:47:06.954110 32459 slave.cpp:818] Agent terminating
[       OK ] Endpoint/SlaveEndpointTest.AuthorizedRequest/1 (36 ms)
[ RUN      ] Endpoint/SlaveEndpointTest.AuthorizedRequest/2
I0629 10:47:06.967778 32451 containerizer.cpp:230] Using isolation: posix/cpu,posix/mem,filesystem/posix,network/cni,environment_secret
W0629 10:47:06.968616 32451 backend.cpp:76] Failed to create 'aufs' backend: AufsBackend requires root privileges
W0629 10:47:06.968739 32451 backend.cpp:76] Failed to create 'bind' backend: BindBackend requires root privileges
I0629 10:47:06.968773 32451 provisioner.cpp:255] Using default backend 'copy'
I0629 10:47:06.973587 32454 slave.cpp:249] Mesos agent started on (767)@172.17.0.5:38643
I0629 10:47:06.973620 32454 slave.cpp:250] Flags at startup: --acls="" --appc_simple_discovery_uri_prefix="http://" --appc_store_dir="/tmp/Endpoint_SlaveEndpointTest_AuthorizedRequest_2_mHk3XP/store/appc" --authenticate_http_readonly="true" --authenticate_http_readwrite="true" --authenticatee="crammd5" --authentication_backoff_factor="1secs" --authorizer="local" --cgroups_cpu_enable_pids_and_tids_count="false" --cgroups_enable_cfs="false" --cgroups_hierarchy="/sys/fs/cgroup" --cgroups_limit_swap="false" --cgroups_root="mesos" --container_disk_watch_interval="15secs" --containerizers="mesos" --credential="/tmp/Endpoint_SlaveEndpointTest_AuthorizedRequest_2_mHk3XP/credential" --default_role="*" --disk_watch_interval="1mins" --docker="docker" --docker_kill_orphans="true" --docker_registry="https://registry-1.docker.io" --docker_remove_delay="6hrs" --docker_socket="/var/run/docker.sock" --docker_stop_timeout="0ns" --docker_store_dir="/tmp/Endpoint_SlaveEndpointTest_AuthorizedRequest_2_mHk3XP/store/docker" --docker_volume_checkpoint_dir="/var/run/mesos/isolators/docker/volume" --enforce_container_disk_quota="false" --executor_registration_timeout="1mins" --executor_reregistration_timeout="2secs" --executor_shutdown_grace_period="5secs" --fetcher_cache_dir="/tmp/Endpoint_SlaveEndpointTest_AuthorizedRequest_2_mHk3XP/fetch" --fetcher_cache_size="2GB" --frameworks_home="" --gc_delay="1weeks" --gc_disk_headroom="0.1" --hadoop_home="" --help="false" --hostname_lookup="true" --http_command_executor="false" --http_credentials="/tmp/Endpoint_SlaveEndpointTest_AuthorizedRequest_2_mHk3XP/http_credentials" --http_heartbeat_interval="30secs" --initialize_driver_logging="true" --isolation="posix/cpu,posix/mem" --launcher="posix" --launcher_dir="/mesos/build/src" --logbufsecs="0" --logging_level="INFO" --max_completed_executors_per_framework="150" --oversubscribed_resources_interval="15secs" --perf_duration="10secs" --perf_interval="1mins" --port="5051" --qos_correction_interval_min="0ns" --quiet="false" --recover="reconnect" --recovery_timeout="15mins" --registration_backoff_factor="10ms" --resources="cpus:2;gpus:0;mem:1024;disk:1024;ports:[31000-32000]" --revocable_cpu_low_priority="true" --runtime_dir="/tmp/Endpoint_SlaveEndpointTest_AuthorizedRequest_2_mHk3XP" --sandbox_directory="/mnt/mesos/sandbox" --strict="true" --switch_user="true" --systemd_enable_support="true" --systemd_runtime_directory="/run/systemd/system" --version="false" --work_dir="/tmp/Endpoint_SlaveEndpointTest_AuthorizedRequest_2_S8Nz7o"
I0629 10:47:06.974061 32454 credentials.hpp:86] Loading credential for authentication from '/tmp/Endpoint_SlaveEndpointTest_AuthorizedRequest_2_mHk3XP/credential'
I0629 10:47:06.974311 32454 slave.cpp:282] Agent using credential for: test-principal
I0629 10:47:06.974329 32454 credentials.hpp:37] Loading credentials for authentication from '/tmp/Endpoint_SlaveEndpointTest_AuthorizedRequest_2_mHk3XP/http_credentials'
I0629 10:47:06.974577 32454 http.cpp:974] Creating default 'basic' HTTP authenticator for realm 'mesos-agent-readonly'
I0629 10:47:06.974741 32454 http.cpp:974] Creating default 'basic' HTTP authenticator for realm 'mesos-agent-readwrite'
I0629 10:47:06.976436 32454 slave.cpp:553] Agent resources: [{"name":"cpus","scalar":{"value":2.0},"type":"SCALAR"},{"name":"mem","scalar":{"value":1024.0},"type":"SCALAR"},{"name":"disk","scalar":{"value":1024.0},"type":"SCALAR"},{"name":"ports","ranges":{"range":[{"begin":31000,"end":32000}]},"type":"RANGES"}]
I0629 10:47:06.976696 32454 slave.cpp:561] Agent attributes: [  ]
I0629 10:47:06.976711 32454 slave.cpp:566] Agent hostname: c448727d3818
I0629 10:47:06.976855 32453 status_update_manager.cpp:177] Pausing sending status updates
I0629 10:47:06.979193 32454 state.cpp:64] Recovering state from '/tmp/Endpoint_SlaveEndpointTest_AuthorizedRequest_2_S8Nz7o/meta'
I0629 10:47:06.979686 32462 status_update_manager.cpp:203] Recovering status update manager
I0629 10:47:06.979887 32468 containerizer.cpp:582] Recovering containerizer
I0629 10:47:06.981947 32468 provisioner.cpp:416] Provisioner recovery complete
I0629 10:47:06.982437 32460 slave.cpp:6168] Finished recovery
I0629 10:47:06.983150 32460 slave.cpp:6350] Querying resource estimator for oversubscribable resources
I0629 10:47:06.983459 32460 slave.cpp:6364] Received oversubscribable resources {} from the resource estimator
I0629 10:47:06.987331 32460 process.cpp:3779] Handling HTTP event for process 'slave(767)' with path: '/slave(767)/containers'
I0629 10:47:06.989397 32460 http.cpp:1114] HTTP GET for /slave(767)/containers from 172.17.0.5:52504
I0629 10:47:06.989502 32460 http.cpp:935] Authorizing principal 'test-principal' to GET the '/containers' endpoint
I0629 10:47:06.995723 32453 slave.cpp:818] Agent terminating
[       OK ] Endpoint/SlaveEndpointTest.AuthorizedRequest/2 (54 ms)
[ RUN      ] Endpoint/SlaveEndpointTest.UnauthorizedRequest/0
I0629 10:47:07.028805 32451 containerizer.cpp:230] Using isolation: posix/cpu,posix/mem,filesystem/posix,network/cni,environment_secret
W0629 10:47:07.029748 32451 backend.cpp:76] Failed to create 'aufs' backend: AufsBackend requires root privileges
W0629 10:47:07.029897 32451 backend.cpp:76] Failed to create 'bind' backend: BindBackend requires root privileges
I0629 10:47:07.029974 32451 provisioner.cpp:255] Using default backend 'copy'
I0629 10:47:07.034945 32472 slave.cpp:249] Mesos agent started on (768)@172.17.0.5:38643
I0629 10:47:07.034976 32472 slave.cpp:250] Flags at startup: --acls="" --appc_simple_discovery_uri_prefix="http://" --appc_store_dir="/tmp/Endpoint_SlaveEndpointTest_UnauthorizedRequest_0_f4p7Mz/store/appc" --authenticate_http_readonly="true" --authenticate_http_readwrite="true" --authenticatee="crammd5" --authentication_backoff_factor="1secs" --authorizer="local" --cgroups_cpu_enable_pids_and_tids_count="false" --cgroups_enable_cfs="false" --cgroups_hierarchy="/sys/fs/cgroup" --cgroups_limit_swap="false" --cgroups_root="mesos" --container_disk_watch_interval="15secs" --containerizers="mesos" --credential="/tmp/Endpoint_SlaveEndpointTest_UnauthorizedRequest_0_f4p7Mz/credential" --default_role="*" --disk_watch_interval="1mins" --docker="docker" --docker_kill_orphans="true" --docker_registry="https://registry-1.docker.io" --docker_remove_delay="6hrs" --docker_socket="/var/run/docker.sock" --docker_stop_timeout="0ns" --docker_store_dir="/tmp/Endpoint_SlaveEndpointTest_UnauthorizedRequest_0_f4p7Mz/store/docker" --docker_volume_checkpoint_dir="/var/run/mesos/isolators/docker/volume" --enforce_container_disk_quota="false" --executor_registration_timeout="1mins" --executor_reregistration_timeout="2secs" --executor_shutdown_grace_period="5secs" --fetcher_cache_dir="/tmp/Endpoint_SlaveEndpointTest_UnauthorizedRequest_0_f4p7Mz/fetch" --fetcher_cache_size="2GB" --frameworks_home="" --gc_delay="1weeks" --gc_disk_headroom="0.1" --hadoop_home="" --help="false" --hostname_lookup="true" --http_command_executor="false" --http_credentials="/tmp/Endpoint_SlaveEndpointTest_UnauthorizedRequest_0_f4p7Mz/http_credentials" --http_heartbeat_interval="30secs" --initialize_driver_logging="true" --isolation="posix/cpu,posix/mem" --launcher="posix" --launcher_dir="/mesos/build/src" --logbufsecs="0" --logging_level="INFO" --max_completed_executors_per_framework="150" --oversubscribed_resources_interval="15secs" --perf_duration="10secs" --perf_interval="1mins" --port="5051" --qos_correction_interval_min="0ns" --quiet="false" --recover="reconnect" --recovery_timeout="15mins" --registration_backoff_factor="10ms" --resources="cpus:2;gpus:0;mem:1024;disk:1024;ports:[31000-32000]" --revocable_cpu_low_priority="true" --runtime_dir="/tmp/Endpoint_SlaveEndpointTest_UnauthorizedRequest_0_f4p7Mz" --sandbox_directory="/mnt/mesos/sandbox" --strict="true" --switch_user="true" --systemd_enable_support="true" --systemd_runtime_directory="/run/systemd/system" --version="false" --work_dir="/tmp/Endpoint_SlaveEndpointTest_UnauthorizedRequest_0_qkgkO8"
I0629 10:47:07.035584 32472 credentials.hpp:86] Loading credential for authentication from '/tmp/Endpoint_SlaveEndpointTest_UnauthorizedRequest_0_f4p7Mz/credential'
I0629 10:47:07.035764 32472 slave.cpp:282] Agent using credential for: test-principal
I0629 10:47:07.035785 32472 credentials.hpp:37] Loading credentials for authentication from '/tmp/Endpoint_SlaveEndpointTest_UnauthorizedRequest_0_f4p7Mz/http_credentials'
I0629 10:47:07.036029 32472 http.cpp:974] Creating default 'basic' HTTP authenticator for realm 'mesos-agent-readonly'
I0629 10:47:07.036177 32472 http.cpp:974] Creating default 'basic' HTTP authenticator for realm 'mesos-agent-readwrite'
I0629 10:47:07.037948 32472 slave.cpp:553] Agent resources: [{"name":"cpus","scalar":{"value":2.0},"type":"SCALAR"},{"name":"mem","scalar":{"value":1024.0},"type":"SCALAR"},{"name":"disk","scalar":{"value":1024.0},"type":"SCALAR"},{"name":"ports","ranges":{"range":[{"begin":31000,"end":32000}]},"type":"RANGES"}]
I0629 10:47:07.038211 32472 slave.cpp:561] Agent attributes: [  ]
I0629 10:47:07.038225 32472 slave.cpp:566] Agent hostname: c448727d3818
I0629 10:47:07.038403 32456 status_update_manager.cpp:177] Pausing sending status updates
I0629 10:47:07.040238 32472 state.cpp:64] Recovering state from '/tmp/Endpoint_SlaveEndpointTest_UnauthorizedRequest_0_qkgkO8/meta'
I0629 10:47:07.043864 32475 status_update_manager.cpp:203] Recovering status update manager
I0629 10:47:07.044087 32456 containerizer.cpp:582] Recovering containerizer
I0629 10:47:07.046546 32456 provisioner.cpp:416] Provisioner recovery complete
I0629 10:47:07.047080 32461 slave.cpp:6168] Finished recovery
I0629 10:47:07.047706 32461 slave.cpp:6350] Querying resource estimator for oversubscribable resources
I0629 10:47:07.048053 32460 slave.cpp:6364] Received oversubscribable resources {} from the resource estimator
I0629 10:47:07.051316 32462 process.cpp:3779] Handling HTTP event for process 'slave(768)' with path: '/slave(768)/monitor/statistics'
I0629 10:47:07.052543 32453 http.cpp:1114] HTTP GET for /slave(768)/monitor/statistics from 172.17.0.5:52506
I0629 10:47:07.052630 32453 http.cpp:935] Authorizing principal 'test-principal' to GET the '/monitor/statistics' endpoint
I0629 10:47:07.054955 32472 slave.cpp:818] Agent terminating
[       OK ] Endpoint/SlaveEndpointTest.UnauthorizedRequest/0 (45 ms)
[ RUN      ] Endpoint/SlaveEndpointTest.UnauthorizedRequest/1
I0629 10:47:07.067023 32451 containerizer.cpp:230] Using isolation: posix/cpu,posix/mem,filesystem/posix,network/cni,environment_secret
W0629 10:47:07.067742 32451 backend.cpp:76] Failed to create 'aufs' backend: AufsBackend requires root privileges
W0629 10:47:07.067849 32451 backend.cpp:76] Failed to create 'bind' backend: BindBackend requires root privileges
I0629 10:47:07.067884 32451 provisioner.cpp:255] Using default backend 'copy'
I0629 10:47:07.071368 32469 slave.cpp:249] Mesos agent started on (769)@172.17.0.5:38643
I0629 10:47:07.071389 32469 slave.cpp:250] Flags at startup: --acls="" --appc_simple_discovery_uri_prefix="http://" --appc_store_dir="/tmp/Endpoint_SlaveEndpointTest_UnauthorizedRequest_1_Emtt5j/store/appc" --authenticate_http_readonly="true" --authenticate_http_readwrite="true" --authenticatee="crammd5" --authentication_backoff_factor="1secs" --authorizer="local" --cgroups_cpu_enable_pids_and_tids_count="false" --cgroups_enable_cfs="false" --cgroups_hierarchy="/sys/fs/cgroup" --cgroups_limit_swap="false" --cgroups_root="mesos" --container_disk_watch_interval="15secs" --containerizers="mesos" --credential="/tmp/Endpoint_SlaveEndpointTest_UnauthorizedRequest_1_Emtt5j/credential" --default_role="*" --disk_watch_interval="1mins" --docker="docker" --docker_kill_orphans="true" --docker_registry="https://registry-1.docker.io" --docker_remove_delay="6hrs" --docker_socket="/var/run/docker.sock" --docker_stop_timeout="0ns" --docker_store_dir="/tmp/Endpoint_SlaveEndpointTest_UnauthorizedRequest_1_Emtt5j/store/docker" --docker_volume_checkpoint_dir="/var/run/mesos/isolators/docker/volume" --enforce_container_disk_quota="false" --executor_registration_timeout="1mins" --executor_reregistration_timeout="2secs" --executor_shutdown_grace_period="5secs" --fetcher_cache_dir="/tmp/Endpoint_SlaveEndpointTest_UnauthorizedRequest_1_Emtt5j/fetch" --fetcher_cache_size="2GB" --frameworks_home="" --gc_delay="1weeks" --gc_disk_headroom="0.1" --hadoop_home="" --help="false" --hostname_lookup="true" --http_command_executor="false" --http_credentials="/tmp/Endpoint_SlaveEndpointTest_UnauthorizedRequest_1_Emtt5j/http_credentials" --http_heartbeat_interval="30secs" --initialize_driver_logging="true" --isolation="posix/cpu,posix/mem" --launcher="posix" --launcher_dir="/mesos/build/src" --logbufsecs="0" --logging_level="INFO" --max_completed_executors_per_framework="150" --oversubscribed_resources_interval="15secs" --perf_duration="10secs" --perf_interval="1mins" --port="5051" --qos_correction_interval_min="0ns" --quiet="false" --recover="reconnect" --recovery_timeout="15mins" --registration_backoff_factor="10ms" --resources="cpus:2;gpus:0;mem:1024;disk:1024;ports:[31000-32000]" --revocable_cpu_low_priority="true" --runtime_dir="/tmp/Endpoint_SlaveEndpointTest_UnauthorizedRequest_1_Emtt5j" --sandbox_directory="/mnt/mesos/sandbox" --strict="true" --switch_user="true" --systemd_enable_support="true" --systemd_runtime_directory="/run/systemd/system" --version="false" --work_dir="/tmp/Endpoint_SlaveEndpointTest_UnauthorizedRequest_1_Yz3b0S"
I0629 10:47:07.071763 32469 credentials.hpp:86] Loading credential for authentication from '/tmp/Endpoint_SlaveEndpointTest_UnauthorizedRequest_1_Emtt5j/credential'
I0629 10:47:07.071916 32469 slave.cpp:282] Agent using credential for: test-principal
I0629 10:47:07.071931 32469 credentials.hpp:37] Loading credentials for authentication from '/tmp/Endpoint_SlaveEndpointTest_UnauthorizedRequest_1_Emtt5j/http_credentials'
I0629 10:47:07.072119 32469 http.cpp:974] Creating default 'basic' HTTP authenticator for realm 'mesos-agent-readonly'
I0629 10:47:07.072268 32469 http.cpp:974] Creating default 'basic' HTTP authenticator for realm 'mesos-agent-readwrite'
I0629 10:47:07.073475 32469 slave.cpp:553] Agent resources: [{"name":"cpus","scalar":{"value":2.0},"type":"SCALAR"},{"name":"mem","scalar":{"value":1024.0},"type":"SCALAR"},{"name":"disk","scalar":{"value":1024.0},"type":"SCALAR"},{"name":"ports","ranges":{"range":[{"begin":31000,"end":32000}]},"type":"RANGES"}]
I0629 10:47:07.073657 32469 slave.cpp:561] Agent attributes: [  ]
I0629 10:47:07.073665 32469 slave.cpp:566] Agent hostname: c448727d3818
I0629 10:47:07.073791 32455 status_update_manager.cpp:177] Pausing sending status updates
I0629 10:47:07.075114 32456 state.cpp:64] Recovering state from '/tmp/Endpoint_SlaveEndpointTest_UnauthorizedRequest_1_Yz3b0S/meta'
I0629 10:47:07.075398 32461 status_update_manager.cpp:203] Recovering status update manager
I0629 10:47:07.075625 32456 containerizer.cpp:582] Recovering containerizer
I0629 10:47:07.076995 32454 provisioner.cpp:416] Provisioner recovery complete
I0629 10:47:07.077409 32469 slave.cpp:6168] Finished recovery
I0629 10:47:07.077961 32469 slave.cpp:6350] Querying resource estimator for oversubscribable resources
I0629 10:47:07.078207 32463 slave.cpp:6364] Received oversubscribable resources {} from the resource estimator
I0629 10:47:07.088963 32455 process.cpp:3779] Handling HTTP event for process 'slave(769)' with path: '/slave(769)/monitor/statistics.json'
I0629 10:47:07.090369 32472 http.cpp:1114] HTTP GET for /slave(769)/monitor/statistics.json from 172.17.0.5:52508
I0629 10:47:07.090461 32472 http.cpp:935] Authorizing principal 'test-principal' to GET the '/monitor/statistics.json' endpoint
I0629 10:47:07.093680 32470 slave.cpp:818] Agent terminating
[       OK ] Endpoint/SlaveEndpointTest.UnauthorizedRequest/1 (57 ms)
[ RUN      ] Endpoint/SlaveEndpointTest.UnauthorizedRequest/2
I0629 10:47:07.123770 32451 containerizer.cpp:230] Using isolation: posix/cpu,posix/mem,filesystem/posix,network/cni,environment_secret
W0629 10:47:07.124445 32451 backend.cpp:76] Failed to create 'aufs' backend: AufsBackend requires root privileges
W0629 10:47:07.124550 32451 backend.cpp:76] Failed to create 'bind' backend: BindBackend requires root privileges
I0629 10:47:07.124585 32451 provisioner.cpp:255] Using default backend 'copy'
I0629 10:47:07.135334 32471 slave.cpp:249] Mesos agent started on (770)@172.17.0.5:38643
I0629 10:47:07.135354 32471 slave.cpp:250] Flags at startup: --acls="" --appc_simple_discovery_uri_prefix="http://" --appc_store_dir="/tmp/Endpoint_SlaveEndpointTest_UnauthorizedRequest_2_42wSR4/store/appc" --authenticate_http_readonly="true" --authenticate_http_readwrite="true" --authenticatee="crammd5" --authentication_backoff_factor="1secs" --authorizer="local" --cgroups_cpu_enable_pids_and_tids_count="false" --cgroups_enable_cfs="false" --cgroups_hierarchy="/sys/fs/cgroup" --cgroups_limit_swap="false" --cgroups_root="mesos" --container_disk_watch_interval="15secs" --containerizers="mesos" --credential="/tmp/Endpoint_SlaveEndpointTest_UnauthorizedRequest_2_42wSR4/credential" --default_role="*" --disk_watch_interval="1mins" --docker="docker" --docker_kill_orphans="true" --docker_registry="https://registry-1.docker.io" --docker_remove_delay="6hrs" --docker_socket="/var/run/docker.sock" --docker_stop_timeout="0ns" --docker_store_dir="/tmp/Endpoint_SlaveEndpointTest_UnauthorizedRequest_2_42wSR4/store/docker" --docker_volume_checkpoint_dir="/var/run/mesos/isolators/docker/volume" --enforce_container_disk_quota="false" --executor_registration_timeout="1mins" --executor_reregistration_timeout="2secs" --executor_shutdown_grace_period="5secs" --fetcher_cache_dir="/tmp/Endpoint_SlaveEndpointTest_UnauthorizedRequest_2_42wSR4/fetch" --fetcher_cache_size="2GB" --frameworks_home="" --gc_delay="1weeks" --gc_disk_headroom="0.1" --hadoop_home="" --help="false" --hostname_lookup="true" --http_command_executor="false" --http_credentials="/tmp/Endpoint_SlaveEndpointTest_UnauthorizedRequest_2_42wSR4/http_credentials" --http_heartbeat_interval="30secs" --initialize_driver_logging="true" --isolation="posix/cpu,posix/mem" --launcher="posix" --launcher_dir="/mesos/build/src" --logbufsecs="0" --logging_level="INFO" --max_completed_executors_per_framework="150" --oversubscribed_resources_interval="15secs" --perf_duration="10secs" --perf_interval="1mins" --port="5051" --qos_correction_interval_min="0ns" --quiet="false" --recover="reconnect" --recovery_timeout="15mins" --registration_backoff_factor="10ms" --resources="cpus:2;gpus:0;mem:1024;disk:1024;ports:[31000-32000]" --revocable_cpu_low_priority="true" --runtime_dir="/tmp/Endpoint_SlaveEndpointTest_UnauthorizedRequest_2_42wSR4" --sandbox_directory="/mnt/mesos/sandbox" --strict="true" --switch_user="true" --systemd_enable_support="true" --systemd_runtime_directory="/run/systemd/system" --version="false" --work_dir="/tmp/Endpoint_SlaveEndpointTest_UnauthorizedRequest_2_R2U5DD"
I0629 10:47:07.135839 32471 credentials.hpp:86] Loading credential for authentication from '/tmp/Endpoint_SlaveEndpointTest_UnauthorizedRequest_2_42wSR4/credential'
I0629 10:47:07.136029 32471 slave.cpp:282] Agent using credential for: test-principal
I0629 10:47:07.136046 32471 credentials.hpp:37] Loading credentials for authentication from '/tmp/Endpoint_SlaveEndpointTest_UnauthorizedRequest_2_42wSR4/http_credentials'
I0629 10:47:07.136289 32471 http.cpp:974] Creating default 'basic' HTTP authenticator for realm 'mesos-agent-readonly'
I0629 10:47:07.136490 32471 http.cpp:974] Creating default 'basic' HTTP authenticator for realm 'mesos-agent-readwrite'
I0629 10:47:07.138212 32471 slave.cpp:553] Agent resources: [{"name":"cpus","scalar":{"value":2.0},"type":"SCALAR"},{"name":"mem","scalar":{"value":1024.0},"type":"SCALAR"},{"name":"disk","scalar":{"value":1024.0},"type":"SCALAR"},{"name":"ports","ranges":{"range":[{"begin":31000,"end":32000}]},"type":"RANGES"}]
I0629 10:47:07.138458 32471 slave.cpp:561] Agent attributes: [  ]
I0629 10:47:07.138471 32471 slave.cpp:566] Agent hostname: c448727d3818
I0629 10:47:07.138603 32463 status_update_manager.cpp:177] Pausing sending status updates
I0629 10:47:07.140111 32463 state.cpp:64] Recovering state from '/tmp/Endpoint_SlaveEndpointTest_UnauthorizedRequest_2_R2U5DD/meta'
I0629 10:47:07.140470 32469 status_update_manager.cpp:203] Recovering status update manager
I0629 10:47:07.140677 32472 containerizer.cpp:582] Recovering containerizer
I0629 10:47:07.142066 32461 provisioner.cpp:416] Provisioner recovery complete
I0629 10:47:07.142416 32452 slave.cpp:6168] Finished recovery
I0629 10:47:07.143025 32452 slave.cpp:6350] Querying resource estimator for oversubscribable resources
I0629 10:47:07.143395 32473 slave.cpp:6364] Received oversubscribable resources {} from the resource estimator
I0629 10:47:07.146875 32475 process.cpp:3779] Handling HTTP event for process 'slave(770)' with path: '/slave(770)/containers'
I0629 10:47:07.148241 32470 http.cpp:1114] HTTP GET for /slave(770)/containers from 172.17.0.5:52510
I0629 10:47:07.148340 32470 http.cpp:935] Authorizing principal 'test-principal' to GET the '/containers' endpoint
I0629 10:47:07.150872 32475 slave.cpp:818] Agent terminating
[       OK ] Endpoint/SlaveEndpointTest.UnauthorizedRequest/2 (39 ms)
[ RUN      ] Endpoint/SlaveEndpointTest.NoAuthorizer/0
I0629 10:47:07.161479 32451 containerizer.cpp:230] Using isolation: posix/cpu,posix/mem,filesystem/posix,network/cni,environment_secret
W0629 10:47:07.161976 32451 backend.cpp:76] Failed to create 'aufs' backend: AufsBackend requires root privileges
W0629 10:47:07.162063 32451 backend.cpp:76] Failed to create 'bind' backend: BindBackend requires root privileges
I0629 10:47:07.162092 32451 provisioner.cpp:255] Using default backend 'copy'
I0629 10:47:07.163781 32451 cluster.cpp:448] Creating default 'local' authorizer
I0629 10:47:07.165241 32475 slave.cpp:249] Mesos agent started on (771)@172.17.0.5:38643
I0629 10:47:07.165257 32475 slave.cpp:250] Flags at startup: --acls="" --appc_simple_discovery_uri_prefix="http://" --appc_store_dir="/tmp/Endpoint_SlaveEndpointTest_NoAuthorizer_0_E1o44P/store/appc" --authenticate_http_readonly="true" --authenticate_http_readwrite="true" --authenticatee="crammd5" --authentication_backoff_factor="1secs" --authorizer="local" --cgroups_cpu_enable_pids_and_tids_count="false" --cgroups_enable_cfs="false" --cgroups_hierarchy="/sys/fs/cgroup" --cgroups_limit_swap="false" --cgroups_root="mesos" --container_disk_watch_interval="15secs" --containerizers="mesos" --credential="/tmp/Endpoint_SlaveEndpointTest_NoAuthorizer_0_E1o44P/credential" --default_role="*" --disk_watch_interval="1mins" --docker="docker" --docker_kill_orphans="true" --docker_registry="https://registry-1.docker.io" --docker_remove_delay="6hrs" --docker_socket="/var/run/docker.sock" --docker_stop_timeout="0ns" --docker_store_dir="/tmp/Endpoint_SlaveEndpointTest_NoAuthorizer_0_E1o44P/store/docker" --docker_volume_checkpoint_dir="/var/run/mesos/isolators/docker/volume" --enforce_container_disk_quota="false" --executor_registration_timeout="1mins" --executor_reregistration_timeout="2secs" --executor_shutdown_grace_period="5secs" --fetcher_cache_dir="/tmp/Endpoint_SlaveEndpointTest_NoAuthorizer_0_E1o44P/fetch" --fetcher_cache_size="2GB" --frameworks_home="" --gc_delay="1weeks" --gc_disk_headroom="0.1" --hadoop_home="" --help="false" --hostname_lookup="true" --http_command_executor="false" --http_credentials="/tmp/Endpoint_SlaveEndpointTest_NoAuthorizer_0_E1o44P/http_credentials" --http_heartbeat_interval="30secs" --initialize_driver_logging="true" --isolation="posix/cpu,posix/mem" --launcher="posix" --launcher_dir="/mesos/build/src" --logbufsecs="0" --logging_level="INFO" --max_completed_executors_per_framework="150" --oversubscribed_resources_interval="15secs" --perf_duration="10secs" --perf_interval="1mins" --port="5051" --qos_correction_interval_min="0ns" --quiet="false" --recover="reconnect" --recovery_timeout="15mins" --registration_backoff_factor="10ms" --resources="cpus:2;gpus:0;mem:1024;disk:1024;ports:[31000-32000]" --revocable_cpu_low_priority="true" --runtime_dir="/tmp/Endpoint_SlaveEndpointTest_NoAuthorizer_0_E1o44P" --sandbox_directory="/mnt/mesos/sandbox" --strict="true" --switch_user="true" --systemd_enable_support="true" --systemd_runtime_directory="/run/systemd/system" --version="false" --work_dir="/tmp/Endpoint_SlaveEndpointTest_NoAuthorizer_0_ZuUBLo"
I0629 10:47:07.165633 32475 credentials.hpp:86] Loading credential for authentication from '/tmp/Endpoint_SlaveEndpointTest_NoAuthorizer_0_E1o44P/credential'
I0629 10:47:07.165805 32475 slave.cpp:282] Agent using credential for: test-principal
I0629 10:47:07.165820 32475 credentials.hpp:37] Loading credentials for authentication from '/tmp/Endpoint_SlaveEndpointTest_NoAuthorizer_0_E1o44P/http_credentials'
I0629 10:47:07.166021 32475 http.cpp:974] Creating default 'basic' HTTP authenticator for realm 'mesos-agent-readonly'
I0629 10:47:07.166177 32475 http.cpp:974] Creating default 'basic' HTTP authenticator for realm 'mesos-agent-readwrite'
I0629 10:47:07.167385 32475 slave.cpp:553] Agent resources: [{"name":"cpus","scalar":{"value":2.0},"type":"SCALAR"},{"name":"mem","scalar":{"value":1024.0},"type":"SCALAR"},{"name":"disk","scalar":{"value":1024.0},"type":"SCALAR"},{"name":"ports","ranges":{"range":[{"begin":31000,"end":32000}]},"type":"RANGES"}]
I0629 10:47:07.167611 32475 slave.cpp:561] Agent attributes: [  ]
I0629 10:47:07.167623 32475 slave.cpp:566] Agent hostname: c448727d3818
I0629 10:47:07.167755 32460 status_update_manager.cpp:177] Pausing sending status updates
I0629 10:47:07.169200 32464 state.cpp:64] Recovering state from '/tmp/Endpoint_SlaveEndpointTest_NoAuthorizer_0_ZuUBLo/meta'
I0629 10:47:07.169576 32462 status_update_manager.cpp:203] Recovering status update manager
I0629 10:47:07.169755 32470 containerizer.cpp:582] Recovering containerizer
I0629 10:47:07.171244 32473 provisioner.cpp:416] Provisioner recovery complete
I0629 10:47:07.171594 32458 slave.cpp:6168] Finished recovery
I0629 10:47:07.172168 32458 slave.cpp:6350] Querying resource estimator for oversubscribable resources
I0629 10:47:07.172426 32469 slave.cpp:6364] Received oversubscribable resources {} from the resource estimator
I0629 10:47:07.176336 32471 process.cpp:3779] Handling HTTP event for process 'slave(771)' with path: '/slave(771)/monitor/statistics'
I0629 10:47:07.178025 32471 http.cpp:1114] HTTP GET for /slave(771)/monitor/statistics from 172.17.0.5:52512
I0629 10:47:07.178118 32471 http.cpp:935] Authorizing principal 'test-principal' to GET the '/monitor/statistics' endpoint
I0629 10:47:07.183229 32455 slave.cpp:818] Agent terminating
[       OK ] Endpoint/SlaveEndpointTest.NoAuthorizer/0 (33 ms)
[ RUN      ] Endpoint/SlaveEndpointTest.NoAuthorizer/1
I0629 10:47:07.195554 32451 containerizer.cpp:230] Using isolation: posix/cpu,posix/mem,filesystem/posix,network/cni,environment_secret
W0629 10:47:07.196239 32451 backend.cpp:76] Failed to create 'aufs' backend: AufsBackend requires root privileges
W0629 10:47:07.196342 32451 backend.cpp:76] Failed to create 'bind' backend: BindBackend requires root privileges
I0629 10:47:07.196377 32451 provisioner.cpp:255] Using default backend 'copy'
I0629 10:47:07.198271 32451 cluster.cpp:448] Creating default 'local' authorizer
I0629 10:47:07.200055 32456 slave.cpp:249] Mesos agent started on (772)@172.17.0.5:38643
I0629 10:47:07.200078 32456 slave.cpp:250] Flags at startup: --acls="" --appc_simple_discovery_uri_prefix="http://" --appc_store_dir="/tmp/Endpoint_SlaveEndpointTest_NoAuthorizer_1_S6ewBB/store/appc" --authenticate_http_readonly="true" --authenticate_http_readwrite="true" --authenticatee="crammd5" --authentication_backoff_factor="1secs" --authorizer="local" --cgroups_cpu_enable_pids_and_tids_count="false" --cgroups_enable_cfs="false" --cgroups_hierarchy="/sys/fs/cgroup" --cgroups_limit_swap="false" --cgroups_root="mesos" --container_disk_watch_interval="15secs" --containerizers="mesos" --credential="/tmp/Endpoint_SlaveEndpointTest_NoAuthorizer_1_S6ewBB/credential" --default_role="*" --disk_watch_interval="1mins" --docker="docker" --docker_kill_orphans="true" --docker_registry="https://registry-1.docker.io" --docker_remove_delay="6hrs" --docker_socket="/var/run/docker.sock" --docker_stop_timeout="0ns" --docker_store_dir="/tmp/Endpoint_SlaveEndpointTest_NoAuthorizer_1_S6ewBB/store/docker" --docker_volume_checkpoint_dir="/var/run/mesos/isolators/docker/volume" --enforce_container_disk_quota="false" --executor_registration_timeout="1mins" --executor_reregistration_timeout="2secs" --executor_shutdown_grace_period="5secs" --fetcher_cache_dir="/tmp/Endpoint_SlaveEndpointTest_NoAuthorizer_1_S6ewBB/fetch" --fetcher_cache_size="2GB" --frameworks_home="" --gc_delay="1weeks" --gc_disk_headroom="0.1" --hadoop_home="" --help="false" --hostname_lookup="true" --http_command_executor="false" --http_credentials="/tmp/Endpoint_SlaveEndpointTest_NoAuthorizer_1_S6ewBB/http_credentials" --http_heartbeat_interval="30secs" --initialize_driver_logging="true" --isolation="posix/cpu,posix/mem" --launcher="posix" --launcher_dir="/mesos/build/src" --logbufsecs="0" --logging_level="INFO" --max_completed_executors_per_framework="150" --oversubscribed_resources_interval="15secs" --perf_duration="10secs" --perf_interval="1mins" --port="5051" --qos_correction_interval_min="0ns" --quiet="false" --recover="reconnect" --recovery_timeout="15mins" --registration_backoff_factor="10ms" --resources="cpus:2;gpus:0;mem:1024;disk:1024;ports:[31000-32000]" --revocable_cpu_low_priority="true" --runtime_dir="/tmp/Endpoint_SlaveEndpointTest_NoAuthorizer_1_S6ewBB" --sandbox_directory="/mnt/mesos/sandbox" --strict="true" --switch_user="true" --systemd_enable_support="true" --systemd_runtime_directory="/run/systemd/system" --version="false" --work_dir="/tmp/Endpoint_SlaveEndpointTest_NoAuthorizer_1_79T3ca"
I0629 10:47:07.200611 32456 credentials.hpp:86] Loading credential for authentication from '/tmp/Endpoint_SlaveEndpointTest_NoAuthorizer_1_S6ewBB/credential'
I0629 10:47:07.200812 32456 slave.cpp:282] Agent using credential for: test-principal
I0629 10:47:07.200829 32456 credentials.hpp:37] Loading credentials for authentication from '/tmp/Endpoint_SlaveEndpointTest_NoAuthorizer_1_S6ewBB/http_credentials'
I0629 10:47:07.201072 32456 http.cpp:974] Creating default 'basic' HTTP authenticator for realm 'mesos-agent-readonly'
I0629 10:47:07.201252 32456 http.cpp:974] Creating default 'basic' HTTP authenticator for realm 'mesos-agent-readwrite'
I0629 10:47:07.202785 32456 slave.cpp:553] Agent resources: [{"name":"cpus","scalar":{"value":2.0},"type":"SCALAR"},{"name":"mem","scalar":{"value":1024.0},"type":"SCALAR"},{"name":"disk","scalar":{"value":1024.0},"type":"SCALAR"},{"name":"ports","ranges":{"range":[{"begin":31000,"end":32000}]},"type":"RANGES"}]
I0629 10:47:07.203022 32456 slave.cpp:561] Agent attributes: [  ]
I0629 10:47:07.203035 32456 slave.cpp:566] Agent hostname: c448727d3818
I0629 10:47:07.203189 32466 status_update_manager.cpp:177] Pausing sending status updates
I0629 10:47:07.204571 32465 state.cpp:64] Recovering state from '/tmp/Endpoint_SlaveEndpointTest_NoAuthorizer_1_79T3ca/meta'
I0629 10:47:07.204979 32460 status_update_manager.cpp:203] Recovering status update manager
I0629 10:47:07.205143 32458 containerizer.cpp:582] Recovering containerizer
I0629 10:47:07.206641 32475 provisioner.cpp:416] Provisioner recovery complete
I0629 10:47:07.206959 32470 slave.cpp:6168] Finished recovery
I0629 10:47:07.207482 32470 slave.cpp:6350] Querying resource estimator for oversubscribable resources
I0629 10:47:07.207753 32454 slave.cpp:6364] Received oversubscribable resources {} from the resource estimator
I0629 10:47:07.210619 32454 process.cpp:3779] Handling HTTP event for process 'slave(772)' with path: '/slave(772)/monitor/statistics.json'
I0629 10:47:07.212226 32454 http.cpp:1114] HTTP GET for /slave(772)/monitor/statistics.json from 172.17.0.5:52514
I0629 10:47:07.212302 32454 http.cpp:935] Authorizing principal 'test-principal' to GET the '/monitor/statistics.json' endpoint
I0629 10:47:07.217012 32454 slave.cpp:818] Agent terminating
[       OK ] Endpoint/SlaveEndpointTest.NoAuthorizer/1 (39 ms)
[ RUN      ] Endpoint/SlaveEndpointTest.NoAuthorizer/2
I0629 10:47:07.234604 32451 containerizer.cpp:230] Using isolation: posix/cpu,posix/mem,filesystem/posix,network/cni,environment_secret
W0629 10:47:07.235260 32451 backend.cpp:76] Failed to create 'aufs' backend: AufsBackend requires root privileges
W0629 10:47:07.235357 32451 backend.cpp:76] Failed to create 'bind' backend: BindBackend requires root privileges
I0629 10:47:07.235385 32451 provisioner.cpp:255] Using default backend 'copy'
I0629 10:47:07.237172 32451 cluster.cpp:448] Creating default 'local' authorizer
I0629 10:47:07.238834 32462 slave.cpp:249] Mesos agent started on (773)@172.17.0.5:38643
I0629 10:47:07.238848 32462 slave.cpp:250] Flags at startup: --acls="" --appc_simple_discovery_uri_prefix="http://" --appc_store_dir="/tmp/Endpoint_SlaveEndpointTest_NoAuthorizer_2_eGMIun/store/appc" --authenticate_http_readonly="true" --authenticate_http_readwrite="true" --authenticatee="crammd5" --authentication_backoff_factor="1secs" --authorizer="local" --cgroups_cpu_enable_pids_and_tids_count="false" --cgroups_enable_cfs="false" --cgroups_hierarchy="/sys/fs/cgroup" --cgroups_limit_swap="false" --cgroups_root="mesos" --container_disk_watch_interval="15secs" --containerizers="mesos" --credential="/tmp/Endpoint_SlaveEndpointTest_NoAuthorizer_2_eGMIun/credential" --default_role="*" --disk_watch_interval="1mins" --docker="docker" --docker_kill_orphans="true" --docker_registry="https://registry-1.docker.io" --docker_remove_delay="6hrs" --docker_socket="/var/run/docker.sock" --docker_stop_timeout="0ns" --docker_store_dir="/tmp/Endpoint_SlaveEndpointTest_NoAuthorizer_2_eGMIun/store/docker" --docker_volume_checkpoint_dir="/var/run/mesos/isolators/docker/volume" --enforce_container_disk_quota="false" --executor_registration_timeout="1mins" --executor_reregistration_timeout="2secs" --executor_shutdown_grace_period="5secs" --fetcher_cache_dir="/tmp/Endpoint_SlaveEndpointTest_NoAuthorizer_2_eGMIun/fetch" --fetcher_cache_size="2GB" --frameworks_home="" --gc_delay="1weeks" --gc_disk_headroom="0.1" --hadoop_home="" --help="false" --hostname_lookup="true" --http_command_executor="false" --http_credentials="/tmp/Endpoint_SlaveEndpointTest_NoAuthorizer_2_eGMIun/http_credentials" --http_heartbeat_interval="30secs" --initialize_driver_logging="true" --isolation="posix/cpu,posix/mem" --launcher="posix" --launcher_dir="/mesos/build/src" --logbufsecs="0" --logging_level="INFO" --max_completed_executors_per_framework="150" --oversubscribed_resources_interval="15secs" --perf_duration="10secs" --perf_interval="1mins" --port="5051" --qos_correction_interval_min="0ns" --quiet="false" --recover="reconnect" --recovery_timeout="15mins" --registration_backoff_factor="10ms" --resources="cpus:2;gpus:0;mem:1024;disk:1024;ports:[31000-32000]" --revocable_cpu_low_priority="true" --runtime_dir="/tmp/Endpoint_SlaveEndpointTest_NoAuthorizer_2_eGMIun" --sandbox_directory="/mnt/mesos/sandbox" --strict="true" --switch_user="true" --systemd_enable_support="true" --systemd_runtime_directory="/run/systemd/system" --version="false" --work_dir="/tmp/Endpoint_SlaveEndpointTest_NoAuthorizer_2_NKor0V"
I0629 10:47:07.239251 32462 credentials.hpp:86] Loading credential for authentication from '/tmp/Endpoint_SlaveEndpointTest_NoAuthorizer_2_eGMIun/credential'
I0629 10:47:07.239399 32462 slave.cpp:282] Agent using credential for: test-principal
I0629 10:47:07.239416 32462 credentials.hpp:37] Loading credentials for authentication from '/tmp/Endpoint_SlaveEndpointTest_NoAuthorizer_2_eGMIun/http_credentials'
I0629 10:47:07.239656 32462 http.cpp:974] Creating default 'basic' HTTP authenticator for realm 'mesos-agent-readonly'
I0629 10:47:07.239809 32462 http.cpp:974] Creating default 'basic' HTTP authenticator for realm 'mesos-agent-readwrite'
I0629 10:47:07.241354 32462 slave.cpp:553] Agent resources: [{"name":"cpus","scalar":{"value":2.0},"type":"SCALAR"},{"name":"mem","scalar":{"value":1024.0},"type":"SCALAR"},{"name":"disk","scalar":{"value":1024.0},"type":"SCALAR"},{"name":"ports","ranges":{"range":[{"begin":31000,"end":32000}]},"type":"RANGES"}]
I0629 10:47:07.241582 32462 slave.cpp:561] Agent attributes: [  ]
I0629 10:47:07.241595 32462 slave.cpp:566] Agent hostname: c448727d3818
I0629 10:47:07.243227 32462 status_update_manager.cpp:177] Pausing sending status updates
I0629 10:47:07.243891 32462 state.cpp:64] Recovering state from '/tmp/Endpoint_SlaveEndpointTest_NoAuthorizer_2_NKor0V/meta'
I0629 10:47:07.244326 32462 status_update_manager.cpp:203] Recovering status update manager
I0629 10:47:07.244483 32462 containerizer.cpp:582] Recovering containerizer
I0629 10:47:07.246351 32462 provisioner.cpp:416] Provisioner recovery complete
I0629 10:47:07.246835 32462 slave.cpp:6168] Finished recovery
I0629 10:47:07.247306 32462 slave.cpp:6350] Querying resource estimator for oversubscribable resources
I0629 10:47:07.247891 32462 slave.cpp:6364] Received oversubscribable resources {} from the resource estimator
I0629 10:47:07.251437 32473 process.cpp:3779] Handling HTTP event for process 'slave(773)' with path: '/slave(773)/containers'
I0629 10:47:07.253114 32473 http.cpp:1114] HTTP GET for /slave(773)/containers from 172.17.0.5:52516
I0629 10:47:07.253202 32473 http.cpp:935] Authorizing principal 'test-principal' to GET the '/containers' endpoint
I0629 10:47:07.256909 32463 slave.cpp:818] Agent terminating
[       OK ] Endpoint/SlaveEndpointTest.NoAuthorizer/2 (34 ms)
[----------] 9 tests from Endpoint/SlaveEndpointTest (368 ms total)

[----------] Global test environment tear-down
[==========] 1571 tests from 171 test cases ran. (295952 ms total)
[  PASSED  ] 1570 tests.
[  FAILED  ] 1 test, listed below:
[  FAILED  ] PersistentVolumeEndpointsTest.ReserveAndSlaveRemoval

 1 FAILED TEST
  YOU HAVE 20 DISABLED TESTS

I0629 10:47:07.353837 32476 process.cpp:968] Failed to accept socket: future discarded
make[3]: *** [CMakeFiles/check] Error 1
make[3]: Leaving directory `/mesos/build'
make[2]: *** [CMakeFiles/check.dir/all] Error 2
make[2]: Leaving directory `/mesos/build'
make[1]: *** [CMakeFiles/check.dir/rule] Error 2
make[1]: Leaving directory `/mesos/build'
make: *** [check] Error 2
+ docker rmi mesos-1498730153-31687
Untagged: mesos-1498730153-31687:latest
Deleted: sha256:12a66ea3cfe3aeeb2236e84b40adf100ed9333d16822c09ca103936929e466c3
Deleted: sha256:b6427fa5f3cbb58639af260ef7e7ba2372a325c8737ee172aac0c038519e5ffe
Deleted: sha256:d890803786d9569378dc08565896ff691b8c8eda103172a82c86500ce90e2b6d
Deleted: sha256:9cd0e7c601dca127d5c08800d569ec5fa9d2c723aa2869244b4e13bfe4f8e9ef
Deleted: sha256:b68e2e981d15ef17333d4097ecd52e0743076f6deb0653f10825bf4b9db95ef4
Deleted: sha256:d1abdd828a3b88b3f4252abbb8f8cfa95ba3080b4e8e11d62225d30372bae030
Deleted: sha256:f873b8f89e089c52ad65d274d1b72735b41828b7196ef54b2d5b3b24396aa6de
Deleted: sha256:322b766073160d2e29f2fdb6e7ea93d0da6095dcefd97b9e640e32f29cefebcb
Deleted: sha256:683725174aa23ac36c9cd64faa013a1813b229487d6e26993430e3876d5c7102
Deleted: sha256:b542c2e65eda15d388825611e6a10753b356b04bb2a5b3f0beb377e4ebb06bcd
Deleted: sha256:95a640177e8b0823d75035da2083a4dfc75af2f7e51ed674ef2c3b5e10308bd8
Deleted: sha256:f5515bdc7bbbb4a86b7d7b820d02348362b9f34838aa28f951e60dc69ce70b94
Deleted: sha256:8b807353a02a3e5ae6cef10bcbd9985866fd042fff41f9615d380de3bbb55822
Deleted: sha256:96cedd669a4e294619d051bca7931e1ef1dececbb0f92636aa63802296a50c0b
Deleted: sha256:5fc9de7a7c85f51771f55ea68361a0b554ffba030d32f08b6bf2fde8f0d12e81
Deleted: sha256:1082e0f73ce0b2e29ea2d6ac3283e0176ea0e244015839c140118c415210304d
Deleted: sha256:9eef6eda565fe2782ff53bd7fe65cca808caa17e93d1a8d934c31b71b6b8ab79
Deleted: sha256:1381448756b088dbce177d483de814ad1219189a5afc18931ac1b5df9cafa2b0
Deleted: sha256:6cb001b48edc8db4dc155b0b5544addc427f1af031bb3bc75787f60450f1c1f7
Deleted: sha256:f8cea3591960d008d733a5761d7837ea56dff56c0d8e5d3145b64b8bc18a55af
Deleted: sha256:8eecae85f4d2a9e8fd6700054e256984dcfcbcd21ba32f2c785e3150d08ca60e
Deleted: sha256:42415d173852e3f362a423c1164c0304011e349b98448a6f1d74fb22f0d7cb3f
Deleted: sha256:321aa3b866444252e2f7ee018e2c52478c3f70473163241b48c89df6059936a2
Deleted: sha256:b41a1d3d56230c193a69443f160c5228cf522e5bc2e8166b7aec9b90dbfd3b4e
Build step 'Execute shell' marked build as failure