You are viewing a plain text version of this content. The canonical link for it is here.
Posted to builds@cassandra.apache.org by Apache Jenkins Server <je...@builds.apache.org> on 2024/11/19 02:36:46 UTC

Build complete: Cassandra-4.1 #533 [UNSTABLE] 364b641abc8d35469885b2a18a9fea22f12b37de

-------------------------------------------------------------------------------
Build Cassandra-4.1 #533 Still unstable
URL: https://ci-cassandra.apache.org/job/Cassandra-4.1/533/
-------------------------------------------------------------------------------
Changes:
[Berenguer Blasi] CASSANDRA-19986 Prepared statements cache computation improvements

[Michael Semb Wever] Add nodetool checktokenmetadata command that checks TokenMetadata is

[Stefan Miklosovic] Fix CQL in snapshot's schema which did not contained UDTs used as

[Stefan Miklosovic] Support UDTs and vectors as clustering keys in descending order

[Stefan Miklosovic] Backport of CASSANDRA-17812: Rate-limit new client connection auth setup

[Berenguer Blasi] Flaky PstmtPersistenceTest

[Brandon Williams] Log client address when detecting unknown exception in client networking

[Brandon Williams] Log client address when detecting unknown exception in client networking

[Brandon Williams] Update RMI object marshalling restrictions

[Brandon Williams] Prepare debian changelog for 4.0.15

[Brandon Williams] Prepare debian changelog for 4.1.8

[Stefan Miklosovic] Change the resolution of AbstractCommitLogService#lastSyncedAt to nanos

[Berenguer Blasi] Flaky PstmtPersistenceTest take 2


-------------------------------------------------------------------------------
Failed Tests:
6 tests failed.
FAILED:  dtest-large-novnode.replace_address_test.TestReplaceAddress.test_restart_failed_replace
FAILED:  dtest-large-novnode.replace_address_test.TestReplaceAddress.test_restart_failed_replace_with_reset_resume_state
FAILED:  dtest-large.repair_tests.repair_test.TestRepairDataSystemTable.test_repair_parent_table
FAILED:  dtest-novnode.auth_test.TestAuthRoles.test_superuser_status_is_inherited
FAILED:  dtest-offheap.cqlsh_tests.test_cqlsh.TestCqlshSmoke.test_delete
FAILED:  org.apache.cassandra.net.ProxyHandlerConnectionsTest.suddenDisconnect-compression

-------------------------------------------------------------------------------
For complete test report and logs see https://nightlies.apache.org/cassandra/Cassandra-4.1/533/