You are viewing a plain text version of this content. The canonical link for it is here.
Posted to dev@poi.apache.org by Apache Jenkins Server <je...@builds.apache.org> on 2021/08/26 00:39:22 UTC

Build failed in Jenkins: POI » POI-DSL-1.16 #454

See <https://ci-builds.apache.org/job/POI/job/POI-DSL-1.16/454/display/redirect?page=changes>

Changes:

[Andreas Beeker] try to fix spotbugs publisher entry


------------------------------------------
[...truncated 43.04 KB...]
> Task :poi-ooxml:compileTestJava
<https://ci-builds.apache.org/job/POI/job/POI-DSL-1.16/ws/poi-ooxml/src/test/java/org/apache/poi/poifs/crypt/dsig/TestSignatureInfo.java>:871: warning: [deprecation] getSubjectDN() in X509Certificate has been deprecated
                assertEquals("CN=Muj Klic", result.get(0).getSubjectDN().toString());
                                                         ^
<https://ci-builds.apache.org/job/POI/job/POI-DSL-1.16/ws/poi-ooxml/src/test/java/org/apache/poi/poifs/crypt/dsig/TestSignatureInfo.java>:872: warning: [deprecation] getSubjectDN() in X509Certificate has been deprecated
                assertEquals("CN=My Second key", result.get(1).getSubjectDN().toString());
                                                              ^
<https://ci-builds.apache.org/job/POI/job/POI-DSL-1.16/ws/poi-ooxml/src/test/java/org/apache/poi/poifs/crypt/dsig/TestSignatureInfo.java>:875: warning: [deprecation] getSubjectDN() in X509Certificate has been deprecated
                assertEquals("CN=My Second key", result.get(0).getSubjectDN().toString());
                                                              ^
<https://ci-builds.apache.org/job/POI/job/POI-DSL-1.16/ws/poi-ooxml/src/test/java/org/apache/poi/poifs/crypt/dsig/TestSignatureInfo.java>:914: warning: [deprecation] getSubjectDN() in X509Certificate has been deprecated
        assertEquals("CN=Test", certs.get(0).getSubjectDN().getName());
                                            ^
<https://ci-builds.apache.org/job/POI/job/POI-DSL-1.16/ws/poi-ooxml/src/test/java/org/apache/poi/xddf/usermodel/chart/TestXDDFChartRemoveSeries.java>:129: warning: [deprecation] getSeries() in XDDFChartData has been deprecated
        assertThrows(UnsupportedOperationException.class, () -> chartData.getSeries().remove(0));
                                                                         ^
<https://ci-builds.apache.org/job/POI/job/POI-DSL-1.16/ws/poi-ooxml/src/test/java/org/apache/poi/xwpf/usermodel/TestXWPFRun.java>:203: warning: [deprecation] getFontSize() in XWPFRun has been deprecated
        assertEquals(7, run.getFontSize());
                           ^
<https://ci-builds.apache.org/job/POI/job/POI-DSL-1.16/ws/poi-ooxml/src/test/java/org/apache/poi/xwpf/usermodel/TestXWPFRun.java>:211: warning: [deprecation] getFontSize() in XWPFRun has been deprecated
        assertEquals(25, run.getFontSize());
                            ^
<https://ci-builds.apache.org/job/POI/job/POI-DSL-1.16/ws/poi-ooxml/src/test/java/org/apache/poi/xwpf/usermodel/TestXWPFRun.java>:589: warning: [deprecation] getFontSize() in XWPFRun has been deprecated
            assertEquals(-1, run.getFontSize());
                                ^
<https://ci-builds.apache.org/job/POI/job/POI-DSL-1.16/ws/poi-ooxml/src/test/java/org/apache/poi/xwpf/usermodel/TestXWPFRun.java>:592: warning: [deprecation] getFontSize() in XWPFRun has been deprecated
            assertEquals(10, run.getFontSize());
                                ^
<https://ci-builds.apache.org/job/POI/job/POI-DSL-1.16/ws/poi-ooxml/src/test/java/org/apache/poi/xwpf/usermodel/TestXWPFRun.java>:595: warning: [deprecation] getFontSize() in XWPFRun has been deprecated
            assertEquals(Short.MAX_VALUE - 1, run.getFontSize());
                                                 ^
<https://ci-builds.apache.org/job/POI/job/POI-DSL-1.16/ws/poi-ooxml/src/test/java/org/apache/poi/xwpf/usermodel/TestXWPFRun.java>:598: warning: [deprecation] getFontSize() in XWPFRun has been deprecated
            assertEquals(Short.MAX_VALUE, run.getFontSize());
                                             ^
<https://ci-builds.apache.org/job/POI/job/POI-DSL-1.16/ws/poi-ooxml/src/test/java/org/apache/poi/xwpf/usermodel/TestXWPFRun.java>:601: warning: [deprecation] getFontSize() in XWPFRun has been deprecated
            assertEquals(Short.MAX_VALUE + 1, run.getFontSize());
                                                 ^
<https://ci-builds.apache.org/job/POI/job/POI-DSL-1.16/ws/poi-ooxml/src/test/java/org/apache/poi/xwpf/usermodel/TestXWPFRun.java>:604: warning: [deprecation] getFontSize() in XWPFRun has been deprecated
            assertEquals(Integer.MAX_VALUE - 1, run.getFontSize());
                                                   ^
<https://ci-builds.apache.org/job/POI/job/POI-DSL-1.16/ws/poi-ooxml/src/test/java/org/apache/poi/xwpf/usermodel/TestXWPFRun.java>:607: warning: [deprecation] getFontSize() in XWPFRun has been deprecated
            assertEquals(Integer.MAX_VALUE, run.getFontSize());
                                               ^
<https://ci-builds.apache.org/job/POI/job/POI-DSL-1.16/ws/poi-ooxml/src/test/java/org/apache/poi/xwpf/usermodel/TestXWPFRun.java>:610: warning: [deprecation] getFontSize() in XWPFRun has been deprecated
            assertEquals(-1, run.getFontSize());
                                ^
<https://ci-builds.apache.org/job/POI/job/POI-DSL-1.16/ws/poi-ooxml/src/test/java/org/apache/poi/xwpf/usermodel/TestXWPFRun.java>:658: warning: [deprecation] getFontSize() in XWPFRun has been deprecated
            assertEquals(10, run.getFontSize());
                                ^
16 warnings

> Task :poi-ooxml:compileTest9
> Task :poi-ooxml:cacheTest9
> Task :poi-ooxml:processTestResources NO-SOURCE
> Task :poi-ooxml:testClasses
> Task :poi-ooxml:testJar
> Task :poi-integration:compileTestJava
> Task :poi-integration:compileTest9
> Task :poi-integration:cacheTest9
> Task :poi-integration:processTestResources
> Task :poi-integration:testClasses
> Task :poi-integration:testJar
> Task :allJavaDoc
> Task :zipJavadocs
> Task :binDistTar
> Task :binDistZip
> Task :replaceVersion
> Task :poi-excelant:compileJava
> Task :poi-excelant:compileJava9
> Task :poi-excelant:cacheJava9
> Task :poi-excelant:processResources
> Task :poi-excelant:classes
> Task :poi-excelant:compileTestJava
> Task :poi-excelant:compileTest9
> Task :poi-excelant:cacheTest9
> Task :poi-excelant:jar
> Task :poi-excelant:javadoc
> Task :poi-excelant:javadocJar
> Task :poi-excelant:sourcesJar
> Task :poi-excelant:assemble
> Task :poi-excelant:forbiddenApisMain UP-TO-DATE
> Task :poi-excelant:processTestResources
> Task :poi-excelant:testClasses
> Task :poi-excelant:forbiddenApisTest UP-TO-DATE
> Task :poi-excelant:forbiddenApis UP-TO-DATE
> Task :poi-excelant:testJar

> Task :poi-excelant:test
OpenJDK 64-Bit Server VM warning: Option --illegal-access is deprecated and will be removed in a future release.

> Task :poi-excelant:spotbugsMain
4 SpotBugs violations were found. See the report at: file://<https://ci-builds.apache.org/job/POI/job/POI-DSL-1.16/ws/poi-excelant/build/reports/spotbugs/main.xml>

org.gradle.api.GradleException: 4 SpotBugs violations were found. See the report at: file://<https://ci-builds.apache.org/job/POI/job/POI-DSL-1.16/ws/poi-excelant/build/reports/spotbugs/main.xml>
	at com.github.spotbugs.snom.internal.SpotBugsRunnerForWorker$SpotBugsExecutor.execute(SpotBugsRunnerForWorker.java:115)
	at org.gradle.workers.internal.DefaultWorkerServer.execute(DefaultWorkerServer.java:63)
	at org.gradle.workers.internal.AbstractClassLoaderWorker$1.create(AbstractClassLoaderWorker.java:49)
	at org.gradle.workers.internal.AbstractClassLoaderWorker$1.create(AbstractClassLoaderWorker.java:43)
	at org.gradle.internal.classloader.ClassLoaderUtils.executeInClassloader(ClassLoaderUtils.java:97)
	at org.gradle.workers.internal.AbstractClassLoaderWorker.executeInClassLoader(AbstractClassLoaderWorker.java:43)
	at org.gradle.workers.internal.IsolatedClassloaderWorker.run(IsolatedClassloaderWorker.java:49)
	at org.gradle.workers.internal.IsolatedClassloaderWorker.run(IsolatedClassloaderWorker.java:30)
	at org.gradle.workers.internal.WorkerDaemonServer.run(WorkerDaemonServer.java:85)
	at org.gradle.workers.internal.WorkerDaemonServer.run(WorkerDaemonServer.java:55)
	at org.gradle.process.internal.worker.request.WorkerAction$1.call(WorkerAction.java:138)
	at org.gradle.process.internal.worker.child.WorkerLogEventListener.withWorkerLoggingProtocol(WorkerLogEventListener.java:41)
	at org.gradle.process.internal.worker.request.WorkerAction.run(WorkerAction.java:135)
	at java.base/jdk.internal.reflect.NativeMethodAccessorImpl.invoke0(Native Method)
	at java.base/jdk.internal.reflect.NativeMethodAccessorImpl.invoke(NativeMethodAccessorImpl.java:78)
	at java.base/jdk.internal.reflect.DelegatingMethodAccessorImpl.invoke(DelegatingMethodAccessorImpl.java:43)
	at java.base/java.lang.reflect.Method.invoke(Method.java:567)
	at org.gradle.internal.dispatch.ReflectionDispatch.dispatch(ReflectionDispatch.java:36)
	at org.gradle.internal.dispatch.ReflectionDispatch.dispatch(ReflectionDispatch.java:24)
	at org.gradle.internal.remote.internal.hub.MessageHubBackedObjectConnection$DispatchWrapper.dispatch(MessageHubBackedObjectConnection.java:182)
	at org.gradle.internal.remote.internal.hub.MessageHubBackedObjectConnection$DispatchWrapper.dispatch(MessageHubBackedObjectConnection.java:164)
	at org.gradle.internal.remote.internal.hub.MessageHub$Handler.run(MessageHub.java:414)
	at org.gradle.internal.concurrent.ExecutorPolicy$CatchAndRecordFailures.onExecute(ExecutorPolicy.java:64)
	at org.gradle.internal.concurrent.ManagedExecutorImpl$1.run(ManagedExecutorImpl.java:48)
	at java.base/java.util.concurrent.ThreadPoolExecutor.runWorker(ThreadPoolExecutor.java:1130)
	at java.base/java.util.concurrent.ThreadPoolExecutor$Worker.run(ThreadPoolExecutor.java:630)
	at org.gradle.internal.concurrent.ThreadFactoryImpl$ManagedThreadRunnable.run(ThreadFactoryImpl.java:56)
	at java.base/java.lang.Thread.run(Thread.java:831)

> Task :poi-excelant:spotbugsTest
4 SpotBugs violations were found. See the report at: file://<https://ci-builds.apache.org/job/POI/job/POI-DSL-1.16/ws/poi-excelant/build/reports/spotbugs/test.xml>

org.gradle.api.GradleException: 4 SpotBugs violations were found. See the report at: file://<https://ci-builds.apache.org/job/POI/job/POI-DSL-1.16/ws/poi-excelant/build/reports/spotbugs/test.xml>
	at com.github.spotbugs.snom.internal.SpotBugsRunnerForWorker$SpotBugsExecutor.execute(SpotBugsRunnerForWorker.java:115)
	at org.gradle.workers.internal.DefaultWorkerServer.execute(DefaultWorkerServer.java:63)
	at org.gradle.workers.internal.AbstractClassLoaderWorker$1.create(AbstractClassLoaderWorker.java:49)
	at org.gradle.workers.internal.AbstractClassLoaderWorker$1.create(AbstractClassLoaderWorker.java:43)
	at org.gradle.internal.classloader.ClassLoaderUtils.executeInClassloader(ClassLoaderUtils.java:97)
	at org.gradle.workers.internal.AbstractClassLoaderWorker.executeInClassLoader(AbstractClassLoaderWorker.java:43)
	at org.gradle.workers.internal.IsolatedClassloaderWorker.run(IsolatedClassloaderWorker.java:49)
	at org.gradle.workers.internal.IsolatedClassloaderWorker.run(IsolatedClassloaderWorker.java:30)
	at org.gradle.workers.internal.WorkerDaemonServer.run(WorkerDaemonServer.java:85)
	at org.gradle.workers.internal.WorkerDaemonServer.run(WorkerDaemonServer.java:55)
	at org.gradle.process.internal.worker.request.WorkerAction$1.call(WorkerAction.java:138)
	at org.gradle.process.internal.worker.child.WorkerLogEventListener.withWorkerLoggingProtocol(WorkerLogEventListener.java:41)
	at org.gradle.process.internal.worker.request.WorkerAction.run(WorkerAction.java:135)
	at java.base/jdk.internal.reflect.NativeMethodAccessorImpl.invoke0(Native Method)
	at java.base/jdk.internal.reflect.NativeMethodAccessorImpl.invoke(NativeMethodAccessorImpl.java:78)
	at java.base/jdk.internal.reflect.DelegatingMethodAccessorImpl.invoke(DelegatingMethodAccessorImpl.java:43)
	at java.base/java.lang.reflect.Method.invoke(Method.java:567)
	at org.gradle.internal.dispatch.ReflectionDispatch.dispatch(ReflectionDispatch.java:36)
	at org.gradle.internal.dispatch.ReflectionDispatch.dispatch(ReflectionDispatch.java:24)
	at org.gradle.internal.remote.internal.hub.MessageHubBackedObjectConnection$DispatchWrapper.dispatch(MessageHubBackedObjectConnection.java:182)
	at org.gradle.internal.remote.internal.hub.MessageHubBackedObjectConnection$DispatchWrapper.dispatch(MessageHubBackedObjectConnection.java:164)
	at org.gradle.internal.remote.internal.hub.MessageHub$Handler.run(MessageHub.java:414)
	at org.gradle.internal.concurrent.ExecutorPolicy$CatchAndRecordFailures.onExecute(ExecutorPolicy.java:64)
	at org.gradle.internal.concurrent.ManagedExecutorImpl$1.run(ManagedExecutorImpl.java:48)
	at java.base/java.util.concurrent.ThreadPoolExecutor.runWorker(ThreadPoolExecutor.java:1130)
	at java.base/java.util.concurrent.ThreadPoolExecutor$Worker.run(ThreadPoolExecutor.java:630)
	at org.gradle.internal.concurrent.ThreadFactoryImpl$ManagedThreadRunnable.run(ThreadFactoryImpl.java:56)
	at java.base/java.lang.Thread.run(Thread.java:831)

> Task :poi-excelant:check
> Task :poi-excelant:build
> Task :poi-integration:jar
> Task :poi-integration:javadoc SKIPPED
> Task :poi-integration:javadocJar SKIPPED
> Task :poi-integration:sourcesJar SKIPPED
> Task :poi-integration:assemble
> Task :poi-integration:forbiddenApisMain NO-SOURCE
> Task :poi-integration:forbiddenApisTest UP-TO-DATE
> Task :poi-integration:forbiddenApis UP-TO-DATE
> Task :poi-integration:spotbugsMain NO-SOURCE

> Task :poi-integration:test
OpenJDK 64-Bit Server VM warning: Option --illegal-access is deprecated and will be removed in a future release.

> Task :poi-integration:spotbugsTest
5 SpotBugs violations were found. See the report at: file://<https://ci-builds.apache.org/job/POI/job/POI-DSL-1.16/ws/poi-integration/build/reports/spotbugs/test.xml>

org.gradle.api.GradleException: 5 SpotBugs violations were found. See the report at: file://<https://ci-builds.apache.org/job/POI/job/POI-DSL-1.16/ws/poi-integration/build/reports/spotbugs/test.xml>
	at com.github.spotbugs.snom.internal.SpotBugsRunnerForWorker$SpotBugsExecutor.execute(SpotBugsRunnerForWorker.java:115)
	at org.gradle.workers.internal.DefaultWorkerServer.execute(DefaultWorkerServer.java:63)
	at org.gradle.workers.internal.AbstractClassLoaderWorker$1.create(AbstractClassLoaderWorker.java:49)
	at org.gradle.workers.internal.AbstractClassLoaderWorker$1.create(AbstractClassLoaderWorker.java:43)
	at org.gradle.internal.classloader.ClassLoaderUtils.executeInClassloader(ClassLoaderUtils.java:97)
	at org.gradle.workers.internal.AbstractClassLoaderWorker.executeInClassLoader(AbstractClassLoaderWorker.java:43)
	at org.gradle.workers.internal.IsolatedClassloaderWorker.run(IsolatedClassloaderWorker.java:49)
	at org.gradle.workers.internal.IsolatedClassloaderWorker.run(IsolatedClassloaderWorker.java:30)
	at org.gradle.workers.internal.WorkerDaemonServer.run(WorkerDaemonServer.java:85)
	at org.gradle.workers.internal.WorkerDaemonServer.run(WorkerDaemonServer.java:55)
	at org.gradle.process.internal.worker.request.WorkerAction$1.call(WorkerAction.java:138)
	at org.gradle.process.internal.worker.child.WorkerLogEventListener.withWorkerLoggingProtocol(WorkerLogEventListener.java:41)
	at org.gradle.process.internal.worker.request.WorkerAction.run(WorkerAction.java:135)
	at java.base/jdk.internal.reflect.NativeMethodAccessorImpl.invoke0(Native Method)
	at java.base/jdk.internal.reflect.NativeMethodAccessorImpl.invoke(NativeMethodAccessorImpl.java:78)
	at java.base/jdk.internal.reflect.DelegatingMethodAccessorImpl.invoke(DelegatingMethodAccessorImpl.java:43)
	at java.base/java.lang.reflect.Method.invoke(Method.java:567)
	at org.gradle.internal.dispatch.ReflectionDispatch.dispatch(ReflectionDispatch.java:36)
	at org.gradle.internal.dispatch.ReflectionDispatch.dispatch(ReflectionDispatch.java:24)
	at org.gradle.internal.remote.internal.hub.MessageHubBackedObjectConnection$DispatchWrapper.dispatch(MessageHubBackedObjectConnection.java:182)
	at org.gradle.internal.remote.internal.hub.MessageHubBackedObjectConnection$DispatchWrapper.dispatch(MessageHubBackedObjectConnection.java:164)
	at org.gradle.internal.remote.internal.hub.MessageHub$Handler.run(MessageHub.java:414)
	at org.gradle.internal.concurrent.ExecutorPolicy$CatchAndRecordFailures.onExecute(ExecutorPolicy.java:64)
	at org.gradle.internal.concurrent.ManagedExecutorImpl$1.run(ManagedExecutorImpl.java:48)
	at java.base/java.util.concurrent.ThreadPoolExecutor.runWorker(ThreadPoolExecutor.java:1130)
	at java.base/java.util.concurrent.ThreadPoolExecutor$Worker.run(ThreadPoolExecutor.java:630)
	at org.gradle.internal.concurrent.ThreadFactoryImpl$ManagedThreadRunnable.run(ThreadFactoryImpl.java:56)
	at java.base/java.lang.Thread.run(Thread.java:831)

> Task :poi-integration:test
[208.888s][warning][gc,alloc] ForkJoinPool-1-worker-31: Retried waiting for GCLocker too often allocating 262146 words

UnknownClass.JUnit Jupiter > UnknownClass.executionError FAILED
    org.junit.platform.commons.JUnitException at EngineExecutionOrchestrator.java:114
        Caused by: org.junit.platform.commons.JUnitException at HierarchicalTestEngine.java:54
            Caused by: java.util.concurrent.ExecutionException at ForkJoinTask.java:1011
                Caused by: java.lang.OutOfMemoryError at NativeConstructorAccessorImpl.java:-2
                    Caused by: java.lang.OutOfMemoryError at NativeConstructorAccessorImpl.java:-2
                        Caused by: java.lang.OutOfMemoryError at NativeConstructorAccessorImpl.java:-2
                            Caused by: java.lang.OutOfMemoryError at FloatingDecimal.java:1875

UnknownClass.JUnit Jupiter FAILED

7745 tests completed, 2 failed, 1 skipped

> Task :poi-integration:test FAILED
> Task :fixDistDir

FAILURE: Build failed with an exception.

* What went wrong:
Execution failed for task ':poi-integration:test'.
> There were failing tests. See the report at: file://<https://ci-builds.apache.org/job/POI/job/POI-DSL-1.16/ws/poi-integration/build/reports/tests/test/index.html>

* Try:
Run with --stacktrace option to get the stack trace. Run with --info or --debug option to get more log output. Run with --scan to get full insights.

* Get more help at https://help.gradle.org

Deprecated Gradle features were used in this build, making it incompatible with Gradle 8.0.

You can use '--warning-mode all' to show the individual deprecation warnings and determine if they come from your own scripts or plugins.

See https://docs.gradle.org/7.1/userguide/command_line_interface.html#sec:command_line_warnings

BUILD FAILED in 12m 51s
87 actionable tasks: 84 executed, 3 up-to-date
Build step 'Invoke Gradle script' changed build result to FAILURE
Build step 'Invoke Gradle script' marked build as failure
[SpotBugs] Skipping execution of recorder since overall result is 'FAILURE'
Archiving artifacts
Skipping publisher since build result is FAILURE
Recording test results
[Checks API] No suitable checks publisher found.

---------------------------------------------------------------------
To unsubscribe, e-mail: dev-unsubscribe@poi.apache.org
For additional commands, e-mail: dev-help@poi.apache.org


Jenkins build is back to normal : POI » POI-DSL-1.16 #455

Posted by Apache Jenkins Server <je...@builds.apache.org>.
See <https://ci-builds.apache.org/job/POI/job/POI-DSL-1.16/455/display/redirect?page=changes>


---------------------------------------------------------------------
To unsubscribe, e-mail: dev-unsubscribe@poi.apache.org
For additional commands, e-mail: dev-help@poi.apache.org