You are viewing a plain text version of this content. The canonical link for it is here.
Posted to builds@beam.apache.org by Apache Jenkins Server <je...@builds.apache.org> on 2023/10/24 13:46:20 UTC

Build failed in Jenkins: beam_PostCommit_Python_Examples_Spark #2452

See <https://ci-beam.apache.org/job/beam_PostCommit_Python_Examples_Spark/2452/display/redirect>

Changes:


------------------------------------------
[...truncated 4.60 MB...]
  <https://ci-beam.apache.org/job/beam_PostCommit_Python_Examples_Spark/ws/src/build/gradleenv/2022703442/lib/python3.8/site-packages/_pytest/threadexception.py>:73: PytestUnhandledThreadExceptionWarning: Exception in thread read_grpc_client_inputs
  
  Traceback (most recent call last):
    File "/usr/lib/python3.8/threading.py", line 932, in _bootstrap_inner
      self.run()
    File "/usr/lib/python3.8/threading.py", line 870, in run
      self._target(*self._args, **self._kwargs)
    File "<https://ci-beam.apache.org/job/beam_PostCommit_Python_Examples_Spark/ws/src/sdks/python/apache_beam/runners/worker/data_plane.py",> line 669, in <lambda>
      target=lambda: self._read_inputs(elements_iterator),
    File "<https://ci-beam.apache.org/job/beam_PostCommit_Python_Examples_Spark/ws/src/sdks/python/apache_beam/runners/worker/data_plane.py",> line 652, in _read_inputs
      for elements in elements_iterator:
    File "<https://ci-beam.apache.org/job/beam_PostCommit_Python_Examples_Spark/ws/src/build/gradleenv/2022703442/lib/python3.8/site-packages/grpc/_channel.py",> line 541, in __next__
      return self._next()
    File "<https://ci-beam.apache.org/job/beam_PostCommit_Python_Examples_Spark/ws/src/build/gradleenv/2022703442/lib/python3.8/site-packages/grpc/_channel.py",> line 967, in _next
      raise self
  grpc._channel._MultiThreadedRendezvous: <_MultiThreadedRendezvous of RPC that terminated with:
  	status = StatusCode.CANCELLED
  	details = "Multiplexer hanging up"
  	debug_error_string = "UNKNOWN:Error received from peer ipv6:%5B::1%5D:43921 {created_time:"2023-10-24T13:45:05.373925076+00:00", grpc_status:1, grpc_message:"Multiplexer hanging up"}"
  >
  
    warnings.warn(pytest.PytestUnhandledThreadExceptionWarning(msg))

apache_beam/examples/cookbook/filters_test.py::FiltersTest::test_filters_output_bigquery_matcher
  <https://ci-beam.apache.org/job/beam_PostCommit_Python_Examples_Spark/ws/src/build/gradleenv/2022703442/lib/python3.8/site-packages/_pytest/threadexception.py>:73: PytestUnhandledThreadExceptionWarning: Exception in thread read_grpc_client_inputs
  
  Traceback (most recent call last):
    File "/usr/lib/python3.8/threading.py", line 932, in _bootstrap_inner
      self.run()
    File "/usr/lib/python3.8/threading.py", line 870, in run
      self._target(*self._args, **self._kwargs)
    File "<https://ci-beam.apache.org/job/beam_PostCommit_Python_Examples_Spark/ws/src/sdks/python/apache_beam/runners/worker/data_plane.py",> line 669, in <lambda>
      target=lambda: self._read_inputs(elements_iterator),
    File "<https://ci-beam.apache.org/job/beam_PostCommit_Python_Examples_Spark/ws/src/sdks/python/apache_beam/runners/worker/data_plane.py",> line 652, in _read_inputs
      for elements in elements_iterator:
    File "<https://ci-beam.apache.org/job/beam_PostCommit_Python_Examples_Spark/ws/src/build/gradleenv/2022703442/lib/python3.8/site-packages/grpc/_channel.py",> line 541, in __next__
      return self._next()
    File "<https://ci-beam.apache.org/job/beam_PostCommit_Python_Examples_Spark/ws/src/build/gradleenv/2022703442/lib/python3.8/site-packages/grpc/_channel.py",> line 967, in _next
      raise self
  grpc._channel._MultiThreadedRendezvous: <_MultiThreadedRendezvous of RPC that terminated with:
  	status = StatusCode.CANCELLED
  	details = "Multiplexer hanging up"
  	debug_error_string = "UNKNOWN:Error received from peer ipv6:%5B::1%5D:43397 {grpc_message:"Multiplexer hanging up", grpc_status:1, created_time:"2023-10-24T13:45:24.971885121+00:00"}"
  >
  
    warnings.warn(pytest.PytestUnhandledThreadExceptionWarning(msg))

apache_beam/examples/cookbook/group_with_coder_test.py::GroupWithCoderTest::test_basics_with_type_check
  <https://ci-beam.apache.org/job/beam_PostCommit_Python_Examples_Spark/ws/src/build/gradleenv/2022703442/lib/python3.8/site-packages/_pytest/threadexception.py>:73: PytestUnhandledThreadExceptionWarning: Exception in thread read_grpc_client_inputs
  
  Traceback (most recent call last):
    File "/usr/lib/python3.8/threading.py", line 932, in _bootstrap_inner
      self.run()
    File "/usr/lib/python3.8/threading.py", line 870, in run
      self._target(*self._args, **self._kwargs)
    File "<https://ci-beam.apache.org/job/beam_PostCommit_Python_Examples_Spark/ws/src/sdks/python/apache_beam/runners/worker/data_plane.py",> line 669, in <lambda>
      target=lambda: self._read_inputs(elements_iterator),
    File "<https://ci-beam.apache.org/job/beam_PostCommit_Python_Examples_Spark/ws/src/sdks/python/apache_beam/runners/worker/data_plane.py",> line 652, in _read_inputs
      for elements in elements_iterator:
    File "<https://ci-beam.apache.org/job/beam_PostCommit_Python_Examples_Spark/ws/src/build/gradleenv/2022703442/lib/python3.8/site-packages/grpc/_channel.py",> line 541, in __next__
      return self._next()
    File "<https://ci-beam.apache.org/job/beam_PostCommit_Python_Examples_Spark/ws/src/build/gradleenv/2022703442/lib/python3.8/site-packages/grpc/_channel.py",> line 967, in _next
      raise self
  grpc._channel._MultiThreadedRendezvous: <_MultiThreadedRendezvous of RPC that terminated with:
  	status = StatusCode.CANCELLED
  	details = "Multiplexer hanging up"
  	debug_error_string = "UNKNOWN:Error received from peer ipv6:%5B::1%5D:45545 {grpc_message:"Multiplexer hanging up", grpc_status:1, created_time:"2023-10-24T13:45:26.952170117+00:00"}"
  >
  
    warnings.warn(pytest.PytestUnhandledThreadExceptionWarning(msg))

apache_beam/examples/cookbook/group_with_coder_test.py::GroupWithCoderTest::test_basics_without_type_check
  <https://ci-beam.apache.org/job/beam_PostCommit_Python_Examples_Spark/ws/src/build/gradleenv/2022703442/lib/python3.8/site-packages/_pytest/threadexception.py>:73: PytestUnhandledThreadExceptionWarning: Exception in thread read_grpc_client_inputs
  
  Traceback (most recent call last):
    File "/usr/lib/python3.8/threading.py", line 932, in _bootstrap_inner
      self.run()
    File "/usr/lib/python3.8/threading.py", line 870, in run
      self._target(*self._args, **self._kwargs)
    File "<https://ci-beam.apache.org/job/beam_PostCommit_Python_Examples_Spark/ws/src/sdks/python/apache_beam/runners/worker/data_plane.py",> line 669, in <lambda>
      target=lambda: self._read_inputs(elements_iterator),
    File "<https://ci-beam.apache.org/job/beam_PostCommit_Python_Examples_Spark/ws/src/sdks/python/apache_beam/runners/worker/data_plane.py",> line 652, in _read_inputs
      for elements in elements_iterator:
    File "<https://ci-beam.apache.org/job/beam_PostCommit_Python_Examples_Spark/ws/src/build/gradleenv/2022703442/lib/python3.8/site-packages/grpc/_channel.py",> line 541, in __next__
      return self._next()
    File "<https://ci-beam.apache.org/job/beam_PostCommit_Python_Examples_Spark/ws/src/build/gradleenv/2022703442/lib/python3.8/site-packages/grpc/_channel.py",> line 967, in _next
      raise self
  grpc._channel._MultiThreadedRendezvous: <_MultiThreadedRendezvous of RPC that terminated with:
  	status = StatusCode.CANCELLED
  	details = "Multiplexer hanging up"
  	debug_error_string = "UNKNOWN:Error received from peer ipv6:%5B::1%5D:38407 {created_time:"2023-10-24T13:45:29.02018542+00:00", grpc_status:1, grpc_message:"Multiplexer hanging up"}"
  >
  
    warnings.warn(pytest.PytestUnhandledThreadExceptionWarning(msg))

apache_beam/examples/cookbook/mergecontacts_test.py::MergeContactsTest::test_mergecontacts
  <https://ci-beam.apache.org/job/beam_PostCommit_Python_Examples_Spark/ws/src/build/gradleenv/2022703442/lib/python3.8/site-packages/_pytest/threadexception.py>:73: PytestUnhandledThreadExceptionWarning: Exception in thread read_grpc_client_inputs
  
  Traceback (most recent call last):
    File "/usr/lib/python3.8/threading.py", line 932, in _bootstrap_inner
      self.run()
    File "/usr/lib/python3.8/threading.py", line 870, in run
      self._target(*self._args, **self._kwargs)
    File "<https://ci-beam.apache.org/job/beam_PostCommit_Python_Examples_Spark/ws/src/sdks/python/apache_beam/runners/worker/data_plane.py",> line 669, in <lambda>
      target=lambda: self._read_inputs(elements_iterator),
    File "<https://ci-beam.apache.org/job/beam_PostCommit_Python_Examples_Spark/ws/src/sdks/python/apache_beam/runners/worker/data_plane.py",> line 652, in _read_inputs
      for elements in elements_iterator:
    File "<https://ci-beam.apache.org/job/beam_PostCommit_Python_Examples_Spark/ws/src/build/gradleenv/2022703442/lib/python3.8/site-packages/grpc/_channel.py",> line 541, in __next__
      return self._next()
    File "<https://ci-beam.apache.org/job/beam_PostCommit_Python_Examples_Spark/ws/src/build/gradleenv/2022703442/lib/python3.8/site-packages/grpc/_channel.py",> line 967, in _next
      raise self
  grpc._channel._MultiThreadedRendezvous: <_MultiThreadedRendezvous of RPC that terminated with:
  	status = StatusCode.CANCELLED
  	details = "Multiplexer hanging up"
  	debug_error_string = "UNKNOWN:Error received from peer ipv6:%5B::1%5D:36263 {created_time:"2023-10-24T13:45:35.644096916+00:00", grpc_status:1, grpc_message:"Multiplexer hanging up"}"
  >
  
    warnings.warn(pytest.PytestUnhandledThreadExceptionWarning(msg))

apache_beam/examples/cookbook/multiple_output_pardo_test.py::MultipleOutputParDo::test_multiple_output_pardo
  <https://ci-beam.apache.org/job/beam_PostCommit_Python_Examples_Spark/ws/src/build/gradleenv/2022703442/lib/python3.8/site-packages/_pytest/threadexception.py>:73: PytestUnhandledThreadExceptionWarning: Exception in thread read_grpc_client_inputs
  
  Traceback (most recent call last):
    File "/usr/lib/python3.8/threading.py", line 932, in _bootstrap_inner
      self.run()
    File "/usr/lib/python3.8/threading.py", line 870, in run
      self._target(*self._args, **self._kwargs)
    File "<https://ci-beam.apache.org/job/beam_PostCommit_Python_Examples_Spark/ws/src/sdks/python/apache_beam/runners/worker/data_plane.py",> line 669, in <lambda>
      target=lambda: self._read_inputs(elements_iterator),
    File "<https://ci-beam.apache.org/job/beam_PostCommit_Python_Examples_Spark/ws/src/sdks/python/apache_beam/runners/worker/data_plane.py",> line 652, in _read_inputs
      for elements in elements_iterator:
    File "<https://ci-beam.apache.org/job/beam_PostCommit_Python_Examples_Spark/ws/src/build/gradleenv/2022703442/lib/python3.8/site-packages/grpc/_channel.py",> line 541, in __next__
      return self._next()
    File "<https://ci-beam.apache.org/job/beam_PostCommit_Python_Examples_Spark/ws/src/build/gradleenv/2022703442/lib/python3.8/site-packages/grpc/_channel.py",> line 967, in _next
      raise self
  grpc._channel._MultiThreadedRendezvous: <_MultiThreadedRendezvous of RPC that terminated with:
  	status = StatusCode.CANCELLED
  	details = "Multiplexer hanging up"
  	debug_error_string = "UNKNOWN:Error received from peer ipv6:%5B::1%5D:35085 {created_time:"2023-10-24T13:45:41.124699301+00:00", grpc_status:1, grpc_message:"Multiplexer hanging up"}"
  >
  
    warnings.warn(pytest.PytestUnhandledThreadExceptionWarning(msg))

apache_beam/examples/dataframe/flight_delays_it_test.py: 45 warnings
  <https://ci-beam.apache.org/job/beam_PostCommit_Python_Examples_Spark/ws/src/sdks/python/apache_beam/examples/dataframe/flight_delays.py>:47: FutureWarning: The default value of numeric_only in DataFrame.mean is deprecated. In a future version, it will default to False. In addition, specifying 'numeric_only=None' is deprecated. Select only valid columns or specify the value of numeric_only to silence this warning.
    return airline_df[at_top_airports].mean()

apache_beam/examples/dataframe/flight_delays_it_test.py::FlightDelaysTest::test_flight_delays
  <https://ci-beam.apache.org/job/beam_PostCommit_Python_Examples_Spark/ws/src/build/gradleenv/2022703442/lib/python3.8/site-packages/_pytest/threadexception.py>:73: PytestUnhandledThreadExceptionWarning: Exception in thread read_grpc_client_inputs
  
  Traceback (most recent call last):
    File "/usr/lib/python3.8/threading.py", line 932, in _bootstrap_inner
      self.run()
    File "/usr/lib/python3.8/threading.py", line 870, in run
      self._target(*self._args, **self._kwargs)
    File "<https://ci-beam.apache.org/job/beam_PostCommit_Python_Examples_Spark/ws/src/sdks/python/apache_beam/runners/worker/data_plane.py",> line 669, in <lambda>
      target=lambda: self._read_inputs(elements_iterator),
    File "<https://ci-beam.apache.org/job/beam_PostCommit_Python_Examples_Spark/ws/src/sdks/python/apache_beam/runners/worker/data_plane.py",> line 652, in _read_inputs
      for elements in elements_iterator:
    File "<https://ci-beam.apache.org/job/beam_PostCommit_Python_Examples_Spark/ws/src/build/gradleenv/2022703442/lib/python3.8/site-packages/grpc/_channel.py",> line 541, in __next__
      return self._next()
    File "<https://ci-beam.apache.org/job/beam_PostCommit_Python_Examples_Spark/ws/src/build/gradleenv/2022703442/lib/python3.8/site-packages/grpc/_channel.py",> line 967, in _next
      raise self
  grpc._channel._MultiThreadedRendezvous: <_MultiThreadedRendezvous of RPC that terminated with:
  	status = StatusCode.CANCELLED
  	details = "Multiplexer hanging up"
  	debug_error_string = "UNKNOWN:Error received from peer ipv6:%5B::1%5D:37503 {created_time:"2023-10-24T13:46:09.790396422+00:00", grpc_status:1, grpc_message:"Multiplexer hanging up"}"
  >
  
    warnings.warn(pytest.PytestUnhandledThreadExceptionWarning(msg))

apache_beam/examples/dataframe/wordcount_test.py::WordCountTest::test_basics
  <https://ci-beam.apache.org/job/beam_PostCommit_Python_Examples_Spark/ws/src/build/gradleenv/2022703442/lib/python3.8/site-packages/_pytest/threadexception.py>:73: PytestUnhandledThreadExceptionWarning: Exception in thread read_grpc_client_inputs
  
  Traceback (most recent call last):
    File "/usr/lib/python3.8/threading.py", line 932, in _bootstrap_inner
      self.run()
    File "/usr/lib/python3.8/threading.py", line 870, in run
      self._target(*self._args, **self._kwargs)
    File "<https://ci-beam.apache.org/job/beam_PostCommit_Python_Examples_Spark/ws/src/sdks/python/apache_beam/runners/worker/data_plane.py",> line 669, in <lambda>
      target=lambda: self._read_inputs(elements_iterator),
    File "<https://ci-beam.apache.org/job/beam_PostCommit_Python_Examples_Spark/ws/src/sdks/python/apache_beam/runners/worker/data_plane.py",> line 652, in _read_inputs
      for elements in elements_iterator:
    File "<https://ci-beam.apache.org/job/beam_PostCommit_Python_Examples_Spark/ws/src/build/gradleenv/2022703442/lib/python3.8/site-packages/grpc/_channel.py",> line 541, in __next__
      return self._next()
    File "<https://ci-beam.apache.org/job/beam_PostCommit_Python_Examples_Spark/ws/src/build/gradleenv/2022703442/lib/python3.8/site-packages/grpc/_channel.py",> line 967, in _next
      raise self
  grpc._channel._MultiThreadedRendezvous: <_MultiThreadedRendezvous of RPC that terminated with:
  	status = StatusCode.CANCELLED
  	details = "Multiplexer hanging up"
  	debug_error_string = "UNKNOWN:Error received from peer ipv6:%5B::1%5D:44041 {grpc_message:"Multiplexer hanging up", grpc_status:1, created_time:"2023-10-24T13:46:15.100254551+00:00"}"
  >
  
    warnings.warn(pytest.PytestUnhandledThreadExceptionWarning(msg))

-- Docs: https://docs.pytest.org/en/stable/how-to/capture-warnings.html
- generated xml file: <https://ci-beam.apache.org/job/beam_PostCommit_Python_Examples_Spark/ws/src/sdks/python/pytest_postCommitExamples-spark-py38.xml> -
=========================== short test summary info ============================
FAILED apache_beam/examples/complete/juliaset/juliaset/juliaset_test.py::JuliaSetTest::test_output_file_format - Failed: Timeout >600.0s [while running 'WriteToText/Write/WriteImpl/PreFinalize']
= 1 failed, 22 passed, 19 skipped, 7181 deselected, 70 warnings in 830.73s (0:13:50) =

> Task :sdks:python:test-suites:portable:py38:sparkExamples FAILED

FAILURE: Build completed with 2 failures.

1: Task failed with an exception.
-----------
* Where:
Script '<https://ci-beam.apache.org/job/beam_PostCommit_Python_Examples_Spark/ws/src/sdks/python/test-suites/portable/common.gradle'> line: 276

* What went wrong:
Execution failed for task ':sdks:python:test-suites:portable:py311:sparkExamples'.
> Process 'command 'sh'' finished with non-zero exit value 1

* Try:
> Run with --stacktrace option to get the stack trace.
> Run with --info or --debug option to get more log output.
> Get more help at https://help.gradle.org.
==============================================================================

2: Task failed with an exception.
-----------
* Where:
Script '<https://ci-beam.apache.org/job/beam_PostCommit_Python_Examples_Spark/ws/src/sdks/python/test-suites/portable/common.gradle'> line: 276

* What went wrong:
Execution failed for task ':sdks:python:test-suites:portable:py38:sparkExamples'.
> Process 'command 'sh'' finished with non-zero exit value 1

* Try:
> Run with --stacktrace option to get the stack trace.
> Run with --info or --debug option to get more log output.
> Get more help at https://help.gradle.org.
==============================================================================

Deprecated Gradle features were used in this build, making it incompatible with Gradle 9.0.

You can use '--warning-mode all' to show the individual deprecation warnings and determine if they come from your own scripts or plugins.

For more on this, please refer to https://docs.gradle.org/8.3/userguide/command_line_interface.html#sec:command_line_warnings in the Gradle documentation.

BUILD FAILED in 19m 51s
80 actionable tasks: 53 executed, 27 from cache

Publishing build scan...
https://ge.apache.org/s/zykb5letsze6q

Build step 'Invoke Gradle script' changed build result to FAILURE
Build step 'Invoke Gradle script' marked build as failure

---------------------------------------------------------------------
To unsubscribe, e-mail: builds-unsubscribe@beam.apache.org
For additional commands, e-mail: builds-help@beam.apache.org


Jenkins build is back to normal : beam_PostCommit_Python_Examples_Spark #2453

Posted by Apache Jenkins Server <je...@builds.apache.org>.
See <https://ci-beam.apache.org/job/beam_PostCommit_Python_Examples_Spark/2453/display/redirect>


---------------------------------------------------------------------
To unsubscribe, e-mail: builds-unsubscribe@beam.apache.org
For additional commands, e-mail: builds-help@beam.apache.org