You are viewing a plain text version of this content. The canonical link for it is here.
Posted to builds@beam.apache.org by Apache Jenkins Server <je...@builds.apache.org> on 2022/04/18 13:42:30 UTC
Build failed in Jenkins: beam_PostCommit_Python39 #261
See <https://ci-beam.apache.org/job/beam_PostCommit_Python39/261/display/redirect>
Changes:
------------------------------------------
[...truncated 23.77 MB...]
log_location: "/usr/local/lib/python3.9/site-packages/apache_beam/runners/worker/data_plane.py:782"
thread: "MainThread"
INFO:root:severity: INFO
timestamp {
seconds: 1650284634
nanos: 252588033
}
message: "Closing all cached gRPC state handlers."
log_location: "/usr/local/lib/python3.9/site-packages/apache_beam/runners/worker/sdk_worker.py:859"
thread: "MainThread"
INFO:root:severity: INFO
timestamp {
seconds: 1650284634
nanos: 253345251
}
message: "Done consuming work."
log_location: "/usr/local/lib/python3.9/site-packages/apache_beam/runners/worker/sdk_worker.py:257"
thread: "MainThread"
INFO:root:severity: INFO
timestamp {
seconds: 1650284634
nanos: 253490209
}
message: "Python sdk harness exiting."
log_location: "/usr/local/lib/python3.9/site-packages/apache_beam/runners/worker/sdk_worker_main.py:181"
thread: "MainThread"
INFO:apache_beam.runners.portability.local_job_service:Completed job in 9.761900424957275 seconds with state DONE.
INFO:root:Completed job in 9.761900424957275 seconds with state DONE.
INFO:apache_beam.runners.portability.portable_runner:Job state changed to DONE
> Task :sdks:python:test-suites:portable:py39:portableWordCountSparkRunnerBatch
INFO:apache_beam.runners.worker.worker_pool_main:Listening for workers at localhost:34229
WARNING:root:Make sure that locally built Python SDK docker image has Python 3.9 interpreter.
INFO:root:Default Python SDK image for environment is apache/beam_python3.9_sdk:2.39.0.dev
INFO:apache_beam.runners.portability.fn_api_runner.translations:==================== <function pack_combiners at 0x7fba8ea1bb80> ====================
INFO:apache_beam.runners.portability.fn_api_runner.translations:==================== <function lift_combiners at 0x7fba8ea1bc10> ====================
INFO:apache_beam.runners.portability.fn_api_runner.translations:==================== <function sort_stages at 0x7fba8ea1c3a0> ====================
INFO:apache_beam.utils.subprocess_server:Starting service with ['java' '-jar' '<https://ci-beam.apache.org/job/beam_PostCommit_Python39/ws/src/runners/spark/2/job-server/build/libs/beam-runners-spark-job-server-2.39.0-SNAPSHOT.jar'> '--spark-master-url' 'local[4]' '--artifacts-dir' '/tmp/beam-temp78hody9o/artifactsnuyjwhjp' '--job-port' '49581' '--artifact-port' '0' '--expansion-port' '0']
E0418 12:23:57.221043215 4054891 fork_posix.cc:70] Fork support is only compatible with the epoll1 and poll polling strategies
INFO:apache_beam.utils.subprocess_server:b'22/04/18 12:23:58 WARN software.amazon.awssdk.regions.internal.util.EC2MetadataUtils: Unable to retrieve the requested metadata.'
INFO:apache_beam.utils.subprocess_server:b'22/04/18 12:23:59 INFO org.apache.beam.runners.jobsubmission.JobServerDriver: ArtifactStagingService started on localhost:37797'
INFO:apache_beam.utils.subprocess_server:b'22/04/18 12:23:59 INFO org.apache.beam.runners.jobsubmission.JobServerDriver: Java ExpansionService started on localhost:32989'
INFO:apache_beam.utils.subprocess_server:b'22/04/18 12:23:59 INFO org.apache.beam.runners.jobsubmission.JobServerDriver: JobService started on localhost:49581'
INFO:apache_beam.utils.subprocess_server:b'22/04/18 12:23:59 INFO org.apache.beam.runners.jobsubmission.JobServerDriver: Job server now running, terminate with Ctrl+C'
WARNING:apache_beam.options.pipeline_options:Discarding unparseable args: ['--parallelism=2']
INFO:apache_beam.utils.subprocess_server:b'22/04/18 12:24:00 INFO org.apache.beam.runners.fnexecution.artifact.ArtifactStagingService: Staging artifacts for job_f8bea162-484f-4299-9d4d-235a49f3e1d1.'
INFO:apache_beam.utils.subprocess_server:b'22/04/18 12:24:00 INFO org.apache.beam.runners.fnexecution.artifact.ArtifactStagingService: Resolving artifacts for job_f8bea162-484f-4299-9d4d-235a49f3e1d1.ref_Environment_default_environment_1.'
INFO:apache_beam.utils.subprocess_server:b'22/04/18 12:24:00 INFO org.apache.beam.runners.fnexecution.artifact.ArtifactStagingService: Getting 1 artifacts for job_f8bea162-484f-4299-9d4d-235a49f3e1d1.null.'
INFO:apache_beam.utils.subprocess_server:b'22/04/18 12:24:00 INFO org.apache.beam.runners.fnexecution.artifact.ArtifactStagingService: Artifacts fully staged for job_f8bea162-484f-4299-9d4d-235a49f3e1d1.'
INFO:apache_beam.utils.subprocess_server:b'22/04/18 12:24:00 INFO org.apache.beam.runners.spark.SparkJobInvoker: Invoking job BeamApp-jenkins-0418122400-c09d6b16_06d24038-c05f-469c-890e-5b8bfa94b626'
INFO:apache_beam.utils.subprocess_server:b'22/04/18 12:24:00 INFO org.apache.beam.runners.jobsubmission.JobInvocation: Starting job invocation BeamApp-jenkins-0418122400-c09d6b16_06d24038-c05f-469c-890e-5b8bfa94b626'
INFO:apache_beam.runners.portability.portable_runner:Environment "LOOPBACK" has started a component necessary for the execution. Be sure to run the pipeline using
with Pipeline() as p:
p.apply(..)
This ensures that the pipeline finishes before this program exits.
INFO:apache_beam.runners.portability.portable_runner:Job state changed to STOPPED
INFO:apache_beam.runners.portability.portable_runner:Job state changed to STARTING
INFO:apache_beam.runners.portability.portable_runner:Job state changed to RUNNING
INFO:apache_beam.utils.subprocess_server:b'22/04/18 12:24:00 INFO org.apache.beam.runners.spark.translation.SparkContextFactory: Creating a brand new Spark Context.'
INFO:apache_beam.utils.subprocess_server:b'22/04/18 12:24:01 WARN org.apache.hadoop.util.NativeCodeLoader: Unable to load native-hadoop library for your platform... using builtin-java classes where applicable'
INFO:apache_beam.utils.subprocess_server:b'22/04/18 12:24:02 INFO org.apache.beam.runners.spark.aggregators.AggregatorsAccumulator: Instantiated aggregators accumulator:'
INFO:apache_beam.utils.subprocess_server:b'22/04/18 12:24:02 INFO org.apache.beam.runners.spark.metrics.MetricsAccumulator: Instantiated metrics accumulator: MetricQueryResults()'
INFO:apache_beam.utils.subprocess_server:b'22/04/18 12:24:02 WARN software.amazon.awssdk.regions.internal.util.EC2MetadataUtils: Unable to retrieve the requested metadata.'
INFO:apache_beam.utils.subprocess_server:b'22/04/18 12:24:02 INFO org.apache.beam.runners.spark.SparkPipelineRunner: Running job BeamApp-jenkins-0418122400-c09d6b16_06d24038-c05f-469c-890e-5b8bfa94b626 on Spark master local[4]'
INFO:apache_beam.utils.subprocess_server:b'22/04/18 12:24:02 WARN software.amazon.awssdk.regions.internal.util.EC2MetadataUtils: Unable to retrieve the requested metadata.'
INFO:apache_beam.utils.subprocess_server:b'22/04/18 12:24:02 WARN software.amazon.awssdk.regions.internal.util.EC2MetadataUtils: Unable to retrieve the requested metadata.'
INFO:apache_beam.utils.subprocess_server:b'22/04/18 12:24:02 WARN software.amazon.awssdk.regions.internal.util.EC2MetadataUtils: Unable to retrieve the requested metadata.'
INFO:apache_beam.utils.subprocess_server:b'22/04/18 12:24:02 WARN software.amazon.awssdk.regions.internal.util.EC2MetadataUtils: Unable to retrieve the requested metadata.'
INFO:apache_beam.runners.worker.statecache:Creating state cache with size 0
INFO:apache_beam.runners.worker.sdk_worker:Creating insecure control channel for localhost:42707.
INFO:apache_beam.runners.worker.sdk_worker:Control channel established.
INFO:apache_beam.runners.worker.sdk_worker:Initializing SDKHarness with unbounded number of workers.
INFO:apache_beam.utils.subprocess_server:b'22/04/18 12:24:03 INFO org.apache.beam.runners.fnexecution.control.FnApiControlClientPoolService: Beam Fn Control client connected with id 1-1'
INFO:apache_beam.utils.subprocess_server:b'22/04/18 12:24:03 INFO org.apache.beam.runners.fnexecution.control.FnApiControlClientPoolService: getProcessBundleDescriptor request with id 1-2'
INFO:apache_beam.runners.worker.sdk_worker:Creating insecure state channel for localhost:44555.
INFO:apache_beam.runners.worker.sdk_worker:State channel established.
INFO:apache_beam.runners.worker.data_plane:Creating client data channel for localhost:45289
INFO:apache_beam.utils.subprocess_server:b'22/04/18 12:24:03 INFO org.apache.beam.runners.fnexecution.data.GrpcDataService: Beam Fn Data client connected.'
INFO:apache_beam.utils.subprocess_server:b'22/04/18 12:24:03 INFO org.apache.beam.runners.fnexecution.control.FnApiControlClientPoolService: getProcessBundleDescriptor request with id 1-3'
INFO:apache_beam.utils.subprocess_server:b'22/04/18 12:24:03 WARN software.amazon.awssdk.regions.internal.util.EC2MetadataUtils: Unable to retrieve the requested metadata.'
INFO:apache_beam.utils.subprocess_server:b'22/04/18 12:24:03 WARN software.amazon.awssdk.regions.internal.util.EC2MetadataUtils: Unable to retrieve the requested metadata.'
INFO:apache_beam.utils.subprocess_server:b'22/04/18 12:24:03 WARN software.amazon.awssdk.regions.internal.util.EC2MetadataUtils: Unable to retrieve the requested metadata.'
INFO:apache_beam.utils.subprocess_server:b'22/04/18 12:24:03 WARN software.amazon.awssdk.regions.internal.util.EC2MetadataUtils: Unable to retrieve the requested metadata.'
INFO:apache_beam.utils.subprocess_server:b'22/04/18 12:24:03 INFO org.apache.beam.runners.fnexecution.control.FnApiControlClientPoolService: getProcessBundleDescriptor request with id 1-4'
INFO:apache_beam.utils.subprocess_server:b'22/04/18 12:24:03 INFO org.apache.beam.runners.fnexecution.control.FnApiControlClientPoolService: getProcessBundleDescriptor request with id 1-5'
INFO:apache_beam.utils.subprocess_server:b'22/04/18 12:24:03 WARN software.amazon.awssdk.regions.internal.util.EC2MetadataUtils: Unable to retrieve the requested metadata.'
INFO:apache_beam.utils.subprocess_server:b'22/04/18 12:24:03 WARN software.amazon.awssdk.regions.internal.util.EC2MetadataUtils: Unable to retrieve the requested metadata.'
INFO:apache_beam.utils.subprocess_server:b'22/04/18 12:24:03 WARN software.amazon.awssdk.regions.internal.util.EC2MetadataUtils: Unable to retrieve the requested metadata.'
INFO:apache_beam.utils.subprocess_server:b'22/04/18 12:24:03 WARN software.amazon.awssdk.regions.internal.util.EC2MetadataUtils: Unable to retrieve the requested metadata.'
INFO:apache_beam.utils.subprocess_server:b'22/04/18 12:24:03 INFO org.apache.beam.runners.fnexecution.control.FnApiControlClientPoolService: getProcessBundleDescriptor request with id 1-8'
INFO:apache_beam.utils.subprocess_server:b'22/04/18 12:24:03 INFO org.apache.beam.runners.fnexecution.control.FnApiControlClientPoolService: getProcessBundleDescriptor request with id 1-6'
INFO:apache_beam.utils.subprocess_server:b'22/04/18 12:24:03 INFO org.apache.beam.runners.fnexecution.control.FnApiControlClientPoolService: getProcessBundleDescriptor request with id 1-7'
INFO:apache_beam.utils.subprocess_server:b'22/04/18 12:24:03 INFO org.apache.beam.runners.fnexecution.control.FnApiControlClientPoolService: getProcessBundleDescriptor request with id 1-9'
INFO:apache_beam.utils.subprocess_server:b'22/04/18 12:24:03 INFO org.apache.beam.runners.fnexecution.control.FnApiControlClientPoolService: getProcessBundleDescriptor request with id 1-10'
INFO:apache_beam.utils.subprocess_server:b'22/04/18 12:24:03 INFO org.apache.beam.runners.fnexecution.control.FnApiControlClientPoolService: getProcessBundleDescriptor request with id 1-11'
INFO:apache_beam.utils.subprocess_server:b'22/04/18 12:24:03 INFO org.apache.beam.runners.fnexecution.control.FnApiControlClientPoolService: getProcessBundleDescriptor request with id 1-12'
INFO:apache_beam.utils.subprocess_server:b'22/04/18 12:24:03 INFO org.apache.beam.runners.fnexecution.control.FnApiControlClientPoolService: getProcessBundleDescriptor request with id 1-13'
INFO:apache_beam.utils.subprocess_server:b'22/04/18 12:24:03 WARN software.amazon.awssdk.regions.internal.util.EC2MetadataUtils: Unable to retrieve the requested metadata.'
INFO:apache_beam.utils.subprocess_server:b'22/04/18 12:24:03 WARN software.amazon.awssdk.regions.internal.util.EC2MetadataUtils: Unable to retrieve the requested metadata.'
INFO:apache_beam.utils.subprocess_server:b'22/04/18 12:24:03 WARN software.amazon.awssdk.regions.internal.util.EC2MetadataUtils: Unable to retrieve the requested metadata.'
INFO:apache_beam.utils.subprocess_server:b'22/04/18 12:24:03 WARN software.amazon.awssdk.regions.internal.util.EC2MetadataUtils: Unable to retrieve the requested metadata.'
INFO:apache_beam.utils.subprocess_server:b'22/04/18 12:24:03 INFO org.apache.beam.runners.fnexecution.control.FnApiControlClientPoolService: getProcessBundleDescriptor request with id 1-14'
INFO:apache_beam.utils.subprocess_server:b'22/04/18 12:24:03 WARN software.amazon.awssdk.regions.internal.util.EC2MetadataUtils: Unable to retrieve the requested metadata.'
INFO:apache_beam.utils.subprocess_server:b'22/04/18 12:24:03 WARN software.amazon.awssdk.regions.internal.util.EC2MetadataUtils: Unable to retrieve the requested metadata.'
INFO:apache_beam.utils.subprocess_server:b'22/04/18 12:24:03 WARN software.amazon.awssdk.regions.internal.util.EC2MetadataUtils: Unable to retrieve the requested metadata.'
INFO:apache_beam.utils.subprocess_server:b'22/04/18 12:24:03 WARN software.amazon.awssdk.regions.internal.util.EC2MetadataUtils: Unable to retrieve the requested metadata.'
INFO:apache_beam.utils.subprocess_server:b'22/04/18 12:24:03 INFO org.apache.beam.runners.fnexecution.control.FnApiControlClientPoolService: getProcessBundleDescriptor request with id 1-15'
INFO:apache_beam.utils.subprocess_server:b'22/04/18 12:24:03 INFO org.apache.beam.runners.spark.SparkPipelineRunner: Job BeamApp-jenkins-0418122400-c09d6b16_06d24038-c05f-469c-890e-5b8bfa94b626: Pipeline translated successfully. Computing outputs'
INFO:apache_beam.utils.subprocess_server:b'22/04/18 12:24:03 WARN software.amazon.awssdk.regions.internal.util.EC2MetadataUtils: Unable to retrieve the requested metadata.'
INFO:apache_beam.utils.subprocess_server:b'22/04/18 12:24:03 WARN software.amazon.awssdk.regions.internal.util.EC2MetadataUtils: Unable to retrieve the requested metadata.'
INFO:apache_beam.utils.subprocess_server:b'22/04/18 12:24:03 WARN software.amazon.awssdk.regions.internal.util.EC2MetadataUtils: Unable to retrieve the requested metadata.'
INFO:apache_beam.utils.subprocess_server:b'22/04/18 12:24:03 WARN software.amazon.awssdk.regions.internal.util.EC2MetadataUtils: Unable to retrieve the requested metadata.'
INFO:apache_beam.utils.subprocess_server:b'22/04/18 12:24:03 INFO org.apache.beam.runners.fnexecution.control.FnApiControlClientPoolService: getProcessBundleDescriptor request with id 1-16'
INFO:apache_beam.io.filebasedsink:Starting finalize_write threads with num_shards: 4 (skipped: 0), batches: 4, num_threads: 4
INFO:apache_beam.io.filebasedsink:Renamed 4 shards in 0.01 seconds.
INFO:apache_beam.utils.subprocess_server:b'22/04/18 12:24:04 INFO org.apache.beam.runners.spark.SparkPipelineRunner: Job BeamApp-jenkins-0418122400-c09d6b16_06d24038-c05f-469c-890e-5b8bfa94b626 finished.'
INFO:apache_beam.runners.portability.portable_runner:Job state changed to DONE
Exception in thread read_state:
Exception in thread run_worker_1-1:
Traceback (most recent call last):
File "/usr/lib/python3.9/threading.py", line 973, in _bootstrap_inner
Traceback (most recent call last):
self.run()
File "/usr/lib/python3.9/threading.py", line 973, in _bootstrap_inner
ERROR:apache_beam.runners.worker.data_plane:Failed to read inputs in the data plane.
Traceback (most recent call last):
File "<https://ci-beam.apache.org/job/beam_PostCommit_Python39/ws/src/sdks/python/apache_beam/runners/worker/data_plane.py",> line 634, in _read_inputs
for elements in elements_iterator:
File "<https://ci-beam.apache.org/job/beam_PostCommit_Python39/ws/src/build/gradleenv/2022703443/lib/python3.9/site-packages/grpc/_channel.py",> line 426, in __next__
return self._next()
File "<https://ci-beam.apache.org/job/beam_PostCommit_Python39/ws/src/build/gradleenv/2022703443/lib/python3.9/site-packages/grpc/_channel.py",> line 826, in _next
raise self
grpc._channel._MultiThreadedRendezvous: <_MultiThreadedRendezvous of RPC that terminated with:
status = StatusCode.UNAVAILABLE
details = "Connection reset by peer"
debug_error_string = "{"created":"@1650284644.540868409","description":"Error received from peer ipv6:[::1]:45289","file":"src/core/lib/surface/call.cc","file_line":903,"grpc_message":"Connection reset by peer","grpc_status":14}"
>
File "/usr/lib/python3.9/threading.py", line 910, in run
Exception in thread read_grpc_client_inputs:
Traceback (most recent call last):
self._target(*self._args, **self._kwargs)
self.run()
File "<https://ci-beam.apache.org/job/beam_PostCommit_Python39/ws/src/sdks/python/apache_beam/runners/worker/sdk_worker.py",> line 234, in run
File "/usr/lib/python3.9/threading.py", line 910, in run
File "/usr/lib/python3.9/threading.py", line 973, in _bootstrap_inner
for work_request in self._control_stub.Control(get_responses()):
self._target(*self._args, **self._kwargs)
File "<https://ci-beam.apache.org/job/beam_PostCommit_Python39/ws/src/build/gradleenv/2022703443/lib/python3.9/site-packages/grpc/_channel.py",> line 426, in __next__
File "<https://ci-beam.apache.org/job/beam_PostCommit_Python39/ws/src/sdks/python/apache_beam/runners/worker/sdk_worker.py",> line 990, in pull_responses
self.run()
return self._next()
File "<https://ci-beam.apache.org/job/beam_PostCommit_Python39/ws/src/build/gradleenv/2022703443/lib/python3.9/site-packages/grpc/_channel.py",> line 826, in _next
File "/usr/lib/python3.9/threading.py", line 910, in run
raise self
grpc._channel._MultiThreadedRendezvous: <_MultiThreadedRendezvous of RPC that terminated with:
status = StatusCode.UNAVAILABLE
details = "Socket closed"
debug_error_string = "{"created":"@1650284644.540869535","description":"Error received from peer ipv6:[::1]:42707","file":"src/core/lib/surface/call.cc","file_line":903,"grpc_message":"Socket closed","grpc_status":14}"
>
for response in responses:
File "<https://ci-beam.apache.org/job/beam_PostCommit_Python39/ws/src/build/gradleenv/2022703443/lib/python3.9/site-packages/grpc/_channel.py",> line 426, in __next__
self._target(*self._args, **self._kwargs)
File "<https://ci-beam.apache.org/job/beam_PostCommit_Python39/ws/src/sdks/python/apache_beam/runners/worker/data_plane.py",> line 651, in <lambda>
return self._next()
File "<https://ci-beam.apache.org/job/beam_PostCommit_Python39/ws/src/build/gradleenv/2022703443/lib/python3.9/site-packages/grpc/_channel.py",> line 826, in _next
target=lambda: self._read_inputs(elements_iterator),
File "<https://ci-beam.apache.org/job/beam_PostCommit_Python39/ws/src/sdks/python/apache_beam/runners/worker/data_plane.py",> line 634, in _read_inputs
raise self
for elements in elements_iterator:
File "<https://ci-beam.apache.org/job/beam_PostCommit_Python39/ws/src/build/gradleenv/2022703443/lib/python3.9/site-packages/grpc/_channel.py",> line 426, in __next__
grpc._channel._MultiThreadedRendezvous: <_MultiThreadedRendezvous of RPC that terminated with:
status = StatusCode.UNAVAILABLE
details = "Socket closed"
debug_error_string = "{"created":"@1650284644.540869426","description":"Error received from peer ipv6:[::1]:44555","file":"src/core/lib/surface/call.cc","file_line":903,"grpc_message":"Socket closed","grpc_status":14}"
>
return self._next()
File "<https://ci-beam.apache.org/job/beam_PostCommit_Python39/ws/src/build/gradleenv/2022703443/lib/python3.9/site-packages/grpc/_channel.py",> line 826, in _next
raise self
grpc._channel._MultiThreadedRendezvous: <_MultiThreadedRendezvous of RPC that terminated with:
status = StatusCode.UNAVAILABLE
details = "Connection reset by peer"
debug_error_string = "{"created":"@1650284644.540868409","description":"Error received from peer ipv6:[::1]:45289","file":"src/core/lib/surface/call.cc","file_line":903,"grpc_message":"Connection reset by peer","grpc_status":14}"
>
> Task :sdks:python:test-suites:portable:py39:postCommitPy39
> Task :sdks:python:test-suites:dataflow:py39:postCommitIT
E0418 12:24:41.399531336 4030800 fork_posix.cc:70] Fork support is only compatible with the epoll1 and poll polling strategies
E0418 12:25:49.754352833 4030808 fork_posix.cc:70] Fork support is only compatible with the epoll1 and poll polling strategies
E0418 12:27:50.442300272 4030844 fork_posix.cc:70] Fork support is only compatible with the epoll1 and poll polling strategies
E0418 12:31:01.080782566 4030825 fork_posix.cc:70] Fork support is only compatible with the epoll1 and poll polling strategies
E0418 12:32:11.641784046 4030808 fork_posix.cc:70] Fork support is only compatible with the epoll1 and poll polling strategies
E0418 12:32:33.422142111 4030800 fork_posix.cc:70] Fork support is only compatible with the epoll1 and poll polling strategies
E0418 12:37:26.097322605 4030825 fork_posix.cc:70] Fork support is only compatible with the epoll1 and poll polling strategies
E0418 12:40:04.206394730 4030800 fork_posix.cc:70] Fork support is only compatible with the epoll1 and poll polling strategies
E0418 12:45:07.647194443 4030825 fork_posix.cc:70] Fork support is only compatible with the epoll1 and poll polling strategies
E0418 12:46:41.550256732 4030800 fork_posix.cc:70] Fork support is only compatible with the epoll1 and poll polling strategies
E0418 12:47:03.167414616 4030808 fork_posix.cc:70] Fork support is only compatible with the epoll1 and poll polling strategies
E0418 12:53:27.356575728 4030825 fork_posix.cc:70] Fork support is only compatible with the epoll1 and poll polling strategies
E0418 13:00:22.712316261 4030825 fork_posix.cc:70] Fork support is only compatible with the epoll1 and poll polling strategies
E0418 13:03:56.367587304 4030808 fork_posix.cc:70] Fork support is only compatible with the epoll1 and poll polling strategies
E0418 13:06:58.407132038 4030825 fork_posix.cc:70] Fork support is only compatible with the epoll1 and poll polling strategies
E0418 13:14:44.162197355 4030825 fork_posix.cc:70] Fork support is only compatible with the epoll1 and poll polling strategies
E0418 13:19:32.536579240 4030863 fork_posix.cc:70] Fork support is only compatible with the epoll1 and poll polling strategies
E0418 13:20:36.726812254 4030808 fork_posix.cc:70] Fork support is only compatible with the epoll1 and poll polling strategies
E0418 13:21:14.024261895 4030825 fork_posix.cc:70] Fork support is only compatible with the epoll1 and poll polling strategies
E0418 13:28:45.474487487 4030825 fork_posix.cc:70] Fork support is only compatible with the epoll1 and poll polling strategies
E0418 13:30:13.422529975 4030863 fork_posix.cc:70] Fork support is only compatible with the epoll1 and poll polling strategies
E0418 13:34:50.811790642 4030825 fork_posix.cc:70] Fork support is only compatible with the epoll1 and poll polling strategies
> Task :sdks:python:test-suites:dataflow:py39:postCommitIT FAILED
FAILURE: Build failed with an exception.
* Where:
Script '<https://ci-beam.apache.org/job/beam_PostCommit_Python39/ws/src/sdks/python/test-suites/dataflow/common.gradle'> line: 121
* What went wrong:
Execution failed for task ':sdks:python:test-suites:dataflow:py39:postCommitIT'.
> Process 'command 'sh'' finished with non-zero exit value 1
* Try:
> Run with --stacktrace option to get the stack trace.
> Run with --info or --debug option to get more log output.
> Run with --scan to get full insights.
* Get more help at https://help.gradle.org
Deprecated Gradle features were used in this build, making it incompatible with Gradle 8.0.
You can use '--warning-mode all' to show the individual deprecation warnings and determine if they come from your own scripts or plugins.
See https://docs.gradle.org/7.4/userguide/command_line_interface.html#sec:command_line_warnings
Execution optimizations have been disabled for 1 invalid unit(s) of work during this build to ensure correctness.
Please consult deprecation warnings for more details.
BUILD FAILED in 1h 31m 4s
219 actionable tasks: 149 executed, 64 from cache, 6 up-to-date
Publishing build scan...
https://gradle.com/s/6uqr4y5sm33oe
Build step 'Invoke Gradle script' changed build result to FAILURE
Build step 'Invoke Gradle script' marked build as failure
---------------------------------------------------------------------
To unsubscribe, e-mail: builds-unsubscribe@beam.apache.org
For additional commands, e-mail: builds-help@beam.apache.org
Jenkins build is back to normal : beam_PostCommit_Python39 #270
Posted by Apache Jenkins Server <je...@builds.apache.org>.
See <https://ci-beam.apache.org/job/beam_PostCommit_Python39/270/display/redirect?page=changes>
---------------------------------------------------------------------
To unsubscribe, e-mail: builds-unsubscribe@beam.apache.org
For additional commands, e-mail: builds-help@beam.apache.org
Build failed in Jenkins: beam_PostCommit_Python39 #269
Posted by Apache Jenkins Server <je...@builds.apache.org>.
See <https://ci-beam.apache.org/job/beam_PostCommit_Python39/269/display/redirect>
Changes:
------------------------------------------
[...truncated 26.18 MB...]
message: "Closing all cached grpc data channels."
log_location: "/usr/local/lib/python3.9/site-packages/apache_beam/runners/worker/data_plane.py:782"
thread: "MainThread"
INFO:root:severity: INFO
timestamp {
seconds: 1650457438
nanos: 64228296
}
message: "Closing all cached gRPC state handlers."
log_location: "/usr/local/lib/python3.9/site-packages/apache_beam/runners/worker/sdk_worker.py:859"
thread: "MainThread"
INFO:root:severity: INFO
timestamp {
seconds: 1650457438
nanos: 64471721
}
message: "Done consuming work."
log_location: "/usr/local/lib/python3.9/site-packages/apache_beam/runners/worker/sdk_worker.py:257"
thread: "MainThread"
INFO:root:severity: INFO
timestamp {
seconds: 1650457438
nanos: 64559698
}
message: "Python sdk harness exiting."
log_location: "/usr/local/lib/python3.9/site-packages/apache_beam/runners/worker/sdk_worker_main.py:181"
thread: "MainThread"
INFO:apache_beam.runners.portability.local_job_service:Completed job in 10.385593175888062 seconds with state DONE.
INFO:root:Completed job in 10.385593175888062 seconds with state DONE.
INFO:apache_beam.runners.portability.portable_runner:Job state changed to DONE
> Task :sdks:python:test-suites:portable:py39:portableWordCountSparkRunnerBatch
INFO:apache_beam.runners.worker.worker_pool_main:Listening for workers at localhost:44153
WARNING:root:Make sure that locally built Python SDK docker image has Python 3.9 interpreter.
INFO:root:Default Python SDK image for environment is apache/beam_python3.9_sdk:2.39.0.dev
INFO:apache_beam.runners.portability.fn_api_runner.translations:==================== <function pack_combiners at 0x7f39c35e8c10> ====================
INFO:apache_beam.runners.portability.fn_api_runner.translations:==================== <function lift_combiners at 0x7f39c35e8ca0> ====================
INFO:apache_beam.runners.portability.fn_api_runner.translations:==================== <function sort_stages at 0x7f39c35e9430> ====================
INFO:apache_beam.utils.subprocess_server:Starting service with ['java' '-jar' '<https://ci-beam.apache.org/job/beam_PostCommit_Python39/ws/src/runners/spark/2/job-server/build/libs/beam-runners-spark-job-server-2.39.0-SNAPSHOT.jar'> '--spark-master-url' 'local[4]' '--artifacts-dir' '/tmp/beam-temp4ed372iw/artifactsndgnrvli' '--job-port' '51705' '--artifact-port' '0' '--expansion-port' '0']
E0420 12:24:01.299248361 1086993 fork_posix.cc:70] Fork support is only compatible with the epoll1 and poll polling strategies
INFO:apache_beam.utils.subprocess_server:b'22/04/20 12:24:02 WARN software.amazon.awssdk.regions.internal.util.EC2MetadataUtils: Unable to retrieve the requested metadata.'
INFO:apache_beam.utils.subprocess_server:b'22/04/20 12:24:03 INFO org.apache.beam.runners.jobsubmission.JobServerDriver: ArtifactStagingService started on localhost:42349'
INFO:apache_beam.utils.subprocess_server:b'22/04/20 12:24:03 INFO org.apache.beam.runners.jobsubmission.JobServerDriver: Java ExpansionService started on localhost:38077'
INFO:apache_beam.utils.subprocess_server:b'22/04/20 12:24:03 INFO org.apache.beam.runners.jobsubmission.JobServerDriver: JobService started on localhost:51705'
INFO:apache_beam.utils.subprocess_server:b'22/04/20 12:24:03 INFO org.apache.beam.runners.jobsubmission.JobServerDriver: Job server now running, terminate with Ctrl+C'
WARNING:apache_beam.options.pipeline_options:Discarding unparseable args: ['--parallelism=2']
INFO:apache_beam.utils.subprocess_server:b'22/04/20 12:24:04 INFO org.apache.beam.runners.fnexecution.artifact.ArtifactStagingService: Staging artifacts for job_5c6b9a38-bd41-45a9-ab11-767ca4f68138.'
INFO:apache_beam.utils.subprocess_server:b'22/04/20 12:24:04 INFO org.apache.beam.runners.fnexecution.artifact.ArtifactStagingService: Resolving artifacts for job_5c6b9a38-bd41-45a9-ab11-767ca4f68138.ref_Environment_default_environment_1.'
INFO:apache_beam.utils.subprocess_server:b'22/04/20 12:24:04 INFO org.apache.beam.runners.fnexecution.artifact.ArtifactStagingService: Getting 1 artifacts for job_5c6b9a38-bd41-45a9-ab11-767ca4f68138.null.'
INFO:apache_beam.utils.subprocess_server:b'22/04/20 12:24:04 INFO org.apache.beam.runners.fnexecution.artifact.ArtifactStagingService: Artifacts fully staged for job_5c6b9a38-bd41-45a9-ab11-767ca4f68138.'
INFO:apache_beam.utils.subprocess_server:b'22/04/20 12:24:04 INFO org.apache.beam.runners.spark.SparkJobInvoker: Invoking job BeamApp-jenkins-0420122404-ad7a11f4_53e048bd-cddc-42d6-ad4e-1cafc2940824'
INFO:apache_beam.utils.subprocess_server:b'22/04/20 12:24:04 INFO org.apache.beam.runners.jobsubmission.JobInvocation: Starting job invocation BeamApp-jenkins-0420122404-ad7a11f4_53e048bd-cddc-42d6-ad4e-1cafc2940824'
INFO:apache_beam.runners.portability.portable_runner:Environment "LOOPBACK" has started a component necessary for the execution. Be sure to run the pipeline using
with Pipeline() as p:
p.apply(..)
This ensures that the pipeline finishes before this program exits.
INFO:apache_beam.runners.portability.portable_runner:Job state changed to STOPPED
INFO:apache_beam.runners.portability.portable_runner:Job state changed to STARTING
INFO:apache_beam.runners.portability.portable_runner:Job state changed to RUNNING
INFO:apache_beam.utils.subprocess_server:b'22/04/20 12:24:05 INFO org.apache.beam.runners.spark.translation.SparkContextFactory: Creating a brand new Spark Context.'
INFO:apache_beam.utils.subprocess_server:b'22/04/20 12:24:05 WARN org.apache.hadoop.util.NativeCodeLoader: Unable to load native-hadoop library for your platform... using builtin-java classes where applicable'
INFO:apache_beam.utils.subprocess_server:b'22/04/20 12:24:06 INFO org.apache.beam.runners.spark.aggregators.AggregatorsAccumulator: Instantiated aggregators accumulator:'
INFO:apache_beam.utils.subprocess_server:b'22/04/20 12:24:06 INFO org.apache.beam.runners.spark.metrics.MetricsAccumulator: Instantiated metrics accumulator: MetricQueryResults()'
INFO:apache_beam.utils.subprocess_server:b'22/04/20 12:24:06 WARN software.amazon.awssdk.regions.internal.util.EC2MetadataUtils: Unable to retrieve the requested metadata.'
INFO:apache_beam.utils.subprocess_server:b'22/04/20 12:24:06 INFO org.apache.beam.runners.spark.SparkPipelineRunner: Running job BeamApp-jenkins-0420122404-ad7a11f4_53e048bd-cddc-42d6-ad4e-1cafc2940824 on Spark master local[4]'
INFO:apache_beam.utils.subprocess_server:b'22/04/20 12:24:07 WARN software.amazon.awssdk.regions.internal.util.EC2MetadataUtils: Unable to retrieve the requested metadata.'
INFO:apache_beam.utils.subprocess_server:b'22/04/20 12:24:07 WARN software.amazon.awssdk.regions.internal.util.EC2MetadataUtils: Unable to retrieve the requested metadata.'
INFO:apache_beam.utils.subprocess_server:b'22/04/20 12:24:07 WARN software.amazon.awssdk.regions.internal.util.EC2MetadataUtils: Unable to retrieve the requested metadata.'
INFO:apache_beam.utils.subprocess_server:b'22/04/20 12:24:07 WARN software.amazon.awssdk.regions.internal.util.EC2MetadataUtils: Unable to retrieve the requested metadata.'
INFO:apache_beam.runners.worker.statecache:Creating state cache with size 0
INFO:apache_beam.runners.worker.sdk_worker:Creating insecure control channel for localhost:34273.
INFO:apache_beam.runners.worker.sdk_worker:Control channel established.
INFO:apache_beam.runners.worker.sdk_worker:Initializing SDKHarness with unbounded number of workers.
INFO:apache_beam.utils.subprocess_server:b'22/04/20 12:24:07 INFO org.apache.beam.runners.fnexecution.control.FnApiControlClientPoolService: Beam Fn Control client connected with id 1-1'
INFO:apache_beam.utils.subprocess_server:b'22/04/20 12:24:07 INFO org.apache.beam.runners.fnexecution.control.FnApiControlClientPoolService: getProcessBundleDescriptor request with id 1-2'
INFO:apache_beam.runners.worker.sdk_worker:Creating insecure state channel for localhost:42829.
INFO:apache_beam.runners.worker.sdk_worker:State channel established.
INFO:apache_beam.runners.worker.data_plane:Creating client data channel for localhost:33505
INFO:apache_beam.utils.subprocess_server:b'22/04/20 12:24:07 INFO org.apache.beam.runners.fnexecution.data.GrpcDataService: Beam Fn Data client connected.'
INFO:apache_beam.utils.subprocess_server:b'22/04/20 12:24:07 INFO org.apache.beam.runners.fnexecution.control.FnApiControlClientPoolService: getProcessBundleDescriptor request with id 1-3'
INFO:apache_beam.utils.subprocess_server:b'22/04/20 12:24:07 WARN software.amazon.awssdk.regions.internal.util.EC2MetadataUtils: Unable to retrieve the requested metadata.'
INFO:apache_beam.utils.subprocess_server:b'22/04/20 12:24:07 WARN software.amazon.awssdk.regions.internal.util.EC2MetadataUtils: Unable to retrieve the requested metadata.'
INFO:apache_beam.utils.subprocess_server:b'22/04/20 12:24:07 WARN software.amazon.awssdk.regions.internal.util.EC2MetadataUtils: Unable to retrieve the requested metadata.'
INFO:apache_beam.utils.subprocess_server:b'22/04/20 12:24:07 WARN software.amazon.awssdk.regions.internal.util.EC2MetadataUtils: Unable to retrieve the requested metadata.'
INFO:apache_beam.utils.subprocess_server:b'22/04/20 12:24:07 INFO org.apache.beam.runners.fnexecution.control.FnApiControlClientPoolService: getProcessBundleDescriptor request with id 1-4'
INFO:apache_beam.utils.subprocess_server:b'22/04/20 12:24:07 INFO org.apache.beam.runners.fnexecution.control.FnApiControlClientPoolService: getProcessBundleDescriptor request with id 1-5'
INFO:apache_beam.utils.subprocess_server:b'22/04/20 12:24:07 WARN software.amazon.awssdk.regions.internal.util.EC2MetadataUtils: Unable to retrieve the requested metadata.'
INFO:apache_beam.utils.subprocess_server:b'22/04/20 12:24:07 WARN software.amazon.awssdk.regions.internal.util.EC2MetadataUtils: Unable to retrieve the requested metadata.'
INFO:apache_beam.utils.subprocess_server:b'22/04/20 12:24:07 WARN software.amazon.awssdk.regions.internal.util.EC2MetadataUtils: Unable to retrieve the requested metadata.'
INFO:apache_beam.utils.subprocess_server:b'22/04/20 12:24:07 WARN software.amazon.awssdk.regions.internal.util.EC2MetadataUtils: Unable to retrieve the requested metadata.'
INFO:apache_beam.utils.subprocess_server:b'22/04/20 12:24:07 INFO org.apache.beam.runners.fnexecution.control.FnApiControlClientPoolService: getProcessBundleDescriptor request with id 1-6'
INFO:apache_beam.utils.subprocess_server:b'22/04/20 12:24:07 INFO org.apache.beam.runners.fnexecution.control.FnApiControlClientPoolService: getProcessBundleDescriptor request with id 1-8'
INFO:apache_beam.utils.subprocess_server:b'22/04/20 12:24:07 INFO org.apache.beam.runners.fnexecution.control.FnApiControlClientPoolService: getProcessBundleDescriptor request with id 1-7'
INFO:apache_beam.utils.subprocess_server:b'22/04/20 12:24:07 INFO org.apache.beam.runners.fnexecution.control.FnApiControlClientPoolService: getProcessBundleDescriptor request with id 1-9'
INFO:apache_beam.utils.subprocess_server:b'22/04/20 12:24:08 INFO org.apache.beam.runners.fnexecution.control.FnApiControlClientPoolService: getProcessBundleDescriptor request with id 1-10'
INFO:apache_beam.utils.subprocess_server:b'22/04/20 12:24:08 INFO org.apache.beam.runners.fnexecution.control.FnApiControlClientPoolService: getProcessBundleDescriptor request with id 1-11'
INFO:apache_beam.utils.subprocess_server:b'22/04/20 12:24:08 INFO org.apache.beam.runners.fnexecution.control.FnApiControlClientPoolService: getProcessBundleDescriptor request with id 1-12'
INFO:apache_beam.utils.subprocess_server:b'22/04/20 12:24:08 INFO org.apache.beam.runners.fnexecution.control.FnApiControlClientPoolService: getProcessBundleDescriptor request with id 1-13'
INFO:apache_beam.utils.subprocess_server:b'22/04/20 12:24:08 WARN software.amazon.awssdk.regions.internal.util.EC2MetadataUtils: Unable to retrieve the requested metadata.'
INFO:apache_beam.utils.subprocess_server:b'22/04/20 12:24:08 WARN software.amazon.awssdk.regions.internal.util.EC2MetadataUtils: Unable to retrieve the requested metadata.'
INFO:apache_beam.utils.subprocess_server:b'22/04/20 12:24:08 WARN software.amazon.awssdk.regions.internal.util.EC2MetadataUtils: Unable to retrieve the requested metadata.'
INFO:apache_beam.utils.subprocess_server:b'22/04/20 12:24:08 WARN software.amazon.awssdk.regions.internal.util.EC2MetadataUtils: Unable to retrieve the requested metadata.'
INFO:apache_beam.utils.subprocess_server:b'22/04/20 12:24:08 INFO org.apache.beam.runners.fnexecution.control.FnApiControlClientPoolService: getProcessBundleDescriptor request with id 1-14'
INFO:apache_beam.utils.subprocess_server:b'22/04/20 12:24:08 WARN software.amazon.awssdk.regions.internal.util.EC2MetadataUtils: Unable to retrieve the requested metadata.'
INFO:apache_beam.utils.subprocess_server:b'22/04/20 12:24:08 WARN software.amazon.awssdk.regions.internal.util.EC2MetadataUtils: Unable to retrieve the requested metadata.'
INFO:apache_beam.utils.subprocess_server:b'22/04/20 12:24:08 WARN software.amazon.awssdk.regions.internal.util.EC2MetadataUtils: Unable to retrieve the requested metadata.'
INFO:apache_beam.utils.subprocess_server:b'22/04/20 12:24:08 WARN software.amazon.awssdk.regions.internal.util.EC2MetadataUtils: Unable to retrieve the requested metadata.'
INFO:apache_beam.utils.subprocess_server:b'22/04/20 12:24:08 INFO org.apache.beam.runners.fnexecution.control.FnApiControlClientPoolService: getProcessBundleDescriptor request with id 1-15'
INFO:apache_beam.utils.subprocess_server:b'22/04/20 12:24:08 INFO org.apache.beam.runners.spark.SparkPipelineRunner: Job BeamApp-jenkins-0420122404-ad7a11f4_53e048bd-cddc-42d6-ad4e-1cafc2940824: Pipeline translated successfully. Computing outputs'
INFO:apache_beam.utils.subprocess_server:b'22/04/20 12:24:08 WARN software.amazon.awssdk.regions.internal.util.EC2MetadataUtils: Unable to retrieve the requested metadata.'
INFO:apache_beam.utils.subprocess_server:b'22/04/20 12:24:08 WARN software.amazon.awssdk.regions.internal.util.EC2MetadataUtils: Unable to retrieve the requested metadata.'
INFO:apache_beam.utils.subprocess_server:b'22/04/20 12:24:08 WARN software.amazon.awssdk.regions.internal.util.EC2MetadataUtils: Unable to retrieve the requested metadata.'
INFO:apache_beam.utils.subprocess_server:b'22/04/20 12:24:08 WARN software.amazon.awssdk.regions.internal.util.EC2MetadataUtils: Unable to retrieve the requested metadata.'
INFO:apache_beam.utils.subprocess_server:b'22/04/20 12:24:08 INFO org.apache.beam.runners.fnexecution.control.FnApiControlClientPoolService: getProcessBundleDescriptor request with id 1-16'
INFO:apache_beam.io.filebasedsink:Starting finalize_write threads with num_shards: 4 (skipped: 0), batches: 4, num_threads: 4
INFO:apache_beam.io.filebasedsink:Renamed 4 shards in 0.01 seconds.
INFO:apache_beam.utils.subprocess_server:b'22/04/20 12:24:08 INFO org.apache.beam.runners.spark.SparkPipelineRunner: Job BeamApp-jenkins-0420122404-ad7a11f4_53e048bd-cddc-42d6-ad4e-1cafc2940824 finished.'
INFO:apache_beam.runners.portability.portable_runner:Job state changed to DONE
Exception in thread read_state:
Traceback (most recent call last):
File "/usr/lib/python3.9/threading.py", line 973, in _bootstrap_inner
Exception in thread run_worker_1-1:
self.run()
Traceback (most recent call last):
File "/usr/lib/python3.9/threading.py", line 910, in run
File "/usr/lib/python3.9/threading.py", line 973, in _bootstrap_inner
ERROR:apache_beam.runners.worker.data_plane:Failed to read inputs in the data plane.
Traceback (most recent call last):
File "<https://ci-beam.apache.org/job/beam_PostCommit_Python39/ws/src/sdks/python/apache_beam/runners/worker/data_plane.py",> line 634, in _read_inputs
for elements in elements_iterator:
File "<https://ci-beam.apache.org/job/beam_PostCommit_Python39/ws/src/build/gradleenv/2022703443/lib/python3.9/site-packages/grpc/_channel.py",> line 426, in __next__
return self._next()
File "<https://ci-beam.apache.org/job/beam_PostCommit_Python39/ws/src/build/gradleenv/2022703443/lib/python3.9/site-packages/grpc/_channel.py",> line 826, in _next
raise self
grpc._channel._MultiThreadedRendezvous: <_MultiThreadedRendezvous of RPC that terminated with:
status = StatusCode.UNAVAILABLE
details = "Socket closed"
debug_error_string = "{"created":"@1650457448.935211739","description":"Error received from peer ipv6:[::1]:33505","file":"src/core/lib/surface/call.cc","file_line":903,"grpc_message":"Socket closed","grpc_status":14}"
>
self._target(*self._args, **self._kwargs)
File "<https://ci-beam.apache.org/job/beam_PostCommit_Python39/ws/src/sdks/python/apache_beam/runners/worker/sdk_worker.py",> line 990, in pull_responses
self.run()
File "/usr/lib/python3.9/threading.py", line 910, in run
Exception in thread read_grpc_client_inputs:
Traceback (most recent call last):
File "/usr/lib/python3.9/threading.py", line 973, in _bootstrap_inner
self._target(*self._args, **self._kwargs)
self.run()
File "<https://ci-beam.apache.org/job/beam_PostCommit_Python39/ws/src/sdks/python/apache_beam/runners/worker/sdk_worker.py",> line 234, in run
for response in responses:
File "/usr/lib/python3.9/threading.py", line 910, in run
File "<https://ci-beam.apache.org/job/beam_PostCommit_Python39/ws/src/build/gradleenv/2022703443/lib/python3.9/site-packages/grpc/_channel.py",> line 426, in __next__
for work_request in self._control_stub.Control(get_responses()):
File "<https://ci-beam.apache.org/job/beam_PostCommit_Python39/ws/src/build/gradleenv/2022703443/lib/python3.9/site-packages/grpc/_channel.py",> line 426, in __next__
self._target(*self._args, **self._kwargs)
return self._next()
return self._next()
File "<https://ci-beam.apache.org/job/beam_PostCommit_Python39/ws/src/build/gradleenv/2022703443/lib/python3.9/site-packages/grpc/_channel.py",> line 826, in _next
File "<https://ci-beam.apache.org/job/beam_PostCommit_Python39/ws/src/build/gradleenv/2022703443/lib/python3.9/site-packages/grpc/_channel.py",> line 826, in _next
File "<https://ci-beam.apache.org/job/beam_PostCommit_Python39/ws/src/sdks/python/apache_beam/runners/worker/data_plane.py",> line 651, in <lambda>
raise self
raise self
grpc._channel._MultiThreadedRendezvous: <_MultiThreadedRendezvous of RPC that terminated with:
status = StatusCode.UNAVAILABLE
details = "Socket closed"
debug_error_string = "{"created":"@1650457448.935254882","description":"Error received from peer ipv6:[::1]:34273","file":"src/core/lib/surface/call.cc","file_line":903,"grpc_message":"Socket closed","grpc_status":14}"
>
target=lambda: self._read_inputs(elements_iterator),
grpc._channel._MultiThreadedRendezvous: <_MultiThreadedRendezvous of RPC that terminated with:
status = StatusCode.UNAVAILABLE
details = "Socket closed"
debug_error_string = "{"created":"@1650457448.935225357","description":"Error received from peer ipv6:[::1]:42829","file":"src/core/lib/surface/call.cc","file_line":903,"grpc_message":"Socket closed","grpc_status":14}"
>
File "<https://ci-beam.apache.org/job/beam_PostCommit_Python39/ws/src/sdks/python/apache_beam/runners/worker/data_plane.py",> line 634, in _read_inputs
for elements in elements_iterator:
File "<https://ci-beam.apache.org/job/beam_PostCommit_Python39/ws/src/build/gradleenv/2022703443/lib/python3.9/site-packages/grpc/_channel.py",> line 426, in __next__
return self._next()
File "<https://ci-beam.apache.org/job/beam_PostCommit_Python39/ws/src/build/gradleenv/2022703443/lib/python3.9/site-packages/grpc/_channel.py",> line 826, in _next
raise self
grpc._channel._MultiThreadedRendezvous: <_MultiThreadedRendezvous of RPC that terminated with:
status = StatusCode.UNAVAILABLE
details = "Socket closed"
debug_error_string = "{"created":"@1650457448.935211739","description":"Error received from peer ipv6:[::1]:33505","file":"src/core/lib/surface/call.cc","file_line":903,"grpc_message":"Socket closed","grpc_status":14}"
>
> Task :sdks:python:test-suites:portable:py39:postCommitPy39
> Task :sdks:python:test-suites:dataflow:py39:postCommitIT
E0420 12:26:13.177863183 1065242 fork_posix.cc:70] Fork support is only compatible with the epoll1 and poll polling strategies
E0420 12:26:14.576305898 1065280 fork_posix.cc:70] Fork support is only compatible with the epoll1 and poll polling strategies
E0420 12:28:05.250666732 1065248 fork_posix.cc:70] Fork support is only compatible with the epoll1 and poll polling strategies
E0420 12:31:02.334557335 1065230 fork_posix.cc:70] Fork support is only compatible with the epoll1 and poll polling strategies
E0420 12:33:21.837819236 1065242 fork_posix.cc:70] Fork support is only compatible with the epoll1 and poll polling strategies
E0420 12:34:32.318977140 1065280 fork_posix.cc:70] Fork support is only compatible with the epoll1 and poll polling strategies
E0420 12:38:38.968980929 1065230 fork_posix.cc:70] Fork support is only compatible with the epoll1 and poll polling strategies
E0420 12:41:21.899022524 1065280 fork_posix.cc:70] Fork support is only compatible with the epoll1 and poll polling strategies
E0420 12:47:46.505044773 1065230 fork_posix.cc:70] Fork support is only compatible with the epoll1 and poll polling strategies
E0420 12:49:40.254745837 1065280 fork_posix.cc:70] Fork support is only compatible with the epoll1 and poll polling strategies
E0420 12:54:39.376587575 1065230 fork_posix.cc:70] Fork support is only compatible with the epoll1 and poll polling strategies
E0420 13:02:35.423851753 1065230 fork_posix.cc:70] Fork support is only compatible with the epoll1 and poll polling strategies
E0420 13:06:50.104567255 1065280 fork_posix.cc:70] Fork support is only compatible with the epoll1 and poll polling strategies
E0420 13:08:51.967425108 1065230 fork_posix.cc:70] Fork support is only compatible with the epoll1 and poll polling strategies
E0420 13:16:33.989634414 1065230 fork_posix.cc:70] Fork support is only compatible with the epoll1 and poll polling strategies
E0420 13:22:19.870723005 1065309 fork_posix.cc:70] Fork support is only compatible with the epoll1 and poll polling strategies
E0420 13:22:47.192899620 1065230 fork_posix.cc:70] Fork support is only compatible with the epoll1 and poll polling strategies
E0420 13:23:30.573159058 1065280 fork_posix.cc:70] Fork support is only compatible with the epoll1 and poll polling strategies
E0420 13:29:44.008684661 1065230 fork_posix.cc:70] Fork support is only compatible with the epoll1 and poll polling strategies
E0420 13:33:02.279852744 1065309 fork_posix.cc:70] Fork support is only compatible with the epoll1 and poll polling strategies
E0420 13:37:13.243382277 1065230 fork_posix.cc:70] Fork support is only compatible with the epoll1 and poll polling strategies
> Task :sdks:python:test-suites:dataflow:py39:postCommitIT FAILED
FAILURE: Build failed with an exception.
* Where:
Script '<https://ci-beam.apache.org/job/beam_PostCommit_Python39/ws/src/sdks/python/test-suites/dataflow/common.gradle'> line: 121
* What went wrong:
Execution failed for task ':sdks:python:test-suites:dataflow:py39:postCommitIT'.
> Process 'command 'sh'' finished with non-zero exit value 1
* Try:
> Run with --stacktrace option to get the stack trace.
> Run with --info or --debug option to get more log output.
> Run with --scan to get full insights.
* Get more help at https://help.gradle.org
Deprecated Gradle features were used in this build, making it incompatible with Gradle 8.0.
You can use '--warning-mode all' to show the individual deprecation warnings and determine if they come from your own scripts or plugins.
See https://docs.gradle.org/7.4/userguide/command_line_interface.html#sec:command_line_warnings
Execution optimizations have been disabled for 1 invalid unit(s) of work during this build to ensure correctness.
Please consult deprecation warnings for more details.
BUILD FAILED in 1h 32m 59s
219 actionable tasks: 150 executed, 63 from cache, 6 up-to-date
Publishing build scan...
https://gradle.com/s/a5yknm4jz7lgi
Build step 'Invoke Gradle script' changed build result to FAILURE
Build step 'Invoke Gradle script' marked build as failure
---------------------------------------------------------------------
To unsubscribe, e-mail: builds-unsubscribe@beam.apache.org
For additional commands, e-mail: builds-help@beam.apache.org
Build failed in Jenkins: beam_PostCommit_Python39 #268
Posted by Apache Jenkins Server <je...@builds.apache.org>.
See <https://ci-beam.apache.org/job/beam_PostCommit_Python39/268/display/redirect>
Changes:
------------------------------------------
[...truncated 33.06 MB...]
thread: "MainThread"
INFO:root:severity: INFO
timestamp {
seconds: 1650435727
nanos: 73896169
}
message: "Closing all cached grpc data channels."
log_location: "/usr/local/lib/python3.9/site-packages/apache_beam/runners/worker/data_plane.py:782"
thread: "MainThread"
INFO:root:severity: INFO
timestamp {
seconds: 1650435727
nanos: 73964357
}
message: "Closing all cached gRPC state handlers."
log_location: "/usr/local/lib/python3.9/site-packages/apache_beam/runners/worker/sdk_worker.py:859"
thread: "MainThread"
INFO:root:severity: INFO
timestamp {
seconds: 1650435727
nanos: 74934720
}
message: "Done consuming work."
log_location: "/usr/local/lib/python3.9/site-packages/apache_beam/runners/worker/sdk_worker.py:257"
thread: "MainThread"
INFO:root:severity: INFO
timestamp {
seconds: 1650435727
nanos: 75078964
}
message: "Python sdk harness exiting."
log_location: "/usr/local/lib/python3.9/site-packages/apache_beam/runners/worker/sdk_worker_main.py:181"
thread: "MainThread"
INFO:apache_beam.runners.portability.local_job_service:Completed job in 9.859870910644531 seconds with state DONE.
INFO:root:Completed job in 9.859870910644531 seconds with state DONE.
INFO:apache_beam.runners.portability.portable_runner:Job state changed to DONE
> Task :sdks:python:test-suites:portable:py39:portableWordCountSparkRunnerBatch
INFO:apache_beam.runners.worker.worker_pool_main:Listening for workers at localhost:41153
WARNING:root:Make sure that locally built Python SDK docker image has Python 3.9 interpreter.
INFO:root:Default Python SDK image for environment is apache/beam_python3.9_sdk:2.39.0.dev
INFO:apache_beam.runners.portability.fn_api_runner.translations:==================== <function pack_combiners at 0x7f66c3d59c10> ====================
INFO:apache_beam.runners.portability.fn_api_runner.translations:==================== <function lift_combiners at 0x7f66c3d59ca0> ====================
INFO:apache_beam.runners.portability.fn_api_runner.translations:==================== <function sort_stages at 0x7f66c3d5a430> ====================
INFO:apache_beam.utils.subprocess_server:Starting service with ['java' '-jar' '<https://ci-beam.apache.org/job/beam_PostCommit_Python39/ws/src/runners/spark/2/job-server/build/libs/beam-runners-spark-job-server-2.39.0-SNAPSHOT.jar'> '--spark-master-url' 'local[4]' '--artifacts-dir' '/tmp/beam-tempgr55l_il/artifactsm8_e2cry' '--job-port' '44075' '--artifact-port' '0' '--expansion-port' '0']
E0420 06:22:10.208198827 750552 fork_posix.cc:70] Fork support is only compatible with the epoll1 and poll polling strategies
INFO:apache_beam.utils.subprocess_server:b'22/04/20 06:22:11 WARN software.amazon.awssdk.regions.internal.util.EC2MetadataUtils: Unable to retrieve the requested metadata.'
INFO:apache_beam.utils.subprocess_server:b'22/04/20 06:22:12 INFO org.apache.beam.runners.jobsubmission.JobServerDriver: ArtifactStagingService started on localhost:38049'
INFO:apache_beam.utils.subprocess_server:b'22/04/20 06:22:12 INFO org.apache.beam.runners.jobsubmission.JobServerDriver: Java ExpansionService started on localhost:45051'
INFO:apache_beam.utils.subprocess_server:b'22/04/20 06:22:12 INFO org.apache.beam.runners.jobsubmission.JobServerDriver: JobService started on localhost:44075'
INFO:apache_beam.utils.subprocess_server:b'22/04/20 06:22:12 INFO org.apache.beam.runners.jobsubmission.JobServerDriver: Job server now running, terminate with Ctrl+C'
WARNING:apache_beam.options.pipeline_options:Discarding unparseable args: ['--parallelism=2']
INFO:apache_beam.utils.subprocess_server:b'22/04/20 06:22:13 INFO org.apache.beam.runners.fnexecution.artifact.ArtifactStagingService: Staging artifacts for job_54fea1cb-91ec-4d84-99a1-8c29b2bfe91e.'
INFO:apache_beam.utils.subprocess_server:b'22/04/20 06:22:13 INFO org.apache.beam.runners.fnexecution.artifact.ArtifactStagingService: Resolving artifacts for job_54fea1cb-91ec-4d84-99a1-8c29b2bfe91e.ref_Environment_default_environment_1.'
INFO:apache_beam.utils.subprocess_server:b'22/04/20 06:22:13 INFO org.apache.beam.runners.fnexecution.artifact.ArtifactStagingService: Getting 1 artifacts for job_54fea1cb-91ec-4d84-99a1-8c29b2bfe91e.null.'
INFO:apache_beam.utils.subprocess_server:b'22/04/20 06:22:13 INFO org.apache.beam.runners.fnexecution.artifact.ArtifactStagingService: Artifacts fully staged for job_54fea1cb-91ec-4d84-99a1-8c29b2bfe91e.'
INFO:apache_beam.utils.subprocess_server:b'22/04/20 06:22:13 INFO org.apache.beam.runners.spark.SparkJobInvoker: Invoking job BeamApp-jenkins-0420062213-29f0d16a_ced202a2-d024-4e76-92af-e96ba2f15fac'
INFO:apache_beam.utils.subprocess_server:b'22/04/20 06:22:13 INFO org.apache.beam.runners.jobsubmission.JobInvocation: Starting job invocation BeamApp-jenkins-0420062213-29f0d16a_ced202a2-d024-4e76-92af-e96ba2f15fac'
INFO:apache_beam.runners.portability.portable_runner:Environment "LOOPBACK" has started a component necessary for the execution. Be sure to run the pipeline using
with Pipeline() as p:
p.apply(..)
This ensures that the pipeline finishes before this program exits.
INFO:apache_beam.runners.portability.portable_runner:Job state changed to STOPPED
INFO:apache_beam.runners.portability.portable_runner:Job state changed to STARTING
INFO:apache_beam.runners.portability.portable_runner:Job state changed to RUNNING
INFO:apache_beam.utils.subprocess_server:b'22/04/20 06:22:13 INFO org.apache.beam.runners.spark.translation.SparkContextFactory: Creating a brand new Spark Context.'
INFO:apache_beam.utils.subprocess_server:b'22/04/20 06:22:13 WARN org.apache.hadoop.util.NativeCodeLoader: Unable to load native-hadoop library for your platform... using builtin-java classes where applicable'
INFO:apache_beam.utils.subprocess_server:b'22/04/20 06:22:14 INFO org.apache.beam.runners.spark.aggregators.AggregatorsAccumulator: Instantiated aggregators accumulator:'
INFO:apache_beam.utils.subprocess_server:b'22/04/20 06:22:14 INFO org.apache.beam.runners.spark.metrics.MetricsAccumulator: Instantiated metrics accumulator: MetricQueryResults()'
INFO:apache_beam.utils.subprocess_server:b'22/04/20 06:22:14 WARN software.amazon.awssdk.regions.internal.util.EC2MetadataUtils: Unable to retrieve the requested metadata.'
INFO:apache_beam.utils.subprocess_server:b'22/04/20 06:22:14 INFO org.apache.beam.runners.spark.SparkPipelineRunner: Running job BeamApp-jenkins-0420062213-29f0d16a_ced202a2-d024-4e76-92af-e96ba2f15fac on Spark master local[4]'
INFO:apache_beam.utils.subprocess_server:b'22/04/20 06:22:15 WARN software.amazon.awssdk.regions.internal.util.EC2MetadataUtils: Unable to retrieve the requested metadata.'
INFO:apache_beam.utils.subprocess_server:b'22/04/20 06:22:15 WARN software.amazon.awssdk.regions.internal.util.EC2MetadataUtils: Unable to retrieve the requested metadata.'
INFO:apache_beam.utils.subprocess_server:b'22/04/20 06:22:15 WARN software.amazon.awssdk.regions.internal.util.EC2MetadataUtils: Unable to retrieve the requested metadata.'
INFO:apache_beam.utils.subprocess_server:b'22/04/20 06:22:15 WARN software.amazon.awssdk.regions.internal.util.EC2MetadataUtils: Unable to retrieve the requested metadata.'
INFO:apache_beam.runners.worker.statecache:Creating state cache with size 0
INFO:apache_beam.runners.worker.sdk_worker:Creating insecure control channel for localhost:46633.
INFO:apache_beam.runners.worker.sdk_worker:Control channel established.
INFO:apache_beam.runners.worker.sdk_worker:Initializing SDKHarness with unbounded number of workers.
INFO:apache_beam.utils.subprocess_server:b'22/04/20 06:22:15 INFO org.apache.beam.runners.fnexecution.control.FnApiControlClientPoolService: Beam Fn Control client connected with id 1-1'
INFO:apache_beam.utils.subprocess_server:b'22/04/20 06:22:15 INFO org.apache.beam.runners.fnexecution.control.FnApiControlClientPoolService: getProcessBundleDescriptor request with id 1-2'
INFO:apache_beam.runners.worker.sdk_worker:Creating insecure state channel for localhost:42405.
INFO:apache_beam.runners.worker.sdk_worker:State channel established.
INFO:apache_beam.runners.worker.data_plane:Creating client data channel for localhost:43049
INFO:apache_beam.utils.subprocess_server:b'22/04/20 06:22:15 INFO org.apache.beam.runners.fnexecution.data.GrpcDataService: Beam Fn Data client connected.'
INFO:apache_beam.utils.subprocess_server:b'22/04/20 06:22:15 INFO org.apache.beam.runners.fnexecution.control.FnApiControlClientPoolService: getProcessBundleDescriptor request with id 1-3'
INFO:apache_beam.utils.subprocess_server:b'22/04/20 06:22:16 WARN software.amazon.awssdk.regions.internal.util.EC2MetadataUtils: Unable to retrieve the requested metadata.'
INFO:apache_beam.utils.subprocess_server:b'22/04/20 06:22:16 WARN software.amazon.awssdk.regions.internal.util.EC2MetadataUtils: Unable to retrieve the requested metadata.'
INFO:apache_beam.utils.subprocess_server:b'22/04/20 06:22:16 WARN software.amazon.awssdk.regions.internal.util.EC2MetadataUtils: Unable to retrieve the requested metadata.'
INFO:apache_beam.utils.subprocess_server:b'22/04/20 06:22:16 WARN software.amazon.awssdk.regions.internal.util.EC2MetadataUtils: Unable to retrieve the requested metadata.'
INFO:apache_beam.utils.subprocess_server:b'22/04/20 06:22:16 INFO org.apache.beam.runners.fnexecution.control.FnApiControlClientPoolService: getProcessBundleDescriptor request with id 1-4'
INFO:apache_beam.utils.subprocess_server:b'22/04/20 06:22:16 INFO org.apache.beam.runners.fnexecution.control.FnApiControlClientPoolService: getProcessBundleDescriptor request with id 1-5'
INFO:apache_beam.utils.subprocess_server:b'22/04/20 06:22:16 WARN software.amazon.awssdk.regions.internal.util.EC2MetadataUtils: Unable to retrieve the requested metadata.'
INFO:apache_beam.utils.subprocess_server:b'22/04/20 06:22:16 WARN software.amazon.awssdk.regions.internal.util.EC2MetadataUtils: Unable to retrieve the requested metadata.'
INFO:apache_beam.utils.subprocess_server:b'22/04/20 06:22:16 WARN software.amazon.awssdk.regions.internal.util.EC2MetadataUtils: Unable to retrieve the requested metadata.'
INFO:apache_beam.utils.subprocess_server:b'22/04/20 06:22:16 WARN software.amazon.awssdk.regions.internal.util.EC2MetadataUtils: Unable to retrieve the requested metadata.'
INFO:apache_beam.utils.subprocess_server:b'22/04/20 06:22:16 INFO org.apache.beam.runners.fnexecution.control.FnApiControlClientPoolService: getProcessBundleDescriptor request with id 1-7'
INFO:apache_beam.utils.subprocess_server:b'22/04/20 06:22:16 INFO org.apache.beam.runners.fnexecution.control.FnApiControlClientPoolService: getProcessBundleDescriptor request with id 1-8'
INFO:apache_beam.utils.subprocess_server:b'22/04/20 06:22:16 INFO org.apache.beam.runners.fnexecution.control.FnApiControlClientPoolService: getProcessBundleDescriptor request with id 1-6'
INFO:apache_beam.utils.subprocess_server:b'22/04/20 06:22:16 INFO org.apache.beam.runners.fnexecution.control.FnApiControlClientPoolService: getProcessBundleDescriptor request with id 1-9'
INFO:apache_beam.utils.subprocess_server:b'22/04/20 06:22:16 INFO org.apache.beam.runners.fnexecution.control.FnApiControlClientPoolService: getProcessBundleDescriptor request with id 1-10'
INFO:apache_beam.utils.subprocess_server:b'22/04/20 06:22:16 INFO org.apache.beam.runners.fnexecution.control.FnApiControlClientPoolService: getProcessBundleDescriptor request with id 1-11'
INFO:apache_beam.utils.subprocess_server:b'22/04/20 06:22:16 INFO org.apache.beam.runners.fnexecution.control.FnApiControlClientPoolService: getProcessBundleDescriptor request with id 1-12'
INFO:apache_beam.utils.subprocess_server:b'22/04/20 06:22:16 INFO org.apache.beam.runners.fnexecution.control.FnApiControlClientPoolService: getProcessBundleDescriptor request with id 1-13'
INFO:apache_beam.utils.subprocess_server:b'22/04/20 06:22:16 WARN software.amazon.awssdk.regions.internal.util.EC2MetadataUtils: Unable to retrieve the requested metadata.'
INFO:apache_beam.utils.subprocess_server:b'22/04/20 06:22:16 WARN software.amazon.awssdk.regions.internal.util.EC2MetadataUtils: Unable to retrieve the requested metadata.'
INFO:apache_beam.utils.subprocess_server:b'22/04/20 06:22:16 WARN software.amazon.awssdk.regions.internal.util.EC2MetadataUtils: Unable to retrieve the requested metadata.'
INFO:apache_beam.utils.subprocess_server:b'22/04/20 06:22:16 WARN software.amazon.awssdk.regions.internal.util.EC2MetadataUtils: Unable to retrieve the requested metadata.'
INFO:apache_beam.utils.subprocess_server:b'22/04/20 06:22:16 INFO org.apache.beam.runners.fnexecution.control.FnApiControlClientPoolService: getProcessBundleDescriptor request with id 1-14'
INFO:apache_beam.utils.subprocess_server:b'22/04/20 06:22:16 WARN software.amazon.awssdk.regions.internal.util.EC2MetadataUtils: Unable to retrieve the requested metadata.'
INFO:apache_beam.utils.subprocess_server:b'22/04/20 06:22:16 WARN software.amazon.awssdk.regions.internal.util.EC2MetadataUtils: Unable to retrieve the requested metadata.'
INFO:apache_beam.utils.subprocess_server:b'22/04/20 06:22:16 WARN software.amazon.awssdk.regions.internal.util.EC2MetadataUtils: Unable to retrieve the requested metadata.'
INFO:apache_beam.utils.subprocess_server:b'22/04/20 06:22:16 WARN software.amazon.awssdk.regions.internal.util.EC2MetadataUtils: Unable to retrieve the requested metadata.'
INFO:apache_beam.utils.subprocess_server:b'22/04/20 06:22:16 INFO org.apache.beam.runners.fnexecution.control.FnApiControlClientPoolService: getProcessBundleDescriptor request with id 1-15'
INFO:apache_beam.utils.subprocess_server:b'22/04/20 06:22:16 INFO org.apache.beam.runners.spark.SparkPipelineRunner: Job BeamApp-jenkins-0420062213-29f0d16a_ced202a2-d024-4e76-92af-e96ba2f15fac: Pipeline translated successfully. Computing outputs'
INFO:apache_beam.utils.subprocess_server:b'22/04/20 06:22:16 WARN software.amazon.awssdk.regions.internal.util.EC2MetadataUtils: Unable to retrieve the requested metadata.'
INFO:apache_beam.utils.subprocess_server:b'22/04/20 06:22:16 WARN software.amazon.awssdk.regions.internal.util.EC2MetadataUtils: Unable to retrieve the requested metadata.'
INFO:apache_beam.utils.subprocess_server:b'22/04/20 06:22:16 WARN software.amazon.awssdk.regions.internal.util.EC2MetadataUtils: Unable to retrieve the requested metadata.'
INFO:apache_beam.utils.subprocess_server:b'22/04/20 06:22:16 WARN software.amazon.awssdk.regions.internal.util.EC2MetadataUtils: Unable to retrieve the requested metadata.'
INFO:apache_beam.utils.subprocess_server:b'22/04/20 06:22:16 INFO org.apache.beam.runners.fnexecution.control.FnApiControlClientPoolService: getProcessBundleDescriptor request with id 1-16'
INFO:apache_beam.io.filebasedsink:Starting finalize_write threads with num_shards: 4 (skipped: 0), batches: 4, num_threads: 4
INFO:apache_beam.io.filebasedsink:Renamed 4 shards in 0.01 seconds.
INFO:apache_beam.utils.subprocess_server:b'22/04/20 06:22:16 INFO org.apache.beam.runners.spark.SparkPipelineRunner: Job BeamApp-jenkins-0420062213-29f0d16a_ced202a2-d024-4e76-92af-e96ba2f15fac finished.'
INFO:apache_beam.runners.portability.portable_runner:Job state changed to DONE
Exception in thread run_worker_1-1:
Exception in thread read_state:
Traceback (most recent call last):
Traceback (most recent call last):
File "/usr/lib/python3.9/threading.py", line 973, in _bootstrap_inner
File "/usr/lib/python3.9/threading.py", line 973, in _bootstrap_inner
self.run()
self.run()
ERROR:apache_beam.runners.worker.data_plane:Failed to read inputs in the data plane.
Traceback (most recent call last):
File "<https://ci-beam.apache.org/job/beam_PostCommit_Python39/ws/src/sdks/python/apache_beam/runners/worker/data_plane.py",> line 634, in _read_inputs
for elements in elements_iterator:
File "<https://ci-beam.apache.org/job/beam_PostCommit_Python39/ws/src/build/gradleenv/2022703443/lib/python3.9/site-packages/grpc/_channel.py",> line 426, in __next__
return self._next()
File "<https://ci-beam.apache.org/job/beam_PostCommit_Python39/ws/src/build/gradleenv/2022703443/lib/python3.9/site-packages/grpc/_channel.py",> line 826, in _next
raise self
grpc._channel._MultiThreadedRendezvous: <_MultiThreadedRendezvous of RPC that terminated with:
status = StatusCode.UNAVAILABLE
details = "Connection reset by peer"
debug_error_string = "{"created":"@1650435737.219169995","description":"Error received from peer ipv6:[::1]:43049","file":"src/core/lib/surface/call.cc","file_line":903,"grpc_message":"Connection reset by peer","grpc_status":14}"
>
File "/usr/lib/python3.9/threading.py", line 910, in run
File "/usr/lib/python3.9/threading.py", line 910, in run
Exception in thread read_grpc_client_inputs:
self._target(*self._args, **self._kwargs)
File "<https://ci-beam.apache.org/job/beam_PostCommit_Python39/ws/src/sdks/python/apache_beam/runners/worker/sdk_worker.py",> line 990, in pull_responses
self._target(*self._args, **self._kwargs)
Traceback (most recent call last):
File "/usr/lib/python3.9/threading.py", line 973, in _bootstrap_inner
File "<https://ci-beam.apache.org/job/beam_PostCommit_Python39/ws/src/sdks/python/apache_beam/runners/worker/sdk_worker.py",> line 234, in run
for response in responses:
File "<https://ci-beam.apache.org/job/beam_PostCommit_Python39/ws/src/build/gradleenv/2022703443/lib/python3.9/site-packages/grpc/_channel.py",> line 426, in __next__
return self._next()
self.run()
File "<https://ci-beam.apache.org/job/beam_PostCommit_Python39/ws/src/build/gradleenv/2022703443/lib/python3.9/site-packages/grpc/_channel.py",> line 826, in _next
for work_request in self._control_stub.Control(get_responses()):
File "/usr/lib/python3.9/threading.py", line 910, in run
File "<https://ci-beam.apache.org/job/beam_PostCommit_Python39/ws/src/build/gradleenv/2022703443/lib/python3.9/site-packages/grpc/_channel.py",> line 426, in __next__
raise self
self._target(*self._args, **self._kwargs)
File "<https://ci-beam.apache.org/job/beam_PostCommit_Python39/ws/src/sdks/python/apache_beam/runners/worker/data_plane.py",> line 651, in <lambda>
grpc._channel._MultiThreadedRendezvous: <_MultiThreadedRendezvous of RPC that terminated with:
status = StatusCode.UNAVAILABLE
details = "Socket closed"
debug_error_string = "{"created":"@1650435737.219173085","description":"Error received from peer ipv6:[::1]:42405","file":"src/core/lib/surface/call.cc","file_line":903,"grpc_message":"Socket closed","grpc_status":14}"
>
return self._next()
File "<https://ci-beam.apache.org/job/beam_PostCommit_Python39/ws/src/build/gradleenv/2022703443/lib/python3.9/site-packages/grpc/_channel.py",> line 826, in _next
target=lambda: self._read_inputs(elements_iterator),
File "<https://ci-beam.apache.org/job/beam_PostCommit_Python39/ws/src/sdks/python/apache_beam/runners/worker/data_plane.py",> line 634, in _read_inputs
raise self
for elements in elements_iterator:
grpc._channel._MultiThreadedRendezvous: <_MultiThreadedRendezvous of RPC that terminated with:
status = StatusCode.UNAVAILABLE
details = "Socket closed"
debug_error_string = "{"created":"@1650435737.219230441","description":"Error received from peer ipv6:[::1]:46633","file":"src/core/lib/surface/call.cc","file_line":903,"grpc_message":"Socket closed","grpc_status":14}"
>
File "<https://ci-beam.apache.org/job/beam_PostCommit_Python39/ws/src/build/gradleenv/2022703443/lib/python3.9/site-packages/grpc/_channel.py",> line 426, in __next__
return self._next()
File "<https://ci-beam.apache.org/job/beam_PostCommit_Python39/ws/src/build/gradleenv/2022703443/lib/python3.9/site-packages/grpc/_channel.py",> line 826, in _next
raise self
grpc._channel._MultiThreadedRendezvous: <_MultiThreadedRendezvous of RPC that terminated with:
status = StatusCode.UNAVAILABLE
details = "Connection reset by peer"
debug_error_string = "{"created":"@1650435737.219169995","description":"Error received from peer ipv6:[::1]:43049","file":"src/core/lib/surface/call.cc","file_line":903,"grpc_message":"Connection reset by peer","grpc_status":14}"
>
> Task :sdks:python:test-suites:portable:py39:postCommitPy39
> Task :sdks:python:test-suites:dataflow:py39:postCommitIT
E0420 06:23:09.996989956 726095 fork_posix.cc:70] Fork support is only compatible with the epoll1 and poll polling strategies
E0420 06:25:42.417822952 726155 fork_posix.cc:70] Fork support is only compatible with the epoll1 and poll polling strategies
E0420 06:27:49.551002802 726118 fork_posix.cc:70] Fork support is only compatible with the epoll1 and poll polling strategies
E0420 06:29:11.390898390 726098 fork_posix.cc:70] Fork support is only compatible with the epoll1 and poll polling strategies
E0420 06:32:48.927515400 726155 fork_posix.cc:70] Fork support is only compatible with the epoll1 and poll polling strategies
E0420 06:34:40.637004777 726118 fork_posix.cc:70] Fork support is only compatible with the epoll1 and poll polling strategies
E0420 06:35:36.042353302 726098 fork_posix.cc:70] Fork support is only compatible with the epoll1 and poll polling strategies
E0420 06:40:39.744609072 726155 fork_posix.cc:70] Fork support is only compatible with the epoll1 and poll polling strategies
E0420 06:44:56.750583698 726098 fork_posix.cc:70] Fork support is only compatible with the epoll1 and poll polling strategies
E0420 06:49:07.886752933 726155 fork_posix.cc:70] Fork support is only compatible with the epoll1 and poll polling strategies
E0420 06:53:17.289294877 726098 fork_posix.cc:70] Fork support is only compatible with the epoll1 and poll polling strategies
E0420 07:04:04.112263915 726098 fork_posix.cc:70] Fork support is only compatible with the epoll1 and poll polling strategies
E0420 07:06:08.108571015 726155 fork_posix.cc:70] Fork support is only compatible with the epoll1 and poll polling strategies
E0420 07:22:48.554884110 726155 fork_posix.cc:70] Fork support is only compatible with the epoll1 and poll polling strategies
> Task :sdks:python:test-suites:dataflow:py39:postCommitIT FAILED
FAILURE: Build failed with an exception.
* Where:
Script '<https://ci-beam.apache.org/job/beam_PostCommit_Python39/ws/src/sdks/python/test-suites/dataflow/common.gradle'> line: 121
* What went wrong:
Execution failed for task ':sdks:python:test-suites:dataflow:py39:postCommitIT'.
> Process 'command 'sh'' finished with non-zero exit value 1
* Try:
> Run with --stacktrace option to get the stack trace.
> Run with --info or --debug option to get more log output.
> Run with --scan to get full insights.
* Get more help at https://help.gradle.org
Deprecated Gradle features were used in this build, making it incompatible with Gradle 8.0.
You can use '--warning-mode all' to show the individual deprecation warnings and determine if they come from your own scripts or plugins.
See https://docs.gradle.org/7.4/userguide/command_line_interface.html#sec:command_line_warnings
Execution optimizations have been disabled for 1 invalid unit(s) of work during this build to ensure correctness.
Please consult deprecation warnings for more details.
BUILD FAILED in 2h 2m 9s
219 actionable tasks: 149 executed, 64 from cache, 6 up-to-date
Publishing build scan...
https://gradle.com/s/yllfuec5mcxli
Build step 'Invoke Gradle script' changed build result to FAILURE
Build step 'Invoke Gradle script' marked build as failure
---------------------------------------------------------------------
To unsubscribe, e-mail: builds-unsubscribe@beam.apache.org
For additional commands, e-mail: builds-help@beam.apache.org
Build failed in Jenkins: beam_PostCommit_Python39 #267
Posted by Apache Jenkins Server <je...@builds.apache.org>.
See <https://ci-beam.apache.org/job/beam_PostCommit_Python39/267/display/redirect?page=changes>
Changes:
[andyye333] Change func to PTransform
[noreply] Populate actual dataflow job id to bigquery write trace id (#17130)
[relax] mark static thread as a daemon thread
[noreply] [BEAM-13866] Add miscellaneous exec unit tests (#17363)
------------------------------------------
[...truncated 21.67 MB...]
nanos: 179529666
}
message: "Closing all cached gRPC state handlers."
log_location: "/usr/local/lib/python3.9/site-packages/apache_beam/runners/worker/sdk_worker.py:859"
thread: "MainThread"
INFO:root:severity: INFO
timestamp {
seconds: 1650414155
nanos: 180145502
}
message: "Done consuming work."
log_location: "/usr/local/lib/python3.9/site-packages/apache_beam/runners/worker/sdk_worker.py:257"
thread: "MainThread"
INFO:root:severity: INFO
timestamp {
seconds: 1650414155
nanos: 180217266
}
message: "Python sdk harness exiting."
log_location: "/usr/local/lib/python3.9/site-packages/apache_beam/runners/worker/sdk_worker_main.py:181"
thread: "MainThread"
INFO:apache_beam.runners.portability.local_job_service:Completed job in 10.066091537475586 seconds with state DONE.
INFO:root:Completed job in 10.066091537475586 seconds with state DONE.
INFO:apache_beam.runners.portability.portable_runner:Job state changed to DONE
> Task :sdks:python:test-suites:portable:py39:portableWordCountSparkRunnerBatch
INFO:apache_beam.runners.worker.worker_pool_main:Listening for workers at localhost:35077
WARNING:root:Make sure that locally built Python SDK docker image has Python 3.9 interpreter.
INFO:root:Default Python SDK image for environment is apache/beam_python3.9_sdk:2.39.0.dev
INFO:apache_beam.runners.portability.fn_api_runner.translations:==================== <function pack_combiners at 0x7f61b75aec10> ====================
INFO:apache_beam.runners.portability.fn_api_runner.translations:==================== <function lift_combiners at 0x7f61b75aeca0> ====================
INFO:apache_beam.runners.portability.fn_api_runner.translations:==================== <function sort_stages at 0x7f61b75b5430> ====================
INFO:apache_beam.utils.subprocess_server:Starting service with ['java' '-jar' '<https://ci-beam.apache.org/job/beam_PostCommit_Python39/ws/src/runners/spark/2/job-server/build/libs/beam-runners-spark-job-server-2.39.0-SNAPSHOT.jar'> '--spark-master-url' 'local[4]' '--artifacts-dir' '/tmp/beam-tempqatnufk2/artifacts4_imts5h' '--job-port' '40533' '--artifact-port' '0' '--expansion-port' '0']
E0420 00:22:38.465402077 548440 fork_posix.cc:70] Fork support is only compatible with the epoll1 and poll polling strategies
INFO:apache_beam.utils.subprocess_server:b'22/04/20 00:22:40 WARN software.amazon.awssdk.regions.internal.util.EC2MetadataUtils: Unable to retrieve the requested metadata.'
INFO:apache_beam.utils.subprocess_server:b'22/04/20 00:22:40 INFO org.apache.beam.runners.jobsubmission.JobServerDriver: ArtifactStagingService started on localhost:45687'
INFO:apache_beam.utils.subprocess_server:b'22/04/20 00:22:40 INFO org.apache.beam.runners.jobsubmission.JobServerDriver: Java ExpansionService started on localhost:38011'
INFO:apache_beam.utils.subprocess_server:b'22/04/20 00:22:40 INFO org.apache.beam.runners.jobsubmission.JobServerDriver: JobService started on localhost:40533'
INFO:apache_beam.utils.subprocess_server:b'22/04/20 00:22:40 INFO org.apache.beam.runners.jobsubmission.JobServerDriver: Job server now running, terminate with Ctrl+C'
WARNING:apache_beam.options.pipeline_options:Discarding unparseable args: ['--parallelism=2']
INFO:apache_beam.utils.subprocess_server:b'22/04/20 00:22:41 INFO org.apache.beam.runners.fnexecution.artifact.ArtifactStagingService: Staging artifacts for job_539d87ca-52c6-47df-9ffb-9afa9fb50a42.'
INFO:apache_beam.utils.subprocess_server:b'22/04/20 00:22:41 INFO org.apache.beam.runners.fnexecution.artifact.ArtifactStagingService: Resolving artifacts for job_539d87ca-52c6-47df-9ffb-9afa9fb50a42.ref_Environment_default_environment_1.'
INFO:apache_beam.utils.subprocess_server:b'22/04/20 00:22:41 INFO org.apache.beam.runners.fnexecution.artifact.ArtifactStagingService: Getting 1 artifacts for job_539d87ca-52c6-47df-9ffb-9afa9fb50a42.null.'
INFO:apache_beam.utils.subprocess_server:b'22/04/20 00:22:41 INFO org.apache.beam.runners.fnexecution.artifact.ArtifactStagingService: Artifacts fully staged for job_539d87ca-52c6-47df-9ffb-9afa9fb50a42.'
INFO:apache_beam.utils.subprocess_server:b'22/04/20 00:22:41 INFO org.apache.beam.runners.spark.SparkJobInvoker: Invoking job BeamApp-jenkins-0420002241-69f764ef_c4959b14-b3a5-4e8a-93b8-603b2d8a3adf'
INFO:apache_beam.utils.subprocess_server:b'22/04/20 00:22:41 INFO org.apache.beam.runners.jobsubmission.JobInvocation: Starting job invocation BeamApp-jenkins-0420002241-69f764ef_c4959b14-b3a5-4e8a-93b8-603b2d8a3adf'
INFO:apache_beam.runners.portability.portable_runner:Environment "LOOPBACK" has started a component necessary for the execution. Be sure to run the pipeline using
with Pipeline() as p:
p.apply(..)
This ensures that the pipeline finishes before this program exits.
INFO:apache_beam.runners.portability.portable_runner:Job state changed to STOPPED
INFO:apache_beam.runners.portability.portable_runner:Job state changed to STARTING
INFO:apache_beam.runners.portability.portable_runner:Job state changed to RUNNING
INFO:apache_beam.utils.subprocess_server:b'22/04/20 00:22:42 INFO org.apache.beam.runners.spark.translation.SparkContextFactory: Creating a brand new Spark Context.'
INFO:apache_beam.utils.subprocess_server:b'22/04/20 00:22:42 WARN org.apache.hadoop.util.NativeCodeLoader: Unable to load native-hadoop library for your platform... using builtin-java classes where applicable'
> Task :sdks:python:test-suites:dataflow:py39:postCommitIT
E0420 00:22:42.502716064 525856 fork_posix.cc:70] Fork support is only compatible with the epoll1 and poll polling strategies
> Task :sdks:python:test-suites:portable:py39:portableWordCountSparkRunnerBatch
INFO:apache_beam.utils.subprocess_server:b'22/04/20 00:22:43 INFO org.apache.beam.runners.spark.aggregators.AggregatorsAccumulator: Instantiated aggregators accumulator:'
INFO:apache_beam.utils.subprocess_server:b'22/04/20 00:22:43 INFO org.apache.beam.runners.spark.metrics.MetricsAccumulator: Instantiated metrics accumulator: MetricQueryResults()'
INFO:apache_beam.utils.subprocess_server:b'22/04/20 00:22:43 WARN software.amazon.awssdk.regions.internal.util.EC2MetadataUtils: Unable to retrieve the requested metadata.'
INFO:apache_beam.utils.subprocess_server:b'22/04/20 00:22:43 INFO org.apache.beam.runners.spark.SparkPipelineRunner: Running job BeamApp-jenkins-0420002241-69f764ef_c4959b14-b3a5-4e8a-93b8-603b2d8a3adf on Spark master local[4]'
INFO:apache_beam.utils.subprocess_server:b'22/04/20 00:22:44 WARN software.amazon.awssdk.regions.internal.util.EC2MetadataUtils: Unable to retrieve the requested metadata.'
INFO:apache_beam.utils.subprocess_server:b'22/04/20 00:22:44 WARN software.amazon.awssdk.regions.internal.util.EC2MetadataUtils: Unable to retrieve the requested metadata.'
INFO:apache_beam.utils.subprocess_server:b'22/04/20 00:22:44 WARN software.amazon.awssdk.regions.internal.util.EC2MetadataUtils: Unable to retrieve the requested metadata.'
INFO:apache_beam.utils.subprocess_server:b'22/04/20 00:22:44 WARN software.amazon.awssdk.regions.internal.util.EC2MetadataUtils: Unable to retrieve the requested metadata.'
INFO:apache_beam.runners.worker.statecache:Creating state cache with size 0
INFO:apache_beam.runners.worker.sdk_worker:Creating insecure control channel for localhost:34211.
INFO:apache_beam.runners.worker.sdk_worker:Control channel established.
INFO:apache_beam.runners.worker.sdk_worker:Initializing SDKHarness with unbounded number of workers.
INFO:apache_beam.utils.subprocess_server:b'22/04/20 00:22:44 INFO org.apache.beam.runners.fnexecution.control.FnApiControlClientPoolService: Beam Fn Control client connected with id 1-1'
INFO:apache_beam.utils.subprocess_server:b'22/04/20 00:22:44 INFO org.apache.beam.runners.fnexecution.control.FnApiControlClientPoolService: getProcessBundleDescriptor request with id 1-2'
INFO:apache_beam.runners.worker.sdk_worker:Creating insecure state channel for localhost:43649.
INFO:apache_beam.runners.worker.sdk_worker:State channel established.
INFO:apache_beam.runners.worker.data_plane:Creating client data channel for localhost:41511
INFO:apache_beam.utils.subprocess_server:b'22/04/20 00:22:44 INFO org.apache.beam.runners.fnexecution.data.GrpcDataService: Beam Fn Data client connected.'
INFO:apache_beam.utils.subprocess_server:b'22/04/20 00:22:44 INFO org.apache.beam.runners.fnexecution.control.FnApiControlClientPoolService: getProcessBundleDescriptor request with id 1-3'
INFO:apache_beam.utils.subprocess_server:b'22/04/20 00:22:44 WARN software.amazon.awssdk.regions.internal.util.EC2MetadataUtils: Unable to retrieve the requested metadata.'
INFO:apache_beam.utils.subprocess_server:b'22/04/20 00:22:44 WARN software.amazon.awssdk.regions.internal.util.EC2MetadataUtils: Unable to retrieve the requested metadata.'
INFO:apache_beam.utils.subprocess_server:b'22/04/20 00:22:44 WARN software.amazon.awssdk.regions.internal.util.EC2MetadataUtils: Unable to retrieve the requested metadata.'
INFO:apache_beam.utils.subprocess_server:b'22/04/20 00:22:44 WARN software.amazon.awssdk.regions.internal.util.EC2MetadataUtils: Unable to retrieve the requested metadata.'
INFO:apache_beam.utils.subprocess_server:b'22/04/20 00:22:44 INFO org.apache.beam.runners.fnexecution.control.FnApiControlClientPoolService: getProcessBundleDescriptor request with id 1-4'
INFO:apache_beam.utils.subprocess_server:b'22/04/20 00:22:44 INFO org.apache.beam.runners.fnexecution.control.FnApiControlClientPoolService: getProcessBundleDescriptor request with id 1-5'
INFO:apache_beam.utils.subprocess_server:b'22/04/20 00:22:44 WARN software.amazon.awssdk.regions.internal.util.EC2MetadataUtils: Unable to retrieve the requested metadata.'
INFO:apache_beam.utils.subprocess_server:b'22/04/20 00:22:44 WARN software.amazon.awssdk.regions.internal.util.EC2MetadataUtils: Unable to retrieve the requested metadata.'
INFO:apache_beam.utils.subprocess_server:b'22/04/20 00:22:44 WARN software.amazon.awssdk.regions.internal.util.EC2MetadataUtils: Unable to retrieve the requested metadata.'
INFO:apache_beam.utils.subprocess_server:b'22/04/20 00:22:44 WARN software.amazon.awssdk.regions.internal.util.EC2MetadataUtils: Unable to retrieve the requested metadata.'
INFO:apache_beam.utils.subprocess_server:b'22/04/20 00:22:44 INFO org.apache.beam.runners.fnexecution.control.FnApiControlClientPoolService: getProcessBundleDescriptor request with id 1-8'
INFO:apache_beam.utils.subprocess_server:b'22/04/20 00:22:44 INFO org.apache.beam.runners.fnexecution.control.FnApiControlClientPoolService: getProcessBundleDescriptor request with id 1-9'
INFO:apache_beam.utils.subprocess_server:b'22/04/20 00:22:44 INFO org.apache.beam.runners.fnexecution.control.FnApiControlClientPoolService: getProcessBundleDescriptor request with id 1-6'
INFO:apache_beam.utils.subprocess_server:b'22/04/20 00:22:44 INFO org.apache.beam.runners.fnexecution.control.FnApiControlClientPoolService: getProcessBundleDescriptor request with id 1-7'
INFO:apache_beam.utils.subprocess_server:b'22/04/20 00:22:45 INFO org.apache.beam.runners.fnexecution.control.FnApiControlClientPoolService: getProcessBundleDescriptor request with id 1-10'
INFO:apache_beam.utils.subprocess_server:b'22/04/20 00:22:45 INFO org.apache.beam.runners.fnexecution.control.FnApiControlClientPoolService: getProcessBundleDescriptor request with id 1-11'
INFO:apache_beam.utils.subprocess_server:b'22/04/20 00:22:45 INFO org.apache.beam.runners.fnexecution.control.FnApiControlClientPoolService: getProcessBundleDescriptor request with id 1-12'
INFO:apache_beam.utils.subprocess_server:b'22/04/20 00:22:45 INFO org.apache.beam.runners.fnexecution.control.FnApiControlClientPoolService: getProcessBundleDescriptor request with id 1-13'
INFO:apache_beam.utils.subprocess_server:b'22/04/20 00:22:45 WARN software.amazon.awssdk.regions.internal.util.EC2MetadataUtils: Unable to retrieve the requested metadata.'
INFO:apache_beam.utils.subprocess_server:b'22/04/20 00:22:45 WARN software.amazon.awssdk.regions.internal.util.EC2MetadataUtils: Unable to retrieve the requested metadata.'
INFO:apache_beam.utils.subprocess_server:b'22/04/20 00:22:45 WARN software.amazon.awssdk.regions.internal.util.EC2MetadataUtils: Unable to retrieve the requested metadata.'
INFO:apache_beam.utils.subprocess_server:b'22/04/20 00:22:45 WARN software.amazon.awssdk.regions.internal.util.EC2MetadataUtils: Unable to retrieve the requested metadata.'
INFO:apache_beam.utils.subprocess_server:b'22/04/20 00:22:45 INFO org.apache.beam.runners.fnexecution.control.FnApiControlClientPoolService: getProcessBundleDescriptor request with id 1-14'
INFO:apache_beam.utils.subprocess_server:b'22/04/20 00:22:45 WARN software.amazon.awssdk.regions.internal.util.EC2MetadataUtils: Unable to retrieve the requested metadata.'
INFO:apache_beam.utils.subprocess_server:b'22/04/20 00:22:45 WARN software.amazon.awssdk.regions.internal.util.EC2MetadataUtils: Unable to retrieve the requested metadata.'
INFO:apache_beam.utils.subprocess_server:b'22/04/20 00:22:45 WARN software.amazon.awssdk.regions.internal.util.EC2MetadataUtils: Unable to retrieve the requested metadata.'
INFO:apache_beam.utils.subprocess_server:b'22/04/20 00:22:45 WARN software.amazon.awssdk.regions.internal.util.EC2MetadataUtils: Unable to retrieve the requested metadata.'
INFO:apache_beam.utils.subprocess_server:b'22/04/20 00:22:45 INFO org.apache.beam.runners.fnexecution.control.FnApiControlClientPoolService: getProcessBundleDescriptor request with id 1-15'
INFO:apache_beam.utils.subprocess_server:b'22/04/20 00:22:45 INFO org.apache.beam.runners.spark.SparkPipelineRunner: Job BeamApp-jenkins-0420002241-69f764ef_c4959b14-b3a5-4e8a-93b8-603b2d8a3adf: Pipeline translated successfully. Computing outputs'
INFO:apache_beam.utils.subprocess_server:b'22/04/20 00:22:45 WARN software.amazon.awssdk.regions.internal.util.EC2MetadataUtils: Unable to retrieve the requested metadata.'
INFO:apache_beam.utils.subprocess_server:b'22/04/20 00:22:45 WARN software.amazon.awssdk.regions.internal.util.EC2MetadataUtils: Unable to retrieve the requested metadata.'
INFO:apache_beam.utils.subprocess_server:b'22/04/20 00:22:45 WARN software.amazon.awssdk.regions.internal.util.EC2MetadataUtils: Unable to retrieve the requested metadata.'
INFO:apache_beam.utils.subprocess_server:b'22/04/20 00:22:45 WARN software.amazon.awssdk.regions.internal.util.EC2MetadataUtils: Unable to retrieve the requested metadata.'
INFO:apache_beam.utils.subprocess_server:b'22/04/20 00:22:45 INFO org.apache.beam.runners.fnexecution.control.FnApiControlClientPoolService: getProcessBundleDescriptor request with id 1-16'
INFO:apache_beam.io.filebasedsink:Starting finalize_write threads with num_shards: 4 (skipped: 0), batches: 4, num_threads: 4
INFO:apache_beam.io.filebasedsink:Renamed 4 shards in 0.01 seconds.
INFO:apache_beam.utils.subprocess_server:b'22/04/20 00:22:45 INFO org.apache.beam.runners.spark.SparkPipelineRunner: Job BeamApp-jenkins-0420002241-69f764ef_c4959b14-b3a5-4e8a-93b8-603b2d8a3adf finished.'
INFO:apache_beam.runners.portability.portable_runner:Job state changed to DONE
Exception in thread run_worker_1-1:
Traceback (most recent call last):
File "/usr/lib/python3.9/threading.py", line 973, in _bootstrap_inner
Exception in thread read_state:
Traceback (most recent call last):
File "/usr/lib/python3.9/threading.py", line 973, in _bootstrap_inner
self.run()
File "/usr/lib/python3.9/threading.py", line 910, in run
self.run()
File "/usr/lib/python3.9/threading.py", line 910, in run
ERROR:apache_beam.runners.worker.data_plane:Failed to read inputs in the data plane.
Traceback (most recent call last):
File "<https://ci-beam.apache.org/job/beam_PostCommit_Python39/ws/src/sdks/python/apache_beam/runners/worker/data_plane.py",> line 634, in _read_inputs
for elements in elements_iterator:
File "<https://ci-beam.apache.org/job/beam_PostCommit_Python39/ws/src/build/gradleenv/2022703443/lib/python3.9/site-packages/grpc/_channel.py",> line 426, in __next__
return self._next()
File "<https://ci-beam.apache.org/job/beam_PostCommit_Python39/ws/src/build/gradleenv/2022703443/lib/python3.9/site-packages/grpc/_channel.py",> line 826, in _next
raise self
grpc._channel._MultiThreadedRendezvous: <_MultiThreadedRendezvous of RPC that terminated with:
status = StatusCode.UNAVAILABLE
details = "Socket closed"
debug_error_string = "{"created":"@1650414165.875037239","description":"Error received from peer ipv6:[::1]:41511","file":"src/core/lib/surface/call.cc","file_line":903,"grpc_message":"Socket closed","grpc_status":14}"
>
self._target(*self._args, **self._kwargs)
self._target(*self._args, **self._kwargs)
File "<https://ci-beam.apache.org/job/beam_PostCommit_Python39/ws/src/sdks/python/apache_beam/runners/worker/sdk_worker.py",> line 990, in pull_responses
File "<https://ci-beam.apache.org/job/beam_PostCommit_Python39/ws/src/sdks/python/apache_beam/runners/worker/sdk_worker.py",> line 234, in run
Exception in thread read_grpc_client_inputs:
for work_request in self._control_stub.Control(get_responses()):
Traceback (most recent call last):
File "<https://ci-beam.apache.org/job/beam_PostCommit_Python39/ws/src/build/gradleenv/2022703443/lib/python3.9/site-packages/grpc/_channel.py",> line 426, in __next__
for response in responses:
File "/usr/lib/python3.9/threading.py", line 973, in _bootstrap_inner
File "<https://ci-beam.apache.org/job/beam_PostCommit_Python39/ws/src/build/gradleenv/2022703443/lib/python3.9/site-packages/grpc/_channel.py",> line 426, in __next__
return self._next()
File "<https://ci-beam.apache.org/job/beam_PostCommit_Python39/ws/src/build/gradleenv/2022703443/lib/python3.9/site-packages/grpc/_channel.py",> line 826, in _next
self.run()
File "/usr/lib/python3.9/threading.py", line 910, in run
return self._next()
raise self
File "<https://ci-beam.apache.org/job/beam_PostCommit_Python39/ws/src/build/gradleenv/2022703443/lib/python3.9/site-packages/grpc/_channel.py",> line 826, in _next
grpc._channel._MultiThreadedRendezvous: <_MultiThreadedRendezvous of RPC that terminated with:
status = StatusCode.UNAVAILABLE
details = "Socket closed"
debug_error_string = "{"created":"@1650414165.875044471","description":"Error received from peer ipv6:[::1]:34211","file":"src/core/lib/surface/call.cc","file_line":903,"grpc_message":"Socket closed","grpc_status":14}"
>
raise self
self._target(*self._args, **self._kwargs)
File "<https://ci-beam.apache.org/job/beam_PostCommit_Python39/ws/src/sdks/python/apache_beam/runners/worker/data_plane.py",> line 651, in <lambda>
grpc._channel._MultiThreadedRendezvous: <_MultiThreadedRendezvous of RPC that terminated with:
status = StatusCode.UNAVAILABLE
details = "Socket closed"
debug_error_string = "{"created":"@1650414165.875043685","description":"Error received from peer ipv6:[::1]:43649","file":"src/core/lib/surface/call.cc","file_line":903,"grpc_message":"Socket closed","grpc_status":14}"
>
target=lambda: self._read_inputs(elements_iterator),
File "<https://ci-beam.apache.org/job/beam_PostCommit_Python39/ws/src/sdks/python/apache_beam/runners/worker/data_plane.py",> line 634, in _read_inputs
for elements in elements_iterator:
File "<https://ci-beam.apache.org/job/beam_PostCommit_Python39/ws/src/build/gradleenv/2022703443/lib/python3.9/site-packages/grpc/_channel.py",> line 426, in __next__
return self._next()
File "<https://ci-beam.apache.org/job/beam_PostCommit_Python39/ws/src/build/gradleenv/2022703443/lib/python3.9/site-packages/grpc/_channel.py",> line 826, in _next
raise self
grpc._channel._MultiThreadedRendezvous: <_MultiThreadedRendezvous of RPC that terminated with:
status = StatusCode.UNAVAILABLE
details = "Socket closed"
debug_error_string = "{"created":"@1650414165.875037239","description":"Error received from peer ipv6:[::1]:41511","file":"src/core/lib/surface/call.cc","file_line":903,"grpc_message":"Socket closed","grpc_status":14}"
>
> Task :sdks:python:test-suites:portable:py39:postCommitPy39
> Task :sdks:python:test-suites:dataflow:py39:postCommitIT
E0420 00:25:47.441859101 525963 fork_posix.cc:70] Fork support is only compatible with the epoll1 and poll polling strategies
E0420 00:27:36.845668900 525942 fork_posix.cc:70] Fork support is only compatible with the epoll1 and poll polling strategies
E0420 00:31:00.454034996 525856 fork_posix.cc:70] Fork support is only compatible with the epoll1 and poll polling strategies
E0420 00:31:42.698023464 525792 fork_posix.cc:70] Fork support is only compatible with the epoll1 and poll polling strategies
E0420 00:33:28.816026973 525963 fork_posix.cc:70] Fork support is only compatible with the epoll1 and poll polling strategies
E0420 00:35:43.357747356 525942 fork_posix.cc:70] Fork support is only compatible with the epoll1 and poll polling strategies
E0420 00:38:07.135537355 525792 fork_posix.cc:70] Fork support is only compatible with the epoll1 and poll polling strategies
E0420 00:38:51.258345069 525856 fork_posix.cc:70] Fork support is only compatible with the epoll1 and poll polling strategies
E0420 00:43:46.359479471 525942 fork_posix.cc:70] Fork support is only compatible with the epoll1 and poll polling strategies
E0420 00:46:04.539678991 525792 fork_posix.cc:70] Fork support is only compatible with the epoll1 and poll polling strategies
E0420 00:46:45.122166172 525856 fork_posix.cc:70] Fork support is only compatible with the epoll1 and poll polling strategies
E0420 00:48:17.010051418 525963 fork_posix.cc:70] Fork support is only compatible with the epoll1 and poll polling strategies
E0420 00:54:52.846971855 525792 fork_posix.cc:70] Fork support is only compatible with the epoll1 and poll polling strategies
E0420 01:02:17.563407739 525792 fork_posix.cc:70] Fork support is only compatible with the epoll1 and poll polling strategies
E0420 01:05:21.144037337 525963 fork_posix.cc:70] Fork support is only compatible with the epoll1 and poll polling strategies
E0420 01:09:19.027428157 525792 fork_posix.cc:70] Fork support is only compatible with the epoll1 and poll polling strategies
E0420 01:15:59.865024625 525792 fork_posix.cc:70] Fork support is only compatible with the epoll1 and poll polling strategies
E0420 01:16:14.038003727 525919 fork_posix.cc:70] Fork support is only compatible with the epoll1 and poll polling strategies
E0420 01:22:23.698394456 525963 fork_posix.cc:70] Fork support is only compatible with the epoll1 and poll polling strategies
E0420 01:24:16.291281687 525792 fork_posix.cc:70] Fork support is only compatible with the epoll1 and poll polling strategies
E0420 01:26:48.975084003 525919 fork_posix.cc:70] Fork support is only compatible with the epoll1 and poll polling strategies
E0420 01:31:42.764636668 525792 fork_posix.cc:70] Fork support is only compatible with the epoll1 and poll polling strategies
E0420 01:38:49.589588818 525792 fork_posix.cc:70] Fork support is only compatible with the epoll1 and poll polling strategies
> Task :sdks:python:test-suites:dataflow:py39:postCommitIT FAILED
FAILURE: Build failed with an exception.
* Where:
Script '<https://ci-beam.apache.org/job/beam_PostCommit_Python39/ws/src/sdks/python/test-suites/dataflow/common.gradle'> line: 121
* What went wrong:
Execution failed for task ':sdks:python:test-suites:dataflow:py39:postCommitIT'.
> Process 'command 'sh'' finished with non-zero exit value 1
* Try:
> Run with --stacktrace option to get the stack trace.
> Run with --info or --debug option to get more log output.
> Run with --scan to get full insights.
* Get more help at https://help.gradle.org
Deprecated Gradle features were used in this build, making it incompatible with Gradle 8.0.
You can use '--warning-mode all' to show the individual deprecation warnings and determine if they come from your own scripts or plugins.
See https://docs.gradle.org/7.4/userguide/command_line_interface.html#sec:command_line_warnings
Execution optimizations have been disabled for 1 invalid unit(s) of work during this build to ensure correctness.
Please consult deprecation warnings for more details.
BUILD FAILED in 1h 34m 52s
219 actionable tasks: 149 executed, 64 from cache, 6 up-to-date
Publishing build scan...
https://gradle.com/s/m62wi5id3dvmm
Build step 'Invoke Gradle script' changed build result to FAILURE
Build step 'Invoke Gradle script' marked build as failure
---------------------------------------------------------------------
To unsubscribe, e-mail: builds-unsubscribe@beam.apache.org
For additional commands, e-mail: builds-help@beam.apache.org
Build failed in Jenkins: beam_PostCommit_Python39 #266
Posted by Apache Jenkins Server <je...@builds.apache.org>.
See <https://ci-beam.apache.org/job/beam_PostCommit_Python39/266/display/redirect>
Changes:
------------------------------------------
[...truncated 26.21 MB...]
seconds: 1650392634
nanos: 294495820
}
message: "Closing all cached grpc data channels."
log_location: "/usr/local/lib/python3.9/site-packages/apache_beam/runners/worker/data_plane.py:782"
thread: "MainThread"
INFO:root:severity: INFO
timestamp {
seconds: 1650392634
nanos: 294560432
}
message: "Closing all cached gRPC state handlers."
log_location: "/usr/local/lib/python3.9/site-packages/apache_beam/runners/worker/sdk_worker.py:859"
thread: "MainThread"
INFO:root:severity: INFO
timestamp {
seconds: 1650392634
nanos: 296261787
}
message: "Done consuming work."
log_location: "/usr/local/lib/python3.9/site-packages/apache_beam/runners/worker/sdk_worker.py:257"
thread: "MainThread"
INFO:root:severity: INFO
timestamp {
seconds: 1650392634
nanos: 296414136
}
message: "Python sdk harness exiting."
log_location: "/usr/local/lib/python3.9/site-packages/apache_beam/runners/worker/sdk_worker_main.py:181"
thread: "MainThread"
INFO:apache_beam.runners.portability.local_job_service:Completed job in 10.828733205795288 seconds with state DONE.
INFO:root:Completed job in 10.828733205795288 seconds with state DONE.
INFO:apache_beam.runners.portability.portable_runner:Job state changed to DONE
> Task :sdks:python:test-suites:portable:py39:portableWordCountSparkRunnerBatch
INFO:apache_beam.runners.worker.worker_pool_main:Listening for workers at localhost:42253
WARNING:root:Make sure that locally built Python SDK docker image has Python 3.9 interpreter.
INFO:root:Default Python SDK image for environment is apache/beam_python3.9_sdk:2.39.0.dev
INFO:apache_beam.runners.portability.fn_api_runner.translations:==================== <function pack_combiners at 0x7f52dc243c10> ====================
INFO:apache_beam.runners.portability.fn_api_runner.translations:==================== <function lift_combiners at 0x7f52dc243ca0> ====================
INFO:apache_beam.runners.portability.fn_api_runner.translations:==================== <function sort_stages at 0x7f52dc244430> ====================
INFO:apache_beam.utils.subprocess_server:Starting service with ['java' '-jar' '<https://ci-beam.apache.org/job/beam_PostCommit_Python39/ws/src/runners/spark/2/job-server/build/libs/beam-runners-spark-job-server-2.39.0-SNAPSHOT.jar'> '--spark-master-url' 'local[4]' '--artifacts-dir' '/tmp/beam-tempo5idvyb2/artifactsll6k35zw' '--job-port' '33995' '--artifact-port' '0' '--expansion-port' '0']
E0419 18:23:57.805946569 3853587 fork_posix.cc:70] Fork support is only compatible with the epoll1 and poll polling strategies
INFO:apache_beam.utils.subprocess_server:b'22/04/19 18:23:59 WARN software.amazon.awssdk.regions.internal.util.EC2MetadataUtils: Unable to retrieve the requested metadata.'
INFO:apache_beam.utils.subprocess_server:b'22/04/19 18:23:59 INFO org.apache.beam.runners.jobsubmission.JobServerDriver: ArtifactStagingService started on localhost:34745'
INFO:apache_beam.utils.subprocess_server:b'22/04/19 18:23:59 INFO org.apache.beam.runners.jobsubmission.JobServerDriver: Java ExpansionService started on localhost:40873'
INFO:apache_beam.utils.subprocess_server:b'22/04/19 18:24:00 INFO org.apache.beam.runners.jobsubmission.JobServerDriver: JobService started on localhost:33995'
INFO:apache_beam.utils.subprocess_server:b'22/04/19 18:24:00 INFO org.apache.beam.runners.jobsubmission.JobServerDriver: Job server now running, terminate with Ctrl+C'
WARNING:apache_beam.options.pipeline_options:Discarding unparseable args: ['--parallelism=2']
INFO:apache_beam.utils.subprocess_server:b'22/04/19 18:24:00 INFO org.apache.beam.runners.fnexecution.artifact.ArtifactStagingService: Staging artifacts for job_5237344f-eb71-4d33-a110-e76c0244b915.'
INFO:apache_beam.utils.subprocess_server:b'22/04/19 18:24:00 INFO org.apache.beam.runners.fnexecution.artifact.ArtifactStagingService: Resolving artifacts for job_5237344f-eb71-4d33-a110-e76c0244b915.ref_Environment_default_environment_1.'
INFO:apache_beam.utils.subprocess_server:b'22/04/19 18:24:00 INFO org.apache.beam.runners.fnexecution.artifact.ArtifactStagingService: Getting 1 artifacts for job_5237344f-eb71-4d33-a110-e76c0244b915.null.'
INFO:apache_beam.utils.subprocess_server:b'22/04/19 18:24:00 INFO org.apache.beam.runners.fnexecution.artifact.ArtifactStagingService: Artifacts fully staged for job_5237344f-eb71-4d33-a110-e76c0244b915.'
INFO:apache_beam.utils.subprocess_server:b'22/04/19 18:24:01 INFO org.apache.beam.runners.spark.SparkJobInvoker: Invoking job BeamApp-jenkins-0419182401-bbb21396_2c7fe95d-15c0-4a93-b2d9-0963fff02a79'
INFO:apache_beam.utils.subprocess_server:b'22/04/19 18:24:01 INFO org.apache.beam.runners.jobsubmission.JobInvocation: Starting job invocation BeamApp-jenkins-0419182401-bbb21396_2c7fe95d-15c0-4a93-b2d9-0963fff02a79'
INFO:apache_beam.runners.portability.portable_runner:Environment "LOOPBACK" has started a component necessary for the execution. Be sure to run the pipeline using
with Pipeline() as p:
p.apply(..)
This ensures that the pipeline finishes before this program exits.
INFO:apache_beam.runners.portability.portable_runner:Job state changed to STOPPED
INFO:apache_beam.runners.portability.portable_runner:Job state changed to STARTING
INFO:apache_beam.runners.portability.portable_runner:Job state changed to RUNNING
INFO:apache_beam.utils.subprocess_server:b'22/04/19 18:24:01 INFO org.apache.beam.runners.spark.translation.SparkContextFactory: Creating a brand new Spark Context.'
INFO:apache_beam.utils.subprocess_server:b'22/04/19 18:24:01 WARN org.apache.hadoop.util.NativeCodeLoader: Unable to load native-hadoop library for your platform... using builtin-java classes where applicable'
INFO:apache_beam.utils.subprocess_server:b'22/04/19 18:24:02 INFO org.apache.beam.runners.spark.aggregators.AggregatorsAccumulator: Instantiated aggregators accumulator:'
INFO:apache_beam.utils.subprocess_server:b'22/04/19 18:24:02 INFO org.apache.beam.runners.spark.metrics.MetricsAccumulator: Instantiated metrics accumulator: MetricQueryResults()'
INFO:apache_beam.utils.subprocess_server:b'22/04/19 18:24:02 WARN software.amazon.awssdk.regions.internal.util.EC2MetadataUtils: Unable to retrieve the requested metadata.'
INFO:apache_beam.utils.subprocess_server:b'22/04/19 18:24:02 INFO org.apache.beam.runners.spark.SparkPipelineRunner: Running job BeamApp-jenkins-0419182401-bbb21396_2c7fe95d-15c0-4a93-b2d9-0963fff02a79 on Spark master local[4]'
INFO:apache_beam.utils.subprocess_server:b'22/04/19 18:24:03 WARN software.amazon.awssdk.regions.internal.util.EC2MetadataUtils: Unable to retrieve the requested metadata.'
INFO:apache_beam.utils.subprocess_server:b'22/04/19 18:24:03 WARN software.amazon.awssdk.regions.internal.util.EC2MetadataUtils: Unable to retrieve the requested metadata.'
INFO:apache_beam.utils.subprocess_server:b'22/04/19 18:24:03 WARN software.amazon.awssdk.regions.internal.util.EC2MetadataUtils: Unable to retrieve the requested metadata.'
INFO:apache_beam.utils.subprocess_server:b'22/04/19 18:24:03 WARN software.amazon.awssdk.regions.internal.util.EC2MetadataUtils: Unable to retrieve the requested metadata.'
INFO:apache_beam.runners.worker.statecache:Creating state cache with size 0
INFO:apache_beam.runners.worker.sdk_worker:Creating insecure control channel for localhost:35491.
INFO:apache_beam.runners.worker.sdk_worker:Control channel established.
INFO:apache_beam.runners.worker.sdk_worker:Initializing SDKHarness with unbounded number of workers.
INFO:apache_beam.utils.subprocess_server:b'22/04/19 18:24:03 INFO org.apache.beam.runners.fnexecution.control.FnApiControlClientPoolService: Beam Fn Control client connected with id 1-1'
INFO:apache_beam.utils.subprocess_server:b'22/04/19 18:24:03 INFO org.apache.beam.runners.fnexecution.control.FnApiControlClientPoolService: getProcessBundleDescriptor request with id 1-2'
INFO:apache_beam.runners.worker.sdk_worker:Creating insecure state channel for localhost:32919.
INFO:apache_beam.runners.worker.sdk_worker:State channel established.
INFO:apache_beam.runners.worker.data_plane:Creating client data channel for localhost:43855
INFO:apache_beam.utils.subprocess_server:b'22/04/19 18:24:03 INFO org.apache.beam.runners.fnexecution.data.GrpcDataService: Beam Fn Data client connected.'
INFO:apache_beam.utils.subprocess_server:b'22/04/19 18:24:03 INFO org.apache.beam.runners.fnexecution.control.FnApiControlClientPoolService: getProcessBundleDescriptor request with id 1-3'
INFO:apache_beam.utils.subprocess_server:b'22/04/19 18:24:04 WARN software.amazon.awssdk.regions.internal.util.EC2MetadataUtils: Unable to retrieve the requested metadata.'
INFO:apache_beam.utils.subprocess_server:b'22/04/19 18:24:04 WARN software.amazon.awssdk.regions.internal.util.EC2MetadataUtils: Unable to retrieve the requested metadata.'
INFO:apache_beam.utils.subprocess_server:b'22/04/19 18:24:04 WARN software.amazon.awssdk.regions.internal.util.EC2MetadataUtils: Unable to retrieve the requested metadata.'
INFO:apache_beam.utils.subprocess_server:b'22/04/19 18:24:04 WARN software.amazon.awssdk.regions.internal.util.EC2MetadataUtils: Unable to retrieve the requested metadata.'
INFO:apache_beam.utils.subprocess_server:b'22/04/19 18:24:04 INFO org.apache.beam.runners.fnexecution.control.FnApiControlClientPoolService: getProcessBundleDescriptor request with id 1-4'
INFO:apache_beam.utils.subprocess_server:b'22/04/19 18:24:04 INFO org.apache.beam.runners.fnexecution.control.FnApiControlClientPoolService: getProcessBundleDescriptor request with id 1-5'
INFO:apache_beam.utils.subprocess_server:b'22/04/19 18:24:04 WARN software.amazon.awssdk.regions.internal.util.EC2MetadataUtils: Unable to retrieve the requested metadata.'
INFO:apache_beam.utils.subprocess_server:b'22/04/19 18:24:04 WARN software.amazon.awssdk.regions.internal.util.EC2MetadataUtils: Unable to retrieve the requested metadata.'
INFO:apache_beam.utils.subprocess_server:b'22/04/19 18:24:04 WARN software.amazon.awssdk.regions.internal.util.EC2MetadataUtils: Unable to retrieve the requested metadata.'
INFO:apache_beam.utils.subprocess_server:b'22/04/19 18:24:04 WARN software.amazon.awssdk.regions.internal.util.EC2MetadataUtils: Unable to retrieve the requested metadata.'
INFO:apache_beam.utils.subprocess_server:b'22/04/19 18:24:04 INFO org.apache.beam.runners.fnexecution.control.FnApiControlClientPoolService: getProcessBundleDescriptor request with id 1-6'
INFO:apache_beam.utils.subprocess_server:b'22/04/19 18:24:04 INFO org.apache.beam.runners.fnexecution.control.FnApiControlClientPoolService: getProcessBundleDescriptor request with id 1-9'
INFO:apache_beam.utils.subprocess_server:b'22/04/19 18:24:04 INFO org.apache.beam.runners.fnexecution.control.FnApiControlClientPoolService: getProcessBundleDescriptor request with id 1-8'
INFO:apache_beam.utils.subprocess_server:b'22/04/19 18:24:04 INFO org.apache.beam.runners.fnexecution.control.FnApiControlClientPoolService: getProcessBundleDescriptor request with id 1-7'
INFO:apache_beam.utils.subprocess_server:b'22/04/19 18:24:04 INFO org.apache.beam.runners.fnexecution.control.FnApiControlClientPoolService: getProcessBundleDescriptor request with id 1-10'
INFO:apache_beam.utils.subprocess_server:b'22/04/19 18:24:04 INFO org.apache.beam.runners.fnexecution.control.FnApiControlClientPoolService: getProcessBundleDescriptor request with id 1-11'
INFO:apache_beam.utils.subprocess_server:b'22/04/19 18:24:04 INFO org.apache.beam.runners.fnexecution.control.FnApiControlClientPoolService: getProcessBundleDescriptor request with id 1-12'
INFO:apache_beam.utils.subprocess_server:b'22/04/19 18:24:04 INFO org.apache.beam.runners.fnexecution.control.FnApiControlClientPoolService: getProcessBundleDescriptor request with id 1-13'
INFO:apache_beam.utils.subprocess_server:b'22/04/19 18:24:04 WARN software.amazon.awssdk.regions.internal.util.EC2MetadataUtils: Unable to retrieve the requested metadata.'
INFO:apache_beam.utils.subprocess_server:b'22/04/19 18:24:04 WARN software.amazon.awssdk.regions.internal.util.EC2MetadataUtils: Unable to retrieve the requested metadata.'
INFO:apache_beam.utils.subprocess_server:b'22/04/19 18:24:04 WARN software.amazon.awssdk.regions.internal.util.EC2MetadataUtils: Unable to retrieve the requested metadata.'
INFO:apache_beam.utils.subprocess_server:b'22/04/19 18:24:04 WARN software.amazon.awssdk.regions.internal.util.EC2MetadataUtils: Unable to retrieve the requested metadata.'
INFO:apache_beam.utils.subprocess_server:b'22/04/19 18:24:04 INFO org.apache.beam.runners.fnexecution.control.FnApiControlClientPoolService: getProcessBundleDescriptor request with id 1-14'
INFO:apache_beam.utils.subprocess_server:b'22/04/19 18:24:04 WARN software.amazon.awssdk.regions.internal.util.EC2MetadataUtils: Unable to retrieve the requested metadata.'
INFO:apache_beam.utils.subprocess_server:b'22/04/19 18:24:04 WARN software.amazon.awssdk.regions.internal.util.EC2MetadataUtils: Unable to retrieve the requested metadata.'
INFO:apache_beam.utils.subprocess_server:b'22/04/19 18:24:04 WARN software.amazon.awssdk.regions.internal.util.EC2MetadataUtils: Unable to retrieve the requested metadata.'
INFO:apache_beam.utils.subprocess_server:b'22/04/19 18:24:04 WARN software.amazon.awssdk.regions.internal.util.EC2MetadataUtils: Unable to retrieve the requested metadata.'
INFO:apache_beam.utils.subprocess_server:b'22/04/19 18:24:04 INFO org.apache.beam.runners.fnexecution.control.FnApiControlClientPoolService: getProcessBundleDescriptor request with id 1-15'
INFO:apache_beam.utils.subprocess_server:b'22/04/19 18:24:04 INFO org.apache.beam.runners.spark.SparkPipelineRunner: Job BeamApp-jenkins-0419182401-bbb21396_2c7fe95d-15c0-4a93-b2d9-0963fff02a79: Pipeline translated successfully. Computing outputs'
INFO:apache_beam.utils.subprocess_server:b'22/04/19 18:24:04 WARN software.amazon.awssdk.regions.internal.util.EC2MetadataUtils: Unable to retrieve the requested metadata.'
INFO:apache_beam.utils.subprocess_server:b'22/04/19 18:24:04 WARN software.amazon.awssdk.regions.internal.util.EC2MetadataUtils: Unable to retrieve the requested metadata.'
INFO:apache_beam.utils.subprocess_server:b'22/04/19 18:24:04 WARN software.amazon.awssdk.regions.internal.util.EC2MetadataUtils: Unable to retrieve the requested metadata.'
INFO:apache_beam.utils.subprocess_server:b'22/04/19 18:24:04 WARN software.amazon.awssdk.regions.internal.util.EC2MetadataUtils: Unable to retrieve the requested metadata.'
INFO:apache_beam.utils.subprocess_server:b'22/04/19 18:24:04 INFO org.apache.beam.runners.fnexecution.control.FnApiControlClientPoolService: getProcessBundleDescriptor request with id 1-16'
INFO:apache_beam.io.filebasedsink:Starting finalize_write threads with num_shards: 4 (skipped: 0), batches: 4, num_threads: 4
INFO:apache_beam.io.filebasedsink:Renamed 4 shards in 0.01 seconds.
INFO:apache_beam.utils.subprocess_server:b'22/04/19 18:24:04 INFO org.apache.beam.runners.spark.SparkPipelineRunner: Job BeamApp-jenkins-0419182401-bbb21396_2c7fe95d-15c0-4a93-b2d9-0963fff02a79 finished.'
INFO:apache_beam.runners.portability.portable_runner:Job state changed to DONE
Exception in thread read_state:
Traceback (most recent call last):
File "/usr/lib/python3.9/threading.py", line 973, in _bootstrap_inner
Exception in thread run_worker_1-1:
Traceback (most recent call last):
File "/usr/lib/python3.9/threading.py", line 973, in _bootstrap_inner
self.run()
File "/usr/lib/python3.9/threading.py", line 910, in run
self.run()
File "/usr/lib/python3.9/threading.py", line 910, in run
self._target(*self._args, **self._kwargs)
File "<https://ci-beam.apache.org/job/beam_PostCommit_Python39/ws/src/sdks/python/apache_beam/runners/worker/sdk_worker.py",> line 990, in pull_responses
self._target(*self._args, **self._kwargs)
File "<https://ci-beam.apache.org/job/beam_PostCommit_Python39/ws/src/sdks/python/apache_beam/runners/worker/sdk_worker.py",> line 234, in run
for response in responses:
File "<https://ci-beam.apache.org/job/beam_PostCommit_Python39/ws/src/build/gradleenv/2022703443/lib/python3.9/site-packages/grpc/_channel.py",> line 426, in __next__
for work_request in self._control_stub.Control(get_responses()):
File "<https://ci-beam.apache.org/job/beam_PostCommit_Python39/ws/src/build/gradleenv/2022703443/lib/python3.9/site-packages/grpc/_channel.py",> line 426, in __next__
ERROR:apache_beam.runners.worker.data_plane:Failed to read inputs in the data plane.
Traceback (most recent call last):
File "<https://ci-beam.apache.org/job/beam_PostCommit_Python39/ws/src/sdks/python/apache_beam/runners/worker/data_plane.py",> line 634, in _read_inputs
for elements in elements_iterator:
File "<https://ci-beam.apache.org/job/beam_PostCommit_Python39/ws/src/build/gradleenv/2022703443/lib/python3.9/site-packages/grpc/_channel.py",> line 426, in __next__
return self._next()
File "<https://ci-beam.apache.org/job/beam_PostCommit_Python39/ws/src/build/gradleenv/2022703443/lib/python3.9/site-packages/grpc/_channel.py",> line 826, in _next
raise self
grpc._channel._MultiThreadedRendezvous: <_MultiThreadedRendezvous of RPC that terminated with:
status = StatusCode.UNAVAILABLE
details = "Socket closed"
debug_error_string = "{"created":"@1650392645.286295642","description":"Error received from peer ipv6:[::1]:43855","file":"src/core/lib/surface/call.cc","file_line":903,"grpc_message":"Socket closed","grpc_status":14}"
>
return self._next()
return self._next()
File "<https://ci-beam.apache.org/job/beam_PostCommit_Python39/ws/src/build/gradleenv/2022703443/lib/python3.9/site-packages/grpc/_channel.py",> line 826, in _next
File "<https://ci-beam.apache.org/job/beam_PostCommit_Python39/ws/src/build/gradleenv/2022703443/lib/python3.9/site-packages/grpc/_channel.py",> line 826, in _next
Exception in thread read_grpc_client_inputs:
Traceback (most recent call last):
raise self
raise self
grpc._channel._MultiThreadedRendezvous: <_MultiThreadedRendezvous of RPC that terminated with:
status = StatusCode.UNAVAILABLE
details = "Socket closed"
debug_error_string = "{"created":"@1650392645.286283826","description":"Error received from peer ipv6:[::1]:32919","file":"src/core/lib/surface/call.cc","file_line":903,"grpc_message":"Socket closed","grpc_status":14}"
>
grpc._channel._MultiThreadedRendezvous: <_MultiThreadedRendezvous of RPC that terminated with:
status = StatusCode.UNAVAILABLE
details = "Connection reset by peer"
debug_error_string = "{"created":"@1650392645.286283232","description":"Error received from peer ipv6:[::1]:35491","file":"src/core/lib/surface/call.cc","file_line":903,"grpc_message":"Connection reset by peer","grpc_status":14}"
> File "/usr/lib/python3.9/threading.py", line 973, in _bootstrap_inner
self.run()
File "/usr/lib/python3.9/threading.py", line 910, in run
self._target(*self._args, **self._kwargs)
File "<https://ci-beam.apache.org/job/beam_PostCommit_Python39/ws/src/sdks/python/apache_beam/runners/worker/data_plane.py",> line 651, in <lambda>
target=lambda: self._read_inputs(elements_iterator),
File "<https://ci-beam.apache.org/job/beam_PostCommit_Python39/ws/src/sdks/python/apache_beam/runners/worker/data_plane.py",> line 634, in _read_inputs
for elements in elements_iterator:
File "<https://ci-beam.apache.org/job/beam_PostCommit_Python39/ws/src/build/gradleenv/2022703443/lib/python3.9/site-packages/grpc/_channel.py",> line 426, in __next__
return self._next()
File "<https://ci-beam.apache.org/job/beam_PostCommit_Python39/ws/src/build/gradleenv/2022703443/lib/python3.9/site-packages/grpc/_channel.py",> line 826, in _next
raise self
grpc._channel._MultiThreadedRendezvous: <_MultiThreadedRendezvous of RPC that terminated with:
status = StatusCode.UNAVAILABLE
details = "Socket closed"
debug_error_string = "{"created":"@1650392645.286295642","description":"Error received from peer ipv6:[::1]:43855","file":"src/core/lib/surface/call.cc","file_line":903,"grpc_message":"Socket closed","grpc_status":14}"
>
> Task :sdks:python:test-suites:portable:py39:postCommitPy39
> Task :sdks:python:test-suites:dataflow:py39:postCommitIT
E0419 18:25:49.781686146 3822840 fork_posix.cc:70] Fork support is only compatible with the epoll1 and poll polling strategies
E0419 18:27:50.471943382 3822796 fork_posix.cc:70] Fork support is only compatible with the epoll1 and poll polling strategies
E0419 18:31:00.381842143 3822776 fork_posix.cc:70] Fork support is only compatible with the epoll1 and poll polling strategies
E0419 18:35:38.248070310 3822796 fork_posix.cc:70] Fork support is only compatible with the epoll1 and poll polling strategies
E0419 18:37:45.609906604 3822776 fork_posix.cc:70] Fork support is only compatible with the epoll1 and poll polling strategies
E0419 18:45:31.732340811 3822776 fork_posix.cc:70] Fork support is only compatible with the epoll1 and poll polling strategies
E0419 18:47:27.575426669 3822840 fork_posix.cc:70] Fork support is only compatible with the epoll1 and poll polling strategies
E0419 18:54:23.345653554 3822776 fork_posix.cc:70] Fork support is only compatible with the epoll1 and poll polling strategies
E0419 19:00:57.048314578 3822776 fork_posix.cc:70] Fork support is only compatible with the epoll1 and poll polling strategies
E0419 19:04:21.574661471 3822840 fork_posix.cc:70] Fork support is only compatible with the epoll1 and poll polling strategies
E0419 19:07:27.109157805 3822776 fork_posix.cc:70] Fork support is only compatible with the epoll1 and poll polling strategies
E0419 19:14:21.999545058 3822776 fork_posix.cc:70] Fork support is only compatible with the epoll1 and poll polling strategies
E0419 19:18:48.684126060 3822814 fork_posix.cc:70] Fork support is only compatible with the epoll1 and poll polling strategies
E0419 19:20:56.356089670 3822776 fork_posix.cc:70] Fork support is only compatible with the epoll1 and poll polling strategies
E0419 19:21:20.424905968 3822840 fork_posix.cc:70] Fork support is only compatible with the epoll1 and poll polling strategies
E0419 19:29:18.137982603 3822776 fork_posix.cc:70] Fork support is only compatible with the epoll1 and poll polling strategies
E0419 19:29:31.453538839 3822814 fork_posix.cc:70] Fork support is only compatible with the epoll1 and poll polling strategies
E0419 19:36:30.528287849 3822776 fork_posix.cc:70] Fork support is only compatible with the epoll1 and poll polling strategies
> Task :sdks:python:test-suites:dataflow:py39:postCommitIT FAILED
FAILURE: Build failed with an exception.
* Where:
Script '<https://ci-beam.apache.org/job/beam_PostCommit_Python39/ws/src/sdks/python/test-suites/dataflow/common.gradle'> line: 121
* What went wrong:
Execution failed for task ':sdks:python:test-suites:dataflow:py39:postCommitIT'.
> Process 'command 'sh'' finished with non-zero exit value 1
* Try:
> Run with --stacktrace option to get the stack trace.
> Run with --info or --debug option to get more log output.
> Run with --scan to get full insights.
* Get more help at https://help.gradle.org
Deprecated Gradle features were used in this build, making it incompatible with Gradle 8.0.
You can use '--warning-mode all' to show the individual deprecation warnings and determine if they come from your own scripts or plugins.
See https://docs.gradle.org/7.4/userguide/command_line_interface.html#sec:command_line_warnings
Execution optimizations have been disabled for 1 invalid unit(s) of work during this build to ensure correctness.
Please consult deprecation warnings for more details.
BUILD FAILED in 1h 32m 4s
219 actionable tasks: 149 executed, 64 from cache, 6 up-to-date
Publishing build scan...
https://gradle.com/s/jyrbabux4od74
Build step 'Invoke Gradle script' changed build result to FAILURE
Build step 'Invoke Gradle script' marked build as failure
---------------------------------------------------------------------
To unsubscribe, e-mail: builds-unsubscribe@beam.apache.org
For additional commands, e-mail: builds-help@beam.apache.org
Build failed in Jenkins: beam_PostCommit_Python39 #265
Posted by Apache Jenkins Server <je...@builds.apache.org>.
See <https://ci-beam.apache.org/job/beam_PostCommit_Python39/265/display/redirect>
Changes:
------------------------------------------
[...truncated 23.97 MB...]
}
message: "Closing all cached grpc data channels."
log_location: "/usr/local/lib/python3.9/site-packages/apache_beam/runners/worker/data_plane.py:782"
thread: "MainThread"
INFO:root:severity: INFO
timestamp {
seconds: 1650371021
nanos: 371548414
}
message: "Closing all cached gRPC state handlers."
log_location: "/usr/local/lib/python3.9/site-packages/apache_beam/runners/worker/sdk_worker.py:859"
thread: "MainThread"
INFO:root:severity: INFO
timestamp {
seconds: 1650371021
nanos: 371767282
}
message: "Done consuming work."
log_location: "/usr/local/lib/python3.9/site-packages/apache_beam/runners/worker/sdk_worker.py:257"
thread: "MainThread"
INFO:root:severity: INFO
timestamp {
seconds: 1650371021
nanos: 371842145
}
message: "Python sdk harness exiting."
log_location: "/usr/local/lib/python3.9/site-packages/apache_beam/runners/worker/sdk_worker_main.py:181"
thread: "MainThread"
INFO:apache_beam.runners.portability.local_job_service:Completed job in 9.93582797050476 seconds with state DONE.
INFO:root:Completed job in 9.93582797050476 seconds with state DONE.
INFO:apache_beam.runners.portability.portable_runner:Job state changed to DONE
> Task :sdks:python:test-suites:portable:py39:portableWordCountSparkRunnerBatch
INFO:apache_beam.runners.worker.worker_pool_main:Listening for workers at localhost:36957
WARNING:root:Make sure that locally built Python SDK docker image has Python 3.9 interpreter.
INFO:root:Default Python SDK image for environment is apache/beam_python3.9_sdk:2.39.0.dev
INFO:apache_beam.runners.portability.fn_api_runner.translations:==================== <function pack_combiners at 0x7f58f21e7c10> ====================
INFO:apache_beam.runners.portability.fn_api_runner.translations:==================== <function lift_combiners at 0x7f58f21e7ca0> ====================
INFO:apache_beam.runners.portability.fn_api_runner.translations:==================== <function sort_stages at 0x7f58f21e8430> ====================
INFO:apache_beam.utils.subprocess_server:Starting service with ['java' '-jar' '<https://ci-beam.apache.org/job/beam_PostCommit_Python39/ws/src/runners/spark/2/job-server/build/libs/beam-runners-spark-job-server-2.39.0-SNAPSHOT.jar'> '--spark-master-url' 'local[4]' '--artifacts-dir' '/tmp/beam-temponf4_40l/artifacts65xywarb' '--job-port' '33607' '--artifact-port' '0' '--expansion-port' '0']
E0419 12:23:44.366937108 491655 fork_posix.cc:70] Fork support is only compatible with the epoll1 and poll polling strategies
INFO:apache_beam.utils.subprocess_server:b'22/04/19 12:23:46 WARN software.amazon.awssdk.regions.internal.util.EC2MetadataUtils: Unable to retrieve the requested metadata.'
INFO:apache_beam.utils.subprocess_server:b'22/04/19 12:23:46 INFO org.apache.beam.runners.jobsubmission.JobServerDriver: ArtifactStagingService started on localhost:40899'
INFO:apache_beam.utils.subprocess_server:b'22/04/19 12:23:46 INFO org.apache.beam.runners.jobsubmission.JobServerDriver: Java ExpansionService started on localhost:45155'
INFO:apache_beam.utils.subprocess_server:b'22/04/19 12:23:46 INFO org.apache.beam.runners.jobsubmission.JobServerDriver: JobService started on localhost:33607'
INFO:apache_beam.utils.subprocess_server:b'22/04/19 12:23:46 INFO org.apache.beam.runners.jobsubmission.JobServerDriver: Job server now running, terminate with Ctrl+C'
WARNING:apache_beam.options.pipeline_options:Discarding unparseable args: ['--parallelism=2']
INFO:apache_beam.utils.subprocess_server:b'22/04/19 12:23:46 INFO org.apache.beam.runners.fnexecution.artifact.ArtifactStagingService: Staging artifacts for job_00b9d51e-06ae-4c3f-8459-8b19363c76b3.'
INFO:apache_beam.utils.subprocess_server:b'22/04/19 12:23:46 INFO org.apache.beam.runners.fnexecution.artifact.ArtifactStagingService: Resolving artifacts for job_00b9d51e-06ae-4c3f-8459-8b19363c76b3.ref_Environment_default_environment_1.'
INFO:apache_beam.utils.subprocess_server:b'22/04/19 12:23:46 INFO org.apache.beam.runners.fnexecution.artifact.ArtifactStagingService: Getting 1 artifacts for job_00b9d51e-06ae-4c3f-8459-8b19363c76b3.null.'
INFO:apache_beam.utils.subprocess_server:b'22/04/19 12:23:46 INFO org.apache.beam.runners.fnexecution.artifact.ArtifactStagingService: Artifacts fully staged for job_00b9d51e-06ae-4c3f-8459-8b19363c76b3.'
INFO:apache_beam.utils.subprocess_server:b'22/04/19 12:23:47 INFO org.apache.beam.runners.spark.SparkJobInvoker: Invoking job BeamApp-jenkins-0419122347-7bc7e18e_7f7a17fd-76a5-49a2-9dfa-886d54349a97'
INFO:apache_beam.utils.subprocess_server:b'22/04/19 12:23:47 INFO org.apache.beam.runners.jobsubmission.JobInvocation: Starting job invocation BeamApp-jenkins-0419122347-7bc7e18e_7f7a17fd-76a5-49a2-9dfa-886d54349a97'
INFO:apache_beam.runners.portability.portable_runner:Environment "LOOPBACK" has started a component necessary for the execution. Be sure to run the pipeline using
with Pipeline() as p:
p.apply(..)
This ensures that the pipeline finishes before this program exits.
INFO:apache_beam.runners.portability.portable_runner:Job state changed to STOPPED
INFO:apache_beam.runners.portability.portable_runner:Job state changed to STARTING
INFO:apache_beam.runners.portability.portable_runner:Job state changed to RUNNING
INFO:apache_beam.utils.subprocess_server:b'22/04/19 12:23:47 INFO org.apache.beam.runners.spark.translation.SparkContextFactory: Creating a brand new Spark Context.'
INFO:apache_beam.utils.subprocess_server:b'22/04/19 12:23:47 WARN org.apache.hadoop.util.NativeCodeLoader: Unable to load native-hadoop library for your platform... using builtin-java classes where applicable'
INFO:apache_beam.utils.subprocess_server:b'22/04/19 12:23:48 INFO org.apache.beam.runners.spark.aggregators.AggregatorsAccumulator: Instantiated aggregators accumulator:'
INFO:apache_beam.utils.subprocess_server:b'22/04/19 12:23:48 INFO org.apache.beam.runners.spark.metrics.MetricsAccumulator: Instantiated metrics accumulator: MetricQueryResults()'
INFO:apache_beam.utils.subprocess_server:b'22/04/19 12:23:48 WARN software.amazon.awssdk.regions.internal.util.EC2MetadataUtils: Unable to retrieve the requested metadata.'
INFO:apache_beam.utils.subprocess_server:b'22/04/19 12:23:48 INFO org.apache.beam.runners.spark.SparkPipelineRunner: Running job BeamApp-jenkins-0419122347-7bc7e18e_7f7a17fd-76a5-49a2-9dfa-886d54349a97 on Spark master local[4]'
INFO:apache_beam.utils.subprocess_server:b'22/04/19 12:23:49 WARN software.amazon.awssdk.regions.internal.util.EC2MetadataUtils: Unable to retrieve the requested metadata.'
INFO:apache_beam.utils.subprocess_server:b'22/04/19 12:23:49 WARN software.amazon.awssdk.regions.internal.util.EC2MetadataUtils: Unable to retrieve the requested metadata.'
INFO:apache_beam.utils.subprocess_server:b'22/04/19 12:23:49 WARN software.amazon.awssdk.regions.internal.util.EC2MetadataUtils: Unable to retrieve the requested metadata.'
INFO:apache_beam.utils.subprocess_server:b'22/04/19 12:23:49 WARN software.amazon.awssdk.regions.internal.util.EC2MetadataUtils: Unable to retrieve the requested metadata.'
INFO:apache_beam.runners.worker.statecache:Creating state cache with size 0
INFO:apache_beam.runners.worker.sdk_worker:Creating insecure control channel for localhost:34127.
INFO:apache_beam.runners.worker.sdk_worker:Control channel established.
INFO:apache_beam.runners.worker.sdk_worker:Initializing SDKHarness with unbounded number of workers.
INFO:apache_beam.utils.subprocess_server:b'22/04/19 12:23:49 INFO org.apache.beam.runners.fnexecution.control.FnApiControlClientPoolService: Beam Fn Control client connected with id 1-1'
INFO:apache_beam.utils.subprocess_server:b'22/04/19 12:23:49 INFO org.apache.beam.runners.fnexecution.control.FnApiControlClientPoolService: getProcessBundleDescriptor request with id 1-2'
INFO:apache_beam.runners.worker.sdk_worker:Creating insecure state channel for localhost:46683.
INFO:apache_beam.runners.worker.sdk_worker:State channel established.
INFO:apache_beam.runners.worker.data_plane:Creating client data channel for localhost:44525
INFO:apache_beam.utils.subprocess_server:b'22/04/19 12:23:49 INFO org.apache.beam.runners.fnexecution.data.GrpcDataService: Beam Fn Data client connected.'
INFO:apache_beam.utils.subprocess_server:b'22/04/19 12:23:50 INFO org.apache.beam.runners.fnexecution.control.FnApiControlClientPoolService: getProcessBundleDescriptor request with id 1-3'
INFO:apache_beam.utils.subprocess_server:b'22/04/19 12:23:50 WARN software.amazon.awssdk.regions.internal.util.EC2MetadataUtils: Unable to retrieve the requested metadata.'
INFO:apache_beam.utils.subprocess_server:b'22/04/19 12:23:50 WARN software.amazon.awssdk.regions.internal.util.EC2MetadataUtils: Unable to retrieve the requested metadata.'
INFO:apache_beam.utils.subprocess_server:b'22/04/19 12:23:50 WARN software.amazon.awssdk.regions.internal.util.EC2MetadataUtils: Unable to retrieve the requested metadata.'
INFO:apache_beam.utils.subprocess_server:b'22/04/19 12:23:50 WARN software.amazon.awssdk.regions.internal.util.EC2MetadataUtils: Unable to retrieve the requested metadata.'
INFO:apache_beam.utils.subprocess_server:b'22/04/19 12:23:50 INFO org.apache.beam.runners.fnexecution.control.FnApiControlClientPoolService: getProcessBundleDescriptor request with id 1-4'
INFO:apache_beam.utils.subprocess_server:b'22/04/19 12:23:50 INFO org.apache.beam.runners.fnexecution.control.FnApiControlClientPoolService: getProcessBundleDescriptor request with id 1-5'
INFO:apache_beam.utils.subprocess_server:b'22/04/19 12:23:50 WARN software.amazon.awssdk.regions.internal.util.EC2MetadataUtils: Unable to retrieve the requested metadata.'
INFO:apache_beam.utils.subprocess_server:b'22/04/19 12:23:50 WARN software.amazon.awssdk.regions.internal.util.EC2MetadataUtils: Unable to retrieve the requested metadata.'
INFO:apache_beam.utils.subprocess_server:b'22/04/19 12:23:50 WARN software.amazon.awssdk.regions.internal.util.EC2MetadataUtils: Unable to retrieve the requested metadata.'
INFO:apache_beam.utils.subprocess_server:b'22/04/19 12:23:50 WARN software.amazon.awssdk.regions.internal.util.EC2MetadataUtils: Unable to retrieve the requested metadata.'
INFO:apache_beam.utils.subprocess_server:b'22/04/19 12:23:50 INFO org.apache.beam.runners.fnexecution.control.FnApiControlClientPoolService: getProcessBundleDescriptor request with id 1-6'
INFO:apache_beam.utils.subprocess_server:b'22/04/19 12:23:50 INFO org.apache.beam.runners.fnexecution.control.FnApiControlClientPoolService: getProcessBundleDescriptor request with id 1-7'
INFO:apache_beam.utils.subprocess_server:b'22/04/19 12:23:50 INFO org.apache.beam.runners.fnexecution.control.FnApiControlClientPoolService: getProcessBundleDescriptor request with id 1-9'
INFO:apache_beam.utils.subprocess_server:b'22/04/19 12:23:50 INFO org.apache.beam.runners.fnexecution.control.FnApiControlClientPoolService: getProcessBundleDescriptor request with id 1-8'
INFO:apache_beam.utils.subprocess_server:b'22/04/19 12:23:50 INFO org.apache.beam.runners.fnexecution.control.FnApiControlClientPoolService: getProcessBundleDescriptor request with id 1-10'
INFO:apache_beam.utils.subprocess_server:b'22/04/19 12:23:50 INFO org.apache.beam.runners.fnexecution.control.FnApiControlClientPoolService: getProcessBundleDescriptor request with id 1-11'
INFO:apache_beam.utils.subprocess_server:b'22/04/19 12:23:50 INFO org.apache.beam.runners.fnexecution.control.FnApiControlClientPoolService: getProcessBundleDescriptor request with id 1-13'
INFO:apache_beam.utils.subprocess_server:b'22/04/19 12:23:50 INFO org.apache.beam.runners.fnexecution.control.FnApiControlClientPoolService: getProcessBundleDescriptor request with id 1-12'
INFO:apache_beam.utils.subprocess_server:b'22/04/19 12:23:50 WARN software.amazon.awssdk.regions.internal.util.EC2MetadataUtils: Unable to retrieve the requested metadata.'
INFO:apache_beam.utils.subprocess_server:b'22/04/19 12:23:50 WARN software.amazon.awssdk.regions.internal.util.EC2MetadataUtils: Unable to retrieve the requested metadata.'
INFO:apache_beam.utils.subprocess_server:b'22/04/19 12:23:50 WARN software.amazon.awssdk.regions.internal.util.EC2MetadataUtils: Unable to retrieve the requested metadata.'
INFO:apache_beam.utils.subprocess_server:b'22/04/19 12:23:50 WARN software.amazon.awssdk.regions.internal.util.EC2MetadataUtils: Unable to retrieve the requested metadata.'
INFO:apache_beam.utils.subprocess_server:b'22/04/19 12:23:50 INFO org.apache.beam.runners.fnexecution.control.FnApiControlClientPoolService: getProcessBundleDescriptor request with id 1-14'
INFO:apache_beam.utils.subprocess_server:b'22/04/19 12:23:50 WARN software.amazon.awssdk.regions.internal.util.EC2MetadataUtils: Unable to retrieve the requested metadata.'
INFO:apache_beam.utils.subprocess_server:b'22/04/19 12:23:50 WARN software.amazon.awssdk.regions.internal.util.EC2MetadataUtils: Unable to retrieve the requested metadata.'
INFO:apache_beam.utils.subprocess_server:b'22/04/19 12:23:50 WARN software.amazon.awssdk.regions.internal.util.EC2MetadataUtils: Unable to retrieve the requested metadata.'
INFO:apache_beam.utils.subprocess_server:b'22/04/19 12:23:50 WARN software.amazon.awssdk.regions.internal.util.EC2MetadataUtils: Unable to retrieve the requested metadata.'
INFO:apache_beam.utils.subprocess_server:b'22/04/19 12:23:50 INFO org.apache.beam.runners.fnexecution.control.FnApiControlClientPoolService: getProcessBundleDescriptor request with id 1-15'
INFO:apache_beam.utils.subprocess_server:b'22/04/19 12:23:50 INFO org.apache.beam.runners.spark.SparkPipelineRunner: Job BeamApp-jenkins-0419122347-7bc7e18e_7f7a17fd-76a5-49a2-9dfa-886d54349a97: Pipeline translated successfully. Computing outputs'
INFO:apache_beam.utils.subprocess_server:b'22/04/19 12:23:50 WARN software.amazon.awssdk.regions.internal.util.EC2MetadataUtils: Unable to retrieve the requested metadata.'
INFO:apache_beam.utils.subprocess_server:b'22/04/19 12:23:50 WARN software.amazon.awssdk.regions.internal.util.EC2MetadataUtils: Unable to retrieve the requested metadata.'
INFO:apache_beam.utils.subprocess_server:b'22/04/19 12:23:50 WARN software.amazon.awssdk.regions.internal.util.EC2MetadataUtils: Unable to retrieve the requested metadata.'
INFO:apache_beam.utils.subprocess_server:b'22/04/19 12:23:50 WARN software.amazon.awssdk.regions.internal.util.EC2MetadataUtils: Unable to retrieve the requested metadata.'
INFO:apache_beam.utils.subprocess_server:b'22/04/19 12:23:50 INFO org.apache.beam.runners.fnexecution.control.FnApiControlClientPoolService: getProcessBundleDescriptor request with id 1-16'
INFO:apache_beam.io.filebasedsink:Starting finalize_write threads with num_shards: 4 (skipped: 0), batches: 4, num_threads: 4
INFO:apache_beam.io.filebasedsink:Renamed 4 shards in 0.01 seconds.
INFO:apache_beam.utils.subprocess_server:b'22/04/19 12:23:50 INFO org.apache.beam.runners.spark.SparkPipelineRunner: Job BeamApp-jenkins-0419122347-7bc7e18e_7f7a17fd-76a5-49a2-9dfa-886d54349a97 finished.'
INFO:apache_beam.runners.portability.portable_runner:Job state changed to DONE
Exception in thread run_worker_1-1:
Exception in thread read_state:
Traceback (most recent call last):
File "/usr/lib/python3.9/threading.py", line 973, in _bootstrap_inner
Traceback (most recent call last):
File "/usr/lib/python3.9/threading.py", line 973, in _bootstrap_inner
self.run()
File "/usr/lib/python3.9/threading.py", line 910, in run
self._target(*self._args, **self._kwargs)
File "<https://ci-beam.apache.org/job/beam_PostCommit_Python39/ws/src/sdks/python/apache_beam/runners/worker/sdk_worker.py",> line 234, in run
self.run()
ERROR:apache_beam.runners.worker.data_plane:Failed to read inputs in the data plane.
Traceback (most recent call last):
File "<https://ci-beam.apache.org/job/beam_PostCommit_Python39/ws/src/sdks/python/apache_beam/runners/worker/data_plane.py",> line 634, in _read_inputs
for elements in elements_iterator:
File "<https://ci-beam.apache.org/job/beam_PostCommit_Python39/ws/src/build/gradleenv/2022703443/lib/python3.9/site-packages/grpc/_channel.py",> line 426, in __next__
return self._next()
File "<https://ci-beam.apache.org/job/beam_PostCommit_Python39/ws/src/build/gradleenv/2022703443/lib/python3.9/site-packages/grpc/_channel.py",> line 826, in _next
raise self
grpc._channel._MultiThreadedRendezvous: <_MultiThreadedRendezvous of RPC that terminated with:
status = StatusCode.UNAVAILABLE
details = "Connection reset by peer"
debug_error_string = "{"created":"@1650371031.386488034","description":"Error received from peer ipv6:[::1]:44525","file":"src/core/lib/surface/call.cc","file_line":903,"grpc_message":"Connection reset by peer","grpc_status":14}"
>
File "/usr/lib/python3.9/threading.py", line 910, in run
for work_request in self._control_stub.Control(get_responses()):
self._target(*self._args, **self._kwargs)
File "<https://ci-beam.apache.org/job/beam_PostCommit_Python39/ws/src/sdks/python/apache_beam/runners/worker/sdk_worker.py",> line 990, in pull_responses
File "<https://ci-beam.apache.org/job/beam_PostCommit_Python39/ws/src/build/gradleenv/2022703443/lib/python3.9/site-packages/grpc/_channel.py",> line 426, in __next__
Exception in thread read_grpc_client_inputs:
Traceback (most recent call last):
File "/usr/lib/python3.9/threading.py", line 973, in _bootstrap_inner
return self._next()
for response in responses:
File "<https://ci-beam.apache.org/job/beam_PostCommit_Python39/ws/src/build/gradleenv/2022703443/lib/python3.9/site-packages/grpc/_channel.py",> line 426, in __next__
File "<https://ci-beam.apache.org/job/beam_PostCommit_Python39/ws/src/build/gradleenv/2022703443/lib/python3.9/site-packages/grpc/_channel.py",> line 826, in _next
self.run()
return self._next()
File "<https://ci-beam.apache.org/job/beam_PostCommit_Python39/ws/src/build/gradleenv/2022703443/lib/python3.9/site-packages/grpc/_channel.py",> line 826, in _next
File "/usr/lib/python3.9/threading.py", line 910, in run
raise self
self._target(*self._args, **self._kwargs)
grpc._channel._MultiThreadedRendezvous: <_MultiThreadedRendezvous of RPC that terminated with:
status = StatusCode.UNAVAILABLE
details = "Socket closed"
debug_error_string = "{"created":"@1650371031.386488400","description":"Error received from peer ipv6:[::1]:34127","file":"src/core/lib/surface/call.cc","file_line":903,"grpc_message":"Socket closed","grpc_status":14}"
>
File "<https://ci-beam.apache.org/job/beam_PostCommit_Python39/ws/src/sdks/python/apache_beam/runners/worker/data_plane.py",> line 651, in <lambda>
raise self
target=lambda: self._read_inputs(elements_iterator),
grpc._channel._MultiThreadedRendezvous: <_MultiThreadedRendezvous of RPC that terminated with:
status = StatusCode.UNAVAILABLE
details = "Socket closed"
debug_error_string = "{"created":"@1650371031.386514801","description":"Error received from peer ipv6:[::1]:46683","file":"src/core/lib/surface/call.cc","file_line":903,"grpc_message":"Socket closed","grpc_status":14}"
> File "<https://ci-beam.apache.org/job/beam_PostCommit_Python39/ws/src/sdks/python/apache_beam/runners/worker/data_plane.py",> line 634, in _read_inputs
for elements in elements_iterator:
File "<https://ci-beam.apache.org/job/beam_PostCommit_Python39/ws/src/build/gradleenv/2022703443/lib/python3.9/site-packages/grpc/_channel.py",> line 426, in __next__
return self._next()
File "<https://ci-beam.apache.org/job/beam_PostCommit_Python39/ws/src/build/gradleenv/2022703443/lib/python3.9/site-packages/grpc/_channel.py",> line 826, in _next
raise self
grpc._channel._MultiThreadedRendezvous: <_MultiThreadedRendezvous of RPC that terminated with:
status = StatusCode.UNAVAILABLE
details = "Connection reset by peer"
debug_error_string = "{"created":"@1650371031.386488034","description":"Error received from peer ipv6:[::1]:44525","file":"src/core/lib/surface/call.cc","file_line":903,"grpc_message":"Connection reset by peer","grpc_status":14}"
>
> Task :sdks:python:test-suites:portable:py39:postCommitPy39
> Task :sdks:python:test-suites:dataflow:py39:postCommitIT
E0419 12:25:54.217808238 470165 fork_posix.cc:70] Fork support is only compatible with the epoll1 and poll polling strategies
E0419 12:27:59.725122939 470204 fork_posix.cc:70] Fork support is only compatible with the epoll1 and poll polling strategies
E0419 12:32:07.400433563 470142 fork_posix.cc:70] Fork support is only compatible with the epoll1 and poll polling strategies
E0419 12:32:31.441889132 470165 fork_posix.cc:70] Fork support is only compatible with the epoll1 and poll polling strategies
E0419 12:35:54.357965110 470204 fork_posix.cc:70] Fork support is only compatible with the epoll1 and poll polling strategies
E0419 12:38:31.111348704 470142 fork_posix.cc:70] Fork support is only compatible with the epoll1 and poll polling strategies
E0419 12:39:04.815259590 470165 fork_posix.cc:70] Fork support is only compatible with the epoll1 and poll polling strategies
E0419 12:46:20.538570081 470165 fork_posix.cc:70] Fork support is only compatible with the epoll1 and poll polling strategies
E0419 12:46:24.900563400 470142 fork_posix.cc:70] Fork support is only compatible with the epoll1 and poll polling strategies
E0419 12:53:32.929896046 470142 fork_posix.cc:70] Fork support is only compatible with the epoll1 and poll polling strategies
E0419 13:00:29.310336938 470142 fork_posix.cc:70] Fork support is only compatible with the epoll1 and poll polling strategies
E0419 13:03:01.675659032 470165 fork_posix.cc:70] Fork support is only compatible with the epoll1 and poll polling strategies
E0419 13:07:45.379648730 470142 fork_posix.cc:70] Fork support is only compatible with the epoll1 and poll polling strategies
E0419 13:15:32.454761030 470142 fork_posix.cc:70] Fork support is only compatible with the epoll1 and poll polling strategies
E0419 13:19:25.735871883 470165 fork_posix.cc:70] Fork support is only compatible with the epoll1 and poll polling strategies
E0419 13:21:53.739826292 470142 fork_posix.cc:70] Fork support is only compatible with the epoll1 and poll polling strategies
E0419 13:24:18.583042819 470184 fork_posix.cc:70] Fork support is only compatible with the epoll1 and poll polling strategies
E0419 13:29:40.225336722 470142 fork_posix.cc:70] Fork support is only compatible with the epoll1 and poll polling strategies
E0419 13:34:38.585693189 470184 fork_posix.cc:70] Fork support is only compatible with the epoll1 and poll polling strategies
E0419 13:36:06.466994084 470142 fork_posix.cc:70] Fork support is only compatible with the epoll1 and poll polling strategies
> Task :sdks:python:test-suites:dataflow:py39:postCommitIT FAILED
FAILURE: Build failed with an exception.
* Where:
Script '<https://ci-beam.apache.org/job/beam_PostCommit_Python39/ws/src/sdks/python/test-suites/dataflow/common.gradle'> line: 121
* What went wrong:
Execution failed for task ':sdks:python:test-suites:dataflow:py39:postCommitIT'.
> Process 'command 'sh'' finished with non-zero exit value 1
* Try:
> Run with --stacktrace option to get the stack trace.
> Run with --info or --debug option to get more log output.
> Run with --scan to get full insights.
* Get more help at https://help.gradle.org
Deprecated Gradle features were used in this build, making it incompatible with Gradle 8.0.
You can use '--warning-mode all' to show the individual deprecation warnings and determine if they come from your own scripts or plugins.
See https://docs.gradle.org/7.4/userguide/command_line_interface.html#sec:command_line_warnings
Execution optimizations have been disabled for 1 invalid unit(s) of work during this build to ensure correctness.
Please consult deprecation warnings for more details.
BUILD FAILED in 1h 33m 3s
219 actionable tasks: 156 executed, 57 from cache, 6 up-to-date
Publishing build scan...
https://gradle.com/s/kltwkklvcjhb4
Build step 'Invoke Gradle script' changed build result to FAILURE
Build step 'Invoke Gradle script' marked build as failure
---------------------------------------------------------------------
To unsubscribe, e-mail: builds-unsubscribe@beam.apache.org
For additional commands, e-mail: builds-help@beam.apache.org
Build failed in Jenkins: beam_PostCommit_Python39 #264
Posted by Apache Jenkins Server <je...@builds.apache.org>.
See <https://ci-beam.apache.org/job/beam_PostCommit_Python39/264/display/redirect?page=changes>
Changes:
[noreply] Merge pull request #17382: [BEAM-12356] Close DatasetService leak as
------------------------------------------
[...truncated 33.12 MB...]
INFO:root:severity: INFO
timestamp {
seconds: 1650349326
nanos: 433328866
}
message: "Closing all cached gRPC state handlers."
log_location: "/usr/local/lib/python3.9/site-packages/apache_beam/runners/worker/sdk_worker.py:859"
thread: "MainThread"
INFO:root:severity: INFO
timestamp {
seconds: 1650349326
nanos: 434086084
}
message: "Done consuming work."
log_location: "/usr/local/lib/python3.9/site-packages/apache_beam/runners/worker/sdk_worker.py:257"
thread: "MainThread"
INFO:root:severity: INFO
timestamp {
seconds: 1650349326
nanos: 434181213
}
message: "Python sdk harness exiting."
log_location: "/usr/local/lib/python3.9/site-packages/apache_beam/runners/worker/sdk_worker_main.py:181"
thread: "MainThread"
INFO:apache_beam.runners.portability.local_job_service:Completed job in 10.072751522064209 seconds with state DONE.
INFO:root:Completed job in 10.072751522064209 seconds with state DONE.
INFO:apache_beam.runners.portability.portable_runner:Job state changed to DONE
> Task :sdks:python:test-suites:portable:py39:portableWordCountSparkRunnerBatch
INFO:apache_beam.runners.worker.worker_pool_main:Listening for workers at localhost:42213
WARNING:root:Make sure that locally built Python SDK docker image has Python 3.9 interpreter.
INFO:root:Default Python SDK image for environment is apache/beam_python3.9_sdk:2.39.0.dev
INFO:apache_beam.runners.portability.fn_api_runner.translations:==================== <function pack_combiners at 0x7f367ef21c10> ====================
INFO:apache_beam.runners.portability.fn_api_runner.translations:==================== <function lift_combiners at 0x7f367ef21ca0> ====================
INFO:apache_beam.runners.portability.fn_api_runner.translations:==================== <function sort_stages at 0x7f367ef22430> ====================
INFO:apache_beam.utils.subprocess_server:Starting service with ['java' '-jar' '<https://ci-beam.apache.org/job/beam_PostCommit_Python39/ws/src/runners/spark/2/job-server/build/libs/beam-runners-spark-job-server-2.39.0-SNAPSHOT.jar'> '--spark-master-url' 'local[4]' '--artifacts-dir' '/tmp/beam-tempjlgpk3kb/artifactssslf2k1a' '--job-port' '42385' '--artifact-port' '0' '--expansion-port' '0']
E0419 06:22:09.721528706 3217163 fork_posix.cc:70] Fork support is only compatible with the epoll1 and poll polling strategies
INFO:apache_beam.utils.subprocess_server:b'22/04/19 06:22:11 WARN software.amazon.awssdk.regions.internal.util.EC2MetadataUtils: Unable to retrieve the requested metadata.'
INFO:apache_beam.utils.subprocess_server:b'22/04/19 06:22:11 INFO org.apache.beam.runners.jobsubmission.JobServerDriver: ArtifactStagingService started on localhost:41699'
INFO:apache_beam.utils.subprocess_server:b'22/04/19 06:22:11 INFO org.apache.beam.runners.jobsubmission.JobServerDriver: Java ExpansionService started on localhost:41423'
INFO:apache_beam.utils.subprocess_server:b'22/04/19 06:22:11 INFO org.apache.beam.runners.jobsubmission.JobServerDriver: JobService started on localhost:42385'
INFO:apache_beam.utils.subprocess_server:b'22/04/19 06:22:11 INFO org.apache.beam.runners.jobsubmission.JobServerDriver: Job server now running, terminate with Ctrl+C'
WARNING:apache_beam.options.pipeline_options:Discarding unparseable args: ['--parallelism=2']
INFO:apache_beam.utils.subprocess_server:b'22/04/19 06:22:12 INFO org.apache.beam.runners.fnexecution.artifact.ArtifactStagingService: Staging artifacts for job_eb0e7df8-dcbc-4698-8bec-29e745ae8776.'
INFO:apache_beam.utils.subprocess_server:b'22/04/19 06:22:12 INFO org.apache.beam.runners.fnexecution.artifact.ArtifactStagingService: Resolving artifacts for job_eb0e7df8-dcbc-4698-8bec-29e745ae8776.ref_Environment_default_environment_1.'
INFO:apache_beam.utils.subprocess_server:b'22/04/19 06:22:12 INFO org.apache.beam.runners.fnexecution.artifact.ArtifactStagingService: Getting 1 artifacts for job_eb0e7df8-dcbc-4698-8bec-29e745ae8776.null.'
INFO:apache_beam.utils.subprocess_server:b'22/04/19 06:22:12 INFO org.apache.beam.runners.fnexecution.artifact.ArtifactStagingService: Artifacts fully staged for job_eb0e7df8-dcbc-4698-8bec-29e745ae8776.'
INFO:apache_beam.utils.subprocess_server:b'22/04/19 06:22:12 INFO org.apache.beam.runners.spark.SparkJobInvoker: Invoking job BeamApp-jenkins-0419062212-cad47e9c_6d61dccd-7449-4d99-9cf7-2b42a5182eb6'
INFO:apache_beam.utils.subprocess_server:b'22/04/19 06:22:12 INFO org.apache.beam.runners.jobsubmission.JobInvocation: Starting job invocation BeamApp-jenkins-0419062212-cad47e9c_6d61dccd-7449-4d99-9cf7-2b42a5182eb6'
INFO:apache_beam.runners.portability.portable_runner:Environment "LOOPBACK" has started a component necessary for the execution. Be sure to run the pipeline using
with Pipeline() as p:
p.apply(..)
This ensures that the pipeline finishes before this program exits.
INFO:apache_beam.runners.portability.portable_runner:Job state changed to STOPPED
INFO:apache_beam.runners.portability.portable_runner:Job state changed to STARTING
INFO:apache_beam.runners.portability.portable_runner:Job state changed to RUNNING
INFO:apache_beam.utils.subprocess_server:b'22/04/19 06:22:13 INFO org.apache.beam.runners.spark.translation.SparkContextFactory: Creating a brand new Spark Context.'
INFO:apache_beam.utils.subprocess_server:b'22/04/19 06:22:13 WARN org.apache.hadoop.util.NativeCodeLoader: Unable to load native-hadoop library for your platform... using builtin-java classes where applicable'
INFO:apache_beam.utils.subprocess_server:b'22/04/19 06:22:14 INFO org.apache.beam.runners.spark.aggregators.AggregatorsAccumulator: Instantiated aggregators accumulator:'
INFO:apache_beam.utils.subprocess_server:b'22/04/19 06:22:14 INFO org.apache.beam.runners.spark.metrics.MetricsAccumulator: Instantiated metrics accumulator: MetricQueryResults()'
INFO:apache_beam.utils.subprocess_server:b'22/04/19 06:22:14 WARN software.amazon.awssdk.regions.internal.util.EC2MetadataUtils: Unable to retrieve the requested metadata.'
INFO:apache_beam.utils.subprocess_server:b'22/04/19 06:22:14 INFO org.apache.beam.runners.spark.SparkPipelineRunner: Running job BeamApp-jenkins-0419062212-cad47e9c_6d61dccd-7449-4d99-9cf7-2b42a5182eb6 on Spark master local[4]'
INFO:apache_beam.utils.subprocess_server:b'22/04/19 06:22:15 WARN software.amazon.awssdk.regions.internal.util.EC2MetadataUtils: Unable to retrieve the requested metadata.'
INFO:apache_beam.utils.subprocess_server:b'22/04/19 06:22:15 WARN software.amazon.awssdk.regions.internal.util.EC2MetadataUtils: Unable to retrieve the requested metadata.'
INFO:apache_beam.utils.subprocess_server:b'22/04/19 06:22:15 WARN software.amazon.awssdk.regions.internal.util.EC2MetadataUtils: Unable to retrieve the requested metadata.'
INFO:apache_beam.utils.subprocess_server:b'22/04/19 06:22:15 WARN software.amazon.awssdk.regions.internal.util.EC2MetadataUtils: Unable to retrieve the requested metadata.'
INFO:apache_beam.runners.worker.statecache:Creating state cache with size 0
INFO:apache_beam.runners.worker.sdk_worker:Creating insecure control channel for localhost:43105.
INFO:apache_beam.runners.worker.sdk_worker:Control channel established.
INFO:apache_beam.runners.worker.sdk_worker:Initializing SDKHarness with unbounded number of workers.
INFO:apache_beam.utils.subprocess_server:b'22/04/19 06:22:15 INFO org.apache.beam.runners.fnexecution.control.FnApiControlClientPoolService: Beam Fn Control client connected with id 1-1'
INFO:apache_beam.utils.subprocess_server:b'22/04/19 06:22:15 INFO org.apache.beam.runners.fnexecution.control.FnApiControlClientPoolService: getProcessBundleDescriptor request with id 1-2'
INFO:apache_beam.runners.worker.sdk_worker:Creating insecure state channel for localhost:42105.
INFO:apache_beam.runners.worker.sdk_worker:State channel established.
INFO:apache_beam.runners.worker.data_plane:Creating client data channel for localhost:34867
INFO:apache_beam.utils.subprocess_server:b'22/04/19 06:22:15 INFO org.apache.beam.runners.fnexecution.data.GrpcDataService: Beam Fn Data client connected.'
INFO:apache_beam.utils.subprocess_server:b'22/04/19 06:22:15 INFO org.apache.beam.runners.fnexecution.control.FnApiControlClientPoolService: getProcessBundleDescriptor request with id 1-3'
INFO:apache_beam.utils.subprocess_server:b'22/04/19 06:22:15 WARN software.amazon.awssdk.regions.internal.util.EC2MetadataUtils: Unable to retrieve the requested metadata.'
INFO:apache_beam.utils.subprocess_server:b'22/04/19 06:22:15 WARN software.amazon.awssdk.regions.internal.util.EC2MetadataUtils: Unable to retrieve the requested metadata.'
INFO:apache_beam.utils.subprocess_server:b'22/04/19 06:22:15 WARN software.amazon.awssdk.regions.internal.util.EC2MetadataUtils: Unable to retrieve the requested metadata.'
INFO:apache_beam.utils.subprocess_server:b'22/04/19 06:22:15 WARN software.amazon.awssdk.regions.internal.util.EC2MetadataUtils: Unable to retrieve the requested metadata.'
INFO:apache_beam.utils.subprocess_server:b'22/04/19 06:22:15 INFO org.apache.beam.runners.fnexecution.control.FnApiControlClientPoolService: getProcessBundleDescriptor request with id 1-4'
INFO:apache_beam.utils.subprocess_server:b'22/04/19 06:22:15 INFO org.apache.beam.runners.fnexecution.control.FnApiControlClientPoolService: getProcessBundleDescriptor request with id 1-5'
INFO:apache_beam.utils.subprocess_server:b'22/04/19 06:22:15 WARN software.amazon.awssdk.regions.internal.util.EC2MetadataUtils: Unable to retrieve the requested metadata.'
INFO:apache_beam.utils.subprocess_server:b'22/04/19 06:22:15 WARN software.amazon.awssdk.regions.internal.util.EC2MetadataUtils: Unable to retrieve the requested metadata.'
INFO:apache_beam.utils.subprocess_server:b'22/04/19 06:22:15 WARN software.amazon.awssdk.regions.internal.util.EC2MetadataUtils: Unable to retrieve the requested metadata.'
INFO:apache_beam.utils.subprocess_server:b'22/04/19 06:22:15 WARN software.amazon.awssdk.regions.internal.util.EC2MetadataUtils: Unable to retrieve the requested metadata.'
INFO:apache_beam.utils.subprocess_server:b'22/04/19 06:22:15 INFO org.apache.beam.runners.fnexecution.control.FnApiControlClientPoolService: getProcessBundleDescriptor request with id 1-7'
INFO:apache_beam.utils.subprocess_server:b'22/04/19 06:22:15 INFO org.apache.beam.runners.fnexecution.control.FnApiControlClientPoolService: getProcessBundleDescriptor request with id 1-8'
INFO:apache_beam.utils.subprocess_server:b'22/04/19 06:22:15 INFO org.apache.beam.runners.fnexecution.control.FnApiControlClientPoolService: getProcessBundleDescriptor request with id 1-9'
INFO:apache_beam.utils.subprocess_server:b'22/04/19 06:22:15 INFO org.apache.beam.runners.fnexecution.control.FnApiControlClientPoolService: getProcessBundleDescriptor request with id 1-6'
INFO:apache_beam.utils.subprocess_server:b'22/04/19 06:22:15 INFO org.apache.beam.runners.fnexecution.control.FnApiControlClientPoolService: getProcessBundleDescriptor request with id 1-10'
INFO:apache_beam.utils.subprocess_server:b'22/04/19 06:22:15 INFO org.apache.beam.runners.fnexecution.control.FnApiControlClientPoolService: getProcessBundleDescriptor request with id 1-11'
INFO:apache_beam.utils.subprocess_server:b'22/04/19 06:22:15 INFO org.apache.beam.runners.fnexecution.control.FnApiControlClientPoolService: getProcessBundleDescriptor request with id 1-12'
INFO:apache_beam.utils.subprocess_server:b'22/04/19 06:22:15 INFO org.apache.beam.runners.fnexecution.control.FnApiControlClientPoolService: getProcessBundleDescriptor request with id 1-13'
INFO:apache_beam.utils.subprocess_server:b'22/04/19 06:22:15 WARN software.amazon.awssdk.regions.internal.util.EC2MetadataUtils: Unable to retrieve the requested metadata.'
INFO:apache_beam.utils.subprocess_server:b'22/04/19 06:22:15 WARN software.amazon.awssdk.regions.internal.util.EC2MetadataUtils: Unable to retrieve the requested metadata.'
INFO:apache_beam.utils.subprocess_server:b'22/04/19 06:22:15 WARN software.amazon.awssdk.regions.internal.util.EC2MetadataUtils: Unable to retrieve the requested metadata.'
INFO:apache_beam.utils.subprocess_server:b'22/04/19 06:22:15 WARN software.amazon.awssdk.regions.internal.util.EC2MetadataUtils: Unable to retrieve the requested metadata.'
INFO:apache_beam.utils.subprocess_server:b'22/04/19 06:22:16 INFO org.apache.beam.runners.fnexecution.control.FnApiControlClientPoolService: getProcessBundleDescriptor request with id 1-14'
INFO:apache_beam.utils.subprocess_server:b'22/04/19 06:22:16 WARN software.amazon.awssdk.regions.internal.util.EC2MetadataUtils: Unable to retrieve the requested metadata.'
INFO:apache_beam.utils.subprocess_server:b'22/04/19 06:22:16 WARN software.amazon.awssdk.regions.internal.util.EC2MetadataUtils: Unable to retrieve the requested metadata.'
INFO:apache_beam.utils.subprocess_server:b'22/04/19 06:22:16 WARN software.amazon.awssdk.regions.internal.util.EC2MetadataUtils: Unable to retrieve the requested metadata.'
INFO:apache_beam.utils.subprocess_server:b'22/04/19 06:22:16 WARN software.amazon.awssdk.regions.internal.util.EC2MetadataUtils: Unable to retrieve the requested metadata.'
INFO:apache_beam.utils.subprocess_server:b'22/04/19 06:22:16 INFO org.apache.beam.runners.fnexecution.control.FnApiControlClientPoolService: getProcessBundleDescriptor request with id 1-15'
INFO:apache_beam.utils.subprocess_server:b'22/04/19 06:22:16 INFO org.apache.beam.runners.spark.SparkPipelineRunner: Job BeamApp-jenkins-0419062212-cad47e9c_6d61dccd-7449-4d99-9cf7-2b42a5182eb6: Pipeline translated successfully. Computing outputs'
INFO:apache_beam.utils.subprocess_server:b'22/04/19 06:22:16 WARN software.amazon.awssdk.regions.internal.util.EC2MetadataUtils: Unable to retrieve the requested metadata.'
INFO:apache_beam.utils.subprocess_server:b'22/04/19 06:22:16 WARN software.amazon.awssdk.regions.internal.util.EC2MetadataUtils: Unable to retrieve the requested metadata.'
INFO:apache_beam.utils.subprocess_server:b'22/04/19 06:22:16 WARN software.amazon.awssdk.regions.internal.util.EC2MetadataUtils: Unable to retrieve the requested metadata.'
INFO:apache_beam.utils.subprocess_server:b'22/04/19 06:22:16 WARN software.amazon.awssdk.regions.internal.util.EC2MetadataUtils: Unable to retrieve the requested metadata.'
INFO:apache_beam.utils.subprocess_server:b'22/04/19 06:22:16 INFO org.apache.beam.runners.fnexecution.control.FnApiControlClientPoolService: getProcessBundleDescriptor request with id 1-16'
INFO:apache_beam.io.filebasedsink:Starting finalize_write threads with num_shards: 4 (skipped: 0), batches: 4, num_threads: 4
INFO:apache_beam.io.filebasedsink:Renamed 4 shards in 0.01 seconds.
INFO:apache_beam.utils.subprocess_server:b'22/04/19 06:22:16 INFO org.apache.beam.runners.spark.SparkPipelineRunner: Job BeamApp-jenkins-0419062212-cad47e9c_6d61dccd-7449-4d99-9cf7-2b42a5182eb6 finished.'
INFO:apache_beam.runners.portability.portable_runner:Job state changed to DONE
Exception in thread run_worker_1-1:
Traceback (most recent call last):
File "/usr/lib/python3.9/threading.py", line 973, in _bootstrap_inner
Exception in thread read_state:
Traceback (most recent call last):
File "/usr/lib/python3.9/threading.py", line 973, in _bootstrap_inner
self.run()
File "/usr/lib/python3.9/threading.py", line 910, in run
self.run()
File "/usr/lib/python3.9/threading.py", line 910, in run
self._target(*self._args, **self._kwargs)
self._target(*self._args, **self._kwargs)
File "<https://ci-beam.apache.org/job/beam_PostCommit_Python39/ws/src/sdks/python/apache_beam/runners/worker/sdk_worker.py",> line 234, in run
File "<https://ci-beam.apache.org/job/beam_PostCommit_Python39/ws/src/sdks/python/apache_beam/runners/worker/sdk_worker.py",> line 990, in pull_responses
for work_request in self._control_stub.Control(get_responses()):
File "<https://ci-beam.apache.org/job/beam_PostCommit_Python39/ws/src/build/gradleenv/2022703443/lib/python3.9/site-packages/grpc/_channel.py",> line 426, in __next__
return self._next()
File "<https://ci-beam.apache.org/job/beam_PostCommit_Python39/ws/src/build/gradleenv/2022703443/lib/python3.9/site-packages/grpc/_channel.py",> line 826, in _next
for response in responses:
File "<https://ci-beam.apache.org/job/beam_PostCommit_Python39/ws/src/build/gradleenv/2022703443/lib/python3.9/site-packages/grpc/_channel.py",> line 426, in __next__
raise self
return self._next()
ERROR:apache_beam.runners.worker.data_plane:Failed to read inputs in the data plane.
Traceback (most recent call last):
File "<https://ci-beam.apache.org/job/beam_PostCommit_Python39/ws/src/sdks/python/apache_beam/runners/worker/data_plane.py",> line 634, in _read_inputs
for elements in elements_iterator:
File "<https://ci-beam.apache.org/job/beam_PostCommit_Python39/ws/src/build/gradleenv/2022703443/lib/python3.9/site-packages/grpc/_channel.py",> line 426, in __next__
return self._next()
File "<https://ci-beam.apache.org/job/beam_PostCommit_Python39/ws/src/build/gradleenv/2022703443/lib/python3.9/site-packages/grpc/_channel.py",> line 826, in _next
raise self
grpc._channel._MultiThreadedRendezvous: <_MultiThreadedRendezvous of RPC that terminated with:
status = StatusCode.UNAVAILABLE
details = "Socket closed"
debug_error_string = "{"created":"@1650349336.759377570","description":"Error received from peer ipv6:[::1]:34867","file":"src/core/lib/surface/call.cc","file_line":903,"grpc_message":"Socket closed","grpc_status":14}"
>
File "<https://ci-beam.apache.org/job/beam_PostCommit_Python39/ws/src/build/gradleenv/2022703443/lib/python3.9/site-packages/grpc/_channel.py",> line 826, in _next
Exception in thread read_grpc_client_inputs:
grpc._channel._MultiThreadedRendezvous: <_MultiThreadedRendezvous of RPC that terminated with:
status = StatusCode.UNAVAILABLE
details = "Socket closed"
debug_error_string = "{"created":"@1650349336.759422048","description":"Error received from peer ipv6:[::1]:43105","file":"src/core/lib/surface/call.cc","file_line":903,"grpc_message":"Socket closed","grpc_status":14}"
>
raise self
Traceback (most recent call last):
grpc._channel._MultiThreadedRendezvous: <_MultiThreadedRendezvous of RPC that terminated with:
status = StatusCode.UNAVAILABLE
details = "Socket closed"
debug_error_string = "{"created":"@1650349336.759423889","description":"Error received from peer ipv6:[::1]:42105","file":"src/core/lib/surface/call.cc","file_line":903,"grpc_message":"Socket closed","grpc_status":14}"
>
File "/usr/lib/python3.9/threading.py", line 973, in _bootstrap_inner
self.run()
File "/usr/lib/python3.9/threading.py", line 910, in run
self._target(*self._args, **self._kwargs)
File "<https://ci-beam.apache.org/job/beam_PostCommit_Python39/ws/src/sdks/python/apache_beam/runners/worker/data_plane.py",> line 651, in <lambda>
target=lambda: self._read_inputs(elements_iterator),
File "<https://ci-beam.apache.org/job/beam_PostCommit_Python39/ws/src/sdks/python/apache_beam/runners/worker/data_plane.py",> line 634, in _read_inputs
for elements in elements_iterator:
File "<https://ci-beam.apache.org/job/beam_PostCommit_Python39/ws/src/build/gradleenv/2022703443/lib/python3.9/site-packages/grpc/_channel.py",> line 426, in __next__
return self._next()
File "<https://ci-beam.apache.org/job/beam_PostCommit_Python39/ws/src/build/gradleenv/2022703443/lib/python3.9/site-packages/grpc/_channel.py",> line 826, in _next
raise self
grpc._channel._MultiThreadedRendezvous: <_MultiThreadedRendezvous of RPC that terminated with:
status = StatusCode.UNAVAILABLE
details = "Socket closed"
debug_error_string = "{"created":"@1650349336.759377570","description":"Error received from peer ipv6:[::1]:34867","file":"src/core/lib/surface/call.cc","file_line":903,"grpc_message":"Socket closed","grpc_status":14}"
>
> Task :sdks:python:test-suites:portable:py39:postCommitPy39
> Task :sdks:python:test-suites:dataflow:py39:postCommitIT
E0419 06:22:35.569877643 3192495 fork_posix.cc:70] Fork support is only compatible with the epoll1 and poll polling strategies
E0419 06:25:24.420130808 3192519 fork_posix.cc:70] Fork support is only compatible with the epoll1 and poll polling strategies
E0419 06:27:49.540720090 3192537 fork_posix.cc:70] Fork support is only compatible with the epoll1 and poll polling strategies
E0419 06:29:18.133673484 3192502 fork_posix.cc:70] Fork support is only compatible with the epoll1 and poll polling strategies
E0419 06:29:40.802837469 3192495 fork_posix.cc:70] Fork support is only compatible with the epoll1 and poll polling strategies
E0419 06:32:14.611118035 3192519 fork_posix.cc:70] Fork support is only compatible with the epoll1 and poll polling strategies
E0419 06:35:09.501204577 3192537 fork_posix.cc:70] Fork support is only compatible with the epoll1 and poll polling strategies
E0419 06:36:11.796447595 3192502 fork_posix.cc:70] Fork support is only compatible with the epoll1 and poll polling strategies
E0419 06:36:49.800764793 3192495 fork_posix.cc:70] Fork support is only compatible with the epoll1 and poll polling strategies
E0419 06:39:02.049516691 3192519 fork_posix.cc:70] Fork support is only compatible with the epoll1 and poll polling strategies
E0419 06:44:17.446604274 3192502 fork_posix.cc:70] Fork support is only compatible with the epoll1 and poll polling strategies
E0419 06:45:59.191010599 3192519 fork_posix.cc:70] Fork support is only compatible with the epoll1 and poll polling strategies
E0419 06:51:42.951775683 3192502 fork_posix.cc:70] Fork support is only compatible with the epoll1 and poll polling strategies
E0419 06:58:26.417851167 3192502 fork_posix.cc:70] Fork support is only compatible with the epoll1 and poll polling strategies
E0419 07:02:47.289606183 3192519 fork_posix.cc:70] Fork support is only compatible with the epoll1 and poll polling strategies
E0419 07:04:54.811562126 3192502 fork_posix.cc:70] Fork support is only compatible with the epoll1 and poll polling strategies
E0419 07:13:03.938706021 3192502 fork_posix.cc:70] Fork support is only compatible with the epoll1 and poll polling strategies
E0419 07:15:20.440776699 3192541 fork_posix.cc:70] Fork support is only compatible with the epoll1 and poll polling strategies
E0419 07:19:42.762340302 3192502 fork_posix.cc:70] Fork support is only compatible with the epoll1 and poll polling strategies
E0419 07:19:54.899476753 3192519 fork_posix.cc:70] Fork support is only compatible with the epoll1 and poll polling strategies
E0419 07:25:52.290798203 3192541 fork_posix.cc:70] Fork support is only compatible with the epoll1 and poll polling strategies
E0419 07:26:42.293618904 3192502 fork_posix.cc:70] Fork support is only compatible with the epoll1 and poll polling strategies
E0419 07:33:31.034388415 3192502 fork_posix.cc:70] Fork support is only compatible with the epoll1 and poll polling strategies
E0419 07:40:11.451734740 3192502 fork_posix.cc:70] Fork support is only compatible with the epoll1 and poll polling strategies
> Task :sdks:python:test-suites:dataflow:py39:postCommitIT FAILED
FAILURE: Build failed with an exception.
* Where:
Script '<https://ci-beam.apache.org/job/beam_PostCommit_Python39/ws/src/sdks/python/test-suites/dataflow/common.gradle'> line: 121
* What went wrong:
Execution failed for task ':sdks:python:test-suites:dataflow:py39:postCommitIT'.
> Process 'command 'sh'' finished with non-zero exit value 1
* Try:
> Run with --stacktrace option to get the stack trace.
> Run with --info or --debug option to get more log output.
> Run with --scan to get full insights.
* Get more help at https://help.gradle.org
Deprecated Gradle features were used in this build, making it incompatible with Gradle 8.0.
You can use '--warning-mode all' to show the individual deprecation warnings and determine if they come from your own scripts or plugins.
See https://docs.gradle.org/7.4/userguide/command_line_interface.html#sec:command_line_warnings
Execution optimizations have been disabled for 1 invalid unit(s) of work during this build to ensure correctness.
Please consult deprecation warnings for more details.
BUILD FAILED in 1h 35m 28s
219 actionable tasks: 151 executed, 62 from cache, 6 up-to-date
Publishing build scan...
https://gradle.com/s/m5woyoxwr2aik
Build step 'Invoke Gradle script' changed build result to FAILURE
Build step 'Invoke Gradle script' marked build as failure
---------------------------------------------------------------------
To unsubscribe, e-mail: builds-unsubscribe@beam.apache.org
For additional commands, e-mail: builds-help@beam.apache.org
Build failed in Jenkins: beam_PostCommit_Python39 #263
Posted by Apache Jenkins Server <je...@builds.apache.org>.
See <https://ci-beam.apache.org/job/beam_PostCommit_Python39/263/display/redirect?page=changes>
Changes:
[Heejong Lee] [BEAM-14251] add output_coder_override to ExpansionRequest
[Heejong Lee] remove null
[Heejong Lee] better error msg
[Heejong Lee] update from comments
[noreply] [BEAM-14316] Introducing KafkaIO.Read implementation compatibility
[noreply] [BEAM-14290] Address staticcheck warnings in the reflectx package
[noreply] [BEAM-14302] Simply bools in fn.go, genx_test.go (#17356)
------------------------------------------
[...truncated 165.82 KB...]
> Task :sdks:java:extensions:sql:zetasql:jar
> Task :sdks:java:extensions:sql:expansion-service:compileJava
Note: <https://ci-beam.apache.org/job/beam_PostCommit_Python39/ws/src/sdks/java/extensions/sql/expansion-service/src/main/java/org/apache/beam/sdk/extensions/sql/expansion/ExternalSqlTransformRegistrar.java> uses or overrides a deprecated API.
Note: Recompile with -Xlint:deprecation for details.
> Task :sdks:java:extensions:sql:expansion-service:classes
> Task :sdks:java:extensions:sql:expansion-service:jar
> Task :sdks:java:extensions:sql:expansion-service:shadowJar
> Task :runners:google-cloud-dataflow-java:worker:compileJava
Note: Some input files use or override a deprecated API.
Note: Recompile with -Xlint:deprecation for details.
Note: Some input files use unchecked or unsafe operations.
Note: Recompile with -Xlint:unchecked for details.
> Task :runners:google-cloud-dataflow-java:worker:classes
> Task :runners:flink:1.14:job-server:shadowJar
> Task :runners:google-cloud-dataflow-java:worker:shadowJar
> Task :sdks:python:test-suites:dataflow:py39:postCommitIT
E0419 00:28:07.773154611 2944367 fork_posix.cc:70] Fork support is only compatible with the epoll1 and poll polling strategies
E0419 00:28:08.398699019 2944335 fork_posix.cc:70] Fork support is only compatible with the epoll1 and poll polling strategies
E0419 00:28:10.068104184 2944307 fork_posix.cc:70] Fork support is only compatible with the epoll1 and poll polling strategies
> Task :sdks:python:test-suites:portable:py39:portableWordCountSparkRunnerBatch
INFO:apache_beam.runners.worker.worker_pool_main:Listening for workers at localhost:44813
WARNING:root:Make sure that locally built Python SDK docker image has Python 3.9 interpreter.
INFO:root:Default Python SDK image for environment is apache/beam_python3.9_sdk:2.39.0.dev
INFO:apache_beam.runners.portability.fn_api_runner.translations:==================== <function pack_combiners at 0x7f8a3d974c10> ====================
INFO:apache_beam.runners.portability.fn_api_runner.translations:==================== <function lift_combiners at 0x7f8a3d974ca0> ====================
INFO:apache_beam.runners.portability.fn_api_runner.translations:==================== <function sort_stages at 0x7f8a3d97a430> ====================
INFO:apache_beam.utils.subprocess_server:Starting service with ['java' '-jar' '<https://ci-beam.apache.org/job/beam_PostCommit_Python39/ws/src/runners/spark/2/job-server/build/libs/beam-runners-spark-job-server-2.39.0-SNAPSHOT.jar'> '--spark-master-url' 'local[4]' '--artifacts-dir' '/tmp/beam-tempjqxu8hl2/artifactso72fheh7' '--job-port' '54329' '--artifact-port' '0' '--expansion-port' '0']
E0419 00:28:46.430063053 2945839 fork_posix.cc:70] Fork support is only compatible with the epoll1 and poll polling strategies
INFO:apache_beam.utils.subprocess_server:b'22/04/19 00:28:48 WARN software.amazon.awssdk.regions.internal.util.EC2MetadataUtils: Unable to retrieve the requested metadata.'
INFO:apache_beam.utils.subprocess_server:b'22/04/19 00:28:49 INFO org.apache.beam.runners.jobsubmission.JobServerDriver: ArtifactStagingService started on localhost:40207'
INFO:apache_beam.utils.subprocess_server:b'22/04/19 00:28:49 INFO org.apache.beam.runners.jobsubmission.JobServerDriver: Java ExpansionService started on localhost:34635'
INFO:apache_beam.utils.subprocess_server:b'22/04/19 00:28:49 INFO org.apache.beam.runners.jobsubmission.JobServerDriver: JobService started on localhost:54329'
INFO:apache_beam.utils.subprocess_server:b'22/04/19 00:28:49 INFO org.apache.beam.runners.jobsubmission.JobServerDriver: Job server now running, terminate with Ctrl+C'
WARNING:root:Waiting for grpc channel to be ready at localhost:54329.
WARNING:apache_beam.options.pipeline_options:Discarding unparseable args: ['--parallelism=2']
INFO:apache_beam.utils.subprocess_server:b'22/04/19 00:28:52 INFO org.apache.beam.runners.fnexecution.artifact.ArtifactStagingService: Staging artifacts for job_2347369a-35df-4c2b-8013-ea8e076e1dc5.'
INFO:apache_beam.utils.subprocess_server:b'22/04/19 00:28:52 INFO org.apache.beam.runners.fnexecution.artifact.ArtifactStagingService: Resolving artifacts for job_2347369a-35df-4c2b-8013-ea8e076e1dc5.ref_Environment_default_environment_1.'
INFO:apache_beam.utils.subprocess_server:b'22/04/19 00:28:52 INFO org.apache.beam.runners.fnexecution.artifact.ArtifactStagingService: Getting 1 artifacts for job_2347369a-35df-4c2b-8013-ea8e076e1dc5.null.'
INFO:apache_beam.utils.subprocess_server:b'22/04/19 00:28:52 INFO org.apache.beam.runners.fnexecution.artifact.ArtifactStagingService: Artifacts fully staged for job_2347369a-35df-4c2b-8013-ea8e076e1dc5.'
INFO:apache_beam.utils.subprocess_server:b'22/04/19 00:28:52 INFO org.apache.beam.runners.spark.SparkJobInvoker: Invoking job BeamApp-jenkins-0419002852-daeee1b2_dce8154c-1cab-4040-9bdd-0107c6e22cca'
INFO:apache_beam.utils.subprocess_server:b'22/04/19 00:28:52 INFO org.apache.beam.runners.jobsubmission.JobInvocation: Starting job invocation BeamApp-jenkins-0419002852-daeee1b2_dce8154c-1cab-4040-9bdd-0107c6e22cca'
INFO:apache_beam.runners.portability.portable_runner:Environment "LOOPBACK" has started a component necessary for the execution. Be sure to run the pipeline using
with Pipeline() as p:
p.apply(..)
This ensures that the pipeline finishes before this program exits.
INFO:apache_beam.runners.portability.portable_runner:Job state changed to STOPPED
INFO:apache_beam.runners.portability.portable_runner:Job state changed to STARTING
INFO:apache_beam.runners.portability.portable_runner:Job state changed to RUNNING
INFO:apache_beam.utils.subprocess_server:b'22/04/19 00:28:52 INFO org.apache.beam.runners.spark.translation.SparkContextFactory: Creating a brand new Spark Context.'
INFO:apache_beam.utils.subprocess_server:b'22/04/19 00:28:53 WARN org.apache.hadoop.util.NativeCodeLoader: Unable to load native-hadoop library for your platform... using builtin-java classes where applicable'
INFO:apache_beam.utils.subprocess_server:b'22/04/19 00:28:54 INFO org.apache.beam.runners.spark.aggregators.AggregatorsAccumulator: Instantiated aggregators accumulator:'
INFO:apache_beam.utils.subprocess_server:b'22/04/19 00:28:54 INFO org.apache.beam.runners.spark.metrics.MetricsAccumulator: Instantiated metrics accumulator: MetricQueryResults()'
INFO:apache_beam.utils.subprocess_server:b'22/04/19 00:28:54 WARN software.amazon.awssdk.regions.internal.util.EC2MetadataUtils: Unable to retrieve the requested metadata.'
INFO:apache_beam.utils.subprocess_server:b'22/04/19 00:28:54 INFO org.apache.beam.runners.spark.SparkPipelineRunner: Running job BeamApp-jenkins-0419002852-daeee1b2_dce8154c-1cab-4040-9bdd-0107c6e22cca on Spark master local[4]'
INFO:apache_beam.utils.subprocess_server:b'22/04/19 00:28:54 WARN software.amazon.awssdk.regions.internal.util.EC2MetadataUtils: Unable to retrieve the requested metadata.'
INFO:apache_beam.utils.subprocess_server:b'22/04/19 00:28:54 WARN software.amazon.awssdk.regions.internal.util.EC2MetadataUtils: Unable to retrieve the requested metadata.'
INFO:apache_beam.utils.subprocess_server:b'22/04/19 00:28:54 WARN software.amazon.awssdk.regions.internal.util.EC2MetadataUtils: Unable to retrieve the requested metadata.'
INFO:apache_beam.utils.subprocess_server:b'22/04/19 00:28:54 WARN software.amazon.awssdk.regions.internal.util.EC2MetadataUtils: Unable to retrieve the requested metadata.'
INFO:apache_beam.runners.worker.statecache:Creating state cache with size 0
INFO:apache_beam.runners.worker.sdk_worker:Creating insecure control channel for localhost:40817.
INFO:apache_beam.runners.worker.sdk_worker:Control channel established.
INFO:apache_beam.runners.worker.sdk_worker:Initializing SDKHarness with unbounded number of workers.
INFO:apache_beam.utils.subprocess_server:b'22/04/19 00:28:55 INFO org.apache.beam.runners.fnexecution.control.FnApiControlClientPoolService: Beam Fn Control client connected with id 1-1'
INFO:apache_beam.utils.subprocess_server:b'22/04/19 00:28:55 INFO org.apache.beam.runners.fnexecution.control.FnApiControlClientPoolService: getProcessBundleDescriptor request with id 1-2'
INFO:apache_beam.runners.worker.sdk_worker:Creating insecure state channel for localhost:38443.
INFO:apache_beam.runners.worker.sdk_worker:State channel established.
INFO:apache_beam.runners.worker.data_plane:Creating client data channel for localhost:34013
INFO:apache_beam.utils.subprocess_server:b'22/04/19 00:28:55 INFO org.apache.beam.runners.fnexecution.data.GrpcDataService: Beam Fn Data client connected.'
INFO:apache_beam.utils.subprocess_server:b'22/04/19 00:28:55 INFO org.apache.beam.runners.fnexecution.control.FnApiControlClientPoolService: getProcessBundleDescriptor request with id 1-3'
INFO:apache_beam.utils.subprocess_server:b'22/04/19 00:28:55 WARN software.amazon.awssdk.regions.internal.util.EC2MetadataUtils: Unable to retrieve the requested metadata.'
INFO:apache_beam.utils.subprocess_server:b'22/04/19 00:28:55 WARN software.amazon.awssdk.regions.internal.util.EC2MetadataUtils: Unable to retrieve the requested metadata.'
INFO:apache_beam.utils.subprocess_server:b'22/04/19 00:28:55 WARN software.amazon.awssdk.regions.internal.util.EC2MetadataUtils: Unable to retrieve the requested metadata.'
INFO:apache_beam.utils.subprocess_server:b'22/04/19 00:28:55 WARN software.amazon.awssdk.regions.internal.util.EC2MetadataUtils: Unable to retrieve the requested metadata.'
INFO:apache_beam.utils.subprocess_server:b'22/04/19 00:28:55 INFO org.apache.beam.runners.fnexecution.control.FnApiControlClientPoolService: getProcessBundleDescriptor request with id 1-4'
INFO:apache_beam.utils.subprocess_server:b'22/04/19 00:28:55 INFO org.apache.beam.runners.fnexecution.control.FnApiControlClientPoolService: getProcessBundleDescriptor request with id 1-5'
INFO:apache_beam.utils.subprocess_server:b'22/04/19 00:28:55 WARN software.amazon.awssdk.regions.internal.util.EC2MetadataUtils: Unable to retrieve the requested metadata.'
INFO:apache_beam.utils.subprocess_server:b'22/04/19 00:28:55 WARN software.amazon.awssdk.regions.internal.util.EC2MetadataUtils: Unable to retrieve the requested metadata.'
INFO:apache_beam.utils.subprocess_server:b'22/04/19 00:28:55 WARN software.amazon.awssdk.regions.internal.util.EC2MetadataUtils: Unable to retrieve the requested metadata.'
INFO:apache_beam.utils.subprocess_server:b'22/04/19 00:28:55 WARN software.amazon.awssdk.regions.internal.util.EC2MetadataUtils: Unable to retrieve the requested metadata.'
INFO:apache_beam.utils.subprocess_server:b'22/04/19 00:28:55 INFO org.apache.beam.runners.fnexecution.control.FnApiControlClientPoolService: getProcessBundleDescriptor request with id 1-9'
INFO:apache_beam.utils.subprocess_server:b'22/04/19 00:28:55 INFO org.apache.beam.runners.fnexecution.control.FnApiControlClientPoolService: getProcessBundleDescriptor request with id 1-8'
INFO:apache_beam.utils.subprocess_server:b'22/04/19 00:28:55 INFO org.apache.beam.runners.fnexecution.control.FnApiControlClientPoolService: getProcessBundleDescriptor request with id 1-6'
INFO:apache_beam.utils.subprocess_server:b'22/04/19 00:28:55 INFO org.apache.beam.runners.fnexecution.control.FnApiControlClientPoolService: getProcessBundleDescriptor request with id 1-7'
INFO:apache_beam.utils.subprocess_server:b'22/04/19 00:28:55 INFO org.apache.beam.runners.fnexecution.control.FnApiControlClientPoolService: getProcessBundleDescriptor request with id 1-10'
INFO:apache_beam.utils.subprocess_server:b'22/04/19 00:28:55 INFO org.apache.beam.runners.fnexecution.control.FnApiControlClientPoolService: getProcessBundleDescriptor request with id 1-11'
INFO:apache_beam.utils.subprocess_server:b'22/04/19 00:28:55 INFO org.apache.beam.runners.fnexecution.control.FnApiControlClientPoolService: getProcessBundleDescriptor request with id 1-12'
INFO:apache_beam.utils.subprocess_server:b'22/04/19 00:28:55 INFO org.apache.beam.runners.fnexecution.control.FnApiControlClientPoolService: getProcessBundleDescriptor request with id 1-13'
INFO:apache_beam.utils.subprocess_server:b'22/04/19 00:28:55 WARN software.amazon.awssdk.regions.internal.util.EC2MetadataUtils: Unable to retrieve the requested metadata.'
INFO:apache_beam.utils.subprocess_server:b'22/04/19 00:28:55 WARN software.amazon.awssdk.regions.internal.util.EC2MetadataUtils: Unable to retrieve the requested metadata.'
INFO:apache_beam.utils.subprocess_server:b'22/04/19 00:28:55 WARN software.amazon.awssdk.regions.internal.util.EC2MetadataUtils: Unable to retrieve the requested metadata.'
INFO:apache_beam.utils.subprocess_server:b'22/04/19 00:28:55 WARN software.amazon.awssdk.regions.internal.util.EC2MetadataUtils: Unable to retrieve the requested metadata.'
INFO:apache_beam.utils.subprocess_server:b'22/04/19 00:28:55 INFO org.apache.beam.runners.fnexecution.control.FnApiControlClientPoolService: getProcessBundleDescriptor request with id 1-14'
INFO:apache_beam.utils.subprocess_server:b'22/04/19 00:28:56 WARN software.amazon.awssdk.regions.internal.util.EC2MetadataUtils: Unable to retrieve the requested metadata.'
INFO:apache_beam.utils.subprocess_server:b'22/04/19 00:28:56 WARN software.amazon.awssdk.regions.internal.util.EC2MetadataUtils: Unable to retrieve the requested metadata.'
INFO:apache_beam.utils.subprocess_server:b'22/04/19 00:28:56 WARN software.amazon.awssdk.regions.internal.util.EC2MetadataUtils: Unable to retrieve the requested metadata.'
INFO:apache_beam.utils.subprocess_server:b'22/04/19 00:28:56 WARN software.amazon.awssdk.regions.internal.util.EC2MetadataUtils: Unable to retrieve the requested metadata.'
INFO:apache_beam.utils.subprocess_server:b'22/04/19 00:28:56 INFO org.apache.beam.runners.fnexecution.control.FnApiControlClientPoolService: getProcessBundleDescriptor request with id 1-15'
INFO:apache_beam.utils.subprocess_server:b'22/04/19 00:28:56 INFO org.apache.beam.runners.spark.SparkPipelineRunner: Job BeamApp-jenkins-0419002852-daeee1b2_dce8154c-1cab-4040-9bdd-0107c6e22cca: Pipeline translated successfully. Computing outputs'
INFO:apache_beam.utils.subprocess_server:b'22/04/19 00:28:56 WARN software.amazon.awssdk.regions.internal.util.EC2MetadataUtils: Unable to retrieve the requested metadata.'
INFO:apache_beam.utils.subprocess_server:b'22/04/19 00:28:56 WARN software.amazon.awssdk.regions.internal.util.EC2MetadataUtils: Unable to retrieve the requested metadata.'
INFO:apache_beam.utils.subprocess_server:b'22/04/19 00:28:56 WARN software.amazon.awssdk.regions.internal.util.EC2MetadataUtils: Unable to retrieve the requested metadata.'
INFO:apache_beam.utils.subprocess_server:b'22/04/19 00:28:56 WARN software.amazon.awssdk.regions.internal.util.EC2MetadataUtils: Unable to retrieve the requested metadata.'
INFO:apache_beam.utils.subprocess_server:b'22/04/19 00:28:56 INFO org.apache.beam.runners.fnexecution.control.FnApiControlClientPoolService: getProcessBundleDescriptor request with id 1-16'
INFO:apache_beam.io.filebasedsink:Starting finalize_write threads with num_shards: 4 (skipped: 0), batches: 4, num_threads: 4
INFO:apache_beam.io.filebasedsink:Renamed 4 shards in 0.01 seconds.
INFO:apache_beam.utils.subprocess_server:b'22/04/19 00:28:56 INFO org.apache.beam.runners.spark.SparkPipelineRunner: Job BeamApp-jenkins-0419002852-daeee1b2_dce8154c-1cab-4040-9bdd-0107c6e22cca finished.'
INFO:apache_beam.runners.portability.portable_runner:Job state changed to DONE
Exception in thread run_worker_1-1:
Traceback (most recent call last):
File "/usr/lib/python3.9/threading.py", line 973, in _bootstrap_inner
Exception in thread read_state:
Traceback (most recent call last):
File "/usr/lib/python3.9/threading.py", line 973, in _bootstrap_inner
self.run()
File "/usr/lib/python3.9/threading.py", line 910, in run
self.run()
File "/usr/lib/python3.9/threading.py", line 910, in run
self._target(*self._args, **self._kwargs)
File "<https://ci-beam.apache.org/job/beam_PostCommit_Python39/ws/src/sdks/python/apache_beam/runners/worker/sdk_worker.py",> line 990, in pull_responses
ERROR:apache_beam.runners.worker.data_plane:Failed to read inputs in the data plane.
Traceback (most recent call last):
File "<https://ci-beam.apache.org/job/beam_PostCommit_Python39/ws/src/sdks/python/apache_beam/runners/worker/data_plane.py",> line 634, in _read_inputs
for elements in elements_iterator:
File "<https://ci-beam.apache.org/job/beam_PostCommit_Python39/ws/src/build/gradleenv/2022703443/lib/python3.9/site-packages/grpc/_channel.py",> line 426, in __next__
return self._next()
File "<https://ci-beam.apache.org/job/beam_PostCommit_Python39/ws/src/build/gradleenv/2022703443/lib/python3.9/site-packages/grpc/_channel.py",> line 826, in _next
raise self
grpc._channel._MultiThreadedRendezvous: <_MultiThreadedRendezvous of RPC that terminated with:
status = StatusCode.UNAVAILABLE
details = "Socket closed"
debug_error_string = "{"created":"@1650328136.815944806","description":"Error received from peer ipv6:[::1]:34013","file":"src/core/lib/surface/call.cc","file_line":903,"grpc_message":"Socket closed","grpc_status":14}"
>
self._target(*self._args, **self._kwargs)
Exception in thread read_grpc_client_inputs:
for response in responses:
Traceback (most recent call last):
File "<https://ci-beam.apache.org/job/beam_PostCommit_Python39/ws/src/build/gradleenv/2022703443/lib/python3.9/site-packages/grpc/_channel.py",> line 426, in __next__
File "/usr/lib/python3.9/threading.py", line 973, in _bootstrap_inner
File "<https://ci-beam.apache.org/job/beam_PostCommit_Python39/ws/src/sdks/python/apache_beam/runners/worker/sdk_worker.py",> line 234, in run
self.run()
return self._next()
File "/usr/lib/python3.9/threading.py", line 910, in run
for work_request in self._control_stub.Control(get_responses()):
File "<https://ci-beam.apache.org/job/beam_PostCommit_Python39/ws/src/build/gradleenv/2022703443/lib/python3.9/site-packages/grpc/_channel.py",> line 426, in __next__
File "<https://ci-beam.apache.org/job/beam_PostCommit_Python39/ws/src/build/gradleenv/2022703443/lib/python3.9/site-packages/grpc/_channel.py",> line 826, in _next
self._target(*self._args, **self._kwargs)
File "<https://ci-beam.apache.org/job/beam_PostCommit_Python39/ws/src/sdks/python/apache_beam/runners/worker/data_plane.py",> line 651, in <lambda>
target=lambda: self._read_inputs(elements_iterator),
File "<https://ci-beam.apache.org/job/beam_PostCommit_Python39/ws/src/sdks/python/apache_beam/runners/worker/data_plane.py",> line 634, in _read_inputs
return self._next()
File "<https://ci-beam.apache.org/job/beam_PostCommit_Python39/ws/src/build/gradleenv/2022703443/lib/python3.9/site-packages/grpc/_channel.py",> line 826, in _next
for elements in elements_iterator:
File "<https://ci-beam.apache.org/job/beam_PostCommit_Python39/ws/src/build/gradleenv/2022703443/lib/python3.9/site-packages/grpc/_channel.py",> line 426, in __next__
raise self
raise self
grpc._channel._MultiThreadedRendezvous: <_MultiThreadedRendezvous of RPC that terminated with:
status = StatusCode.UNAVAILABLE
details = "Socket closed"
debug_error_string = "{"created":"@1650328136.815966387","description":"Error received from peer ipv6:[::1]:38443","file":"src/core/lib/surface/call.cc","file_line":903,"grpc_message":"Socket closed","grpc_status":14}"
>
grpc._channel._MultiThreadedRendezvous: <_MultiThreadedRendezvous of RPC that terminated with:
status = StatusCode.UNAVAILABLE
details = "Socket closed"
debug_error_string = "{"created":"@1650328136.815973935","description":"Error received from peer ipv6:[::1]:40817","file":"src/core/lib/surface/call.cc","file_line":903,"grpc_message":"Socket closed","grpc_status":14}"
>
return self._next()
File "<https://ci-beam.apache.org/job/beam_PostCommit_Python39/ws/src/build/gradleenv/2022703443/lib/python3.9/site-packages/grpc/_channel.py",> line 826, in _next
raise self
grpc._channel._MultiThreadedRendezvous: <_MultiThreadedRendezvous of RPC that terminated with:
status = StatusCode.UNAVAILABLE
details = "Socket closed"
debug_error_string = "{"created":"@1650328136.815944806","description":"Error received from peer ipv6:[::1]:34013","file":"src/core/lib/surface/call.cc","file_line":903,"grpc_message":"Socket closed","grpc_status":14}"
>
> Task :sdks:python:test-suites:dataflow:py39:postCommitIT
warning: sdist: standard file not found: should have one of README, README.rst, README.txt, README.md
warning: check: missing required meta-data: url
warning: check: missing meta-data: either (author and author_email) or (maintainer and maintainer_email) should be supplied
> Task :sdks:python:test-suites:portable:py39:postCommitPy39IT
> Task :sdks:python:test-suites:portable:py39:postCommitPy39
> Task :sdks:python:test-suites:dataflow:py39:postCommitIT
E0419 00:39:12.511423216 2944307 fork_posix.cc:70] Fork support is only compatible with the epoll1 and poll polling strategies
E0419 00:39:38.215386782 2944367 fork_posix.cc:70] Fork support is only compatible with the epoll1 and poll polling strategies
E0419 00:42:10.397723991 2944335 fork_posix.cc:70] Fork support is only compatible with the epoll1 and poll polling strategies
E0419 00:46:04.648908180 2944313 fork_posix.cc:70] Fork support is only compatible with the epoll1 and poll polling strategies
E0419 00:46:43.087577313 2944367 fork_posix.cc:70] Fork support is only compatible with the epoll1 and poll polling strategies
E0419 00:49:17.302260073 2944335 fork_posix.cc:70] Fork support is only compatible with the epoll1 and poll polling strategies
E0419 00:52:35.529733958 2944313 fork_posix.cc:70] Fork support is only compatible with the epoll1 and poll polling strategies
E0419 00:54:25.819947204 2944367 fork_posix.cc:70] Fork support is only compatible with the epoll1 and poll polling strategies
E0419 00:57:25.543124992 2944335 fork_posix.cc:70] Fork support is only compatible with the epoll1 and poll polling strategies
E0419 01:01:43.110400944 2944313 fork_posix.cc:70] Fork support is only compatible with the epoll1 and poll polling strategies
E0419 01:03:18.950856864 2944367 fork_posix.cc:70] Fork support is only compatible with the epoll1 and poll polling strategies
E0419 01:09:15.839209550 2944313 fork_posix.cc:70] Fork support is only compatible with the epoll1 and poll polling strategies
E0419 01:15:51.577953960 2944313 fork_posix.cc:70] Fork support is only compatible with the epoll1 and poll polling strategies
E0419 01:20:22.064736238 2944367 fork_posix.cc:70] Fork support is only compatible with the epoll1 and poll polling strategies
E0419 01:22:14.698058623 2944313 fork_posix.cc:70] Fork support is only compatible with the epoll1 and poll polling strategies
E0419 01:30:04.427768848 2944313 fork_posix.cc:70] Fork support is only compatible with the epoll1 and poll polling strategies
E0419 01:34:37.208742579 2944316 fork_posix.cc:70] Fork support is only compatible with the epoll1 and poll polling strategies
E0419 01:36:55.667477937 2944367 fork_posix.cc:70] Fork support is only compatible with the epoll1 and poll polling strategies
E0419 01:37:44.528318671 2944313 fork_posix.cc:70] Fork support is only compatible with the epoll1 and poll polling strategies
E0419 01:45:04.215396130 2944313 fork_posix.cc:70] Fork support is only compatible with the epoll1 and poll polling strategies
E0419 01:45:05.162298416 2944316 fork_posix.cc:70] Fork support is only compatible with the epoll1 and poll polling strategies
E0419 01:52:43.675753894 2944313 fork_posix.cc:70] Fork support is only compatible with the epoll1 and poll polling strategies
> Task :sdks:python:test-suites:dataflow:py39:postCommitIT FAILED
FAILURE: Build failed with an exception.
* Where:
Script '<https://ci-beam.apache.org/job/beam_PostCommit_Python39/ws/src/sdks/python/test-suites/dataflow/common.gradle'> line: 121
* What went wrong:
Execution failed for task ':sdks:python:test-suites:dataflow:py39:postCommitIT'.
> Process 'command 'sh'' finished with non-zero exit value 1
* Try:
> Run with --stacktrace option to get the stack trace.
> Run with --info or --debug option to get more log output.
> Run with --scan to get full insights.
* Get more help at https://help.gradle.org
Deprecated Gradle features were used in this build, making it incompatible with Gradle 8.0.
You can use '--warning-mode all' to show the individual deprecation warnings and determine if they come from your own scripts or plugins.
See https://docs.gradle.org/7.4/userguide/command_line_interface.html#sec:command_line_warnings
Execution optimizations have been disabled for 1 invalid unit(s) of work during this build to ensure correctness.
Please consult deprecation warnings for more details.
BUILD FAILED in 1h 48m 3s
219 actionable tasks: 195 executed, 18 from cache, 6 up-to-date
Publishing build scan...
https://gradle.com/s/7wcukfotlj6bg
Build step 'Invoke Gradle script' changed build result to FAILURE
Build step 'Invoke Gradle script' marked build as failure
---------------------------------------------------------------------
To unsubscribe, e-mail: builds-unsubscribe@beam.apache.org
For additional commands, e-mail: builds-help@beam.apache.org
Build failed in Jenkins: beam_PostCommit_Python39 #262
Posted by Apache Jenkins Server <je...@builds.apache.org>.
See <https://ci-beam.apache.org/job/beam_PostCommit_Python39/262/display/redirect?page=changes>
Changes:
[rarokni] [BEAM-14307] Fix Slow Side input pattern bug in sample
------------------------------------------
[...truncated 23.64 MB...]
message: "Closing all cached grpc data channels."
log_location: "/usr/local/lib/python3.9/site-packages/apache_beam/runners/worker/data_plane.py:782"
thread: "MainThread"
INFO:root:severity: INFO
timestamp {
seconds: 1650306146
nanos: 713198661
}
message: "Closing all cached gRPC state handlers."
log_location: "/usr/local/lib/python3.9/site-packages/apache_beam/runners/worker/sdk_worker.py:859"
thread: "MainThread"
INFO:root:severity: INFO
timestamp {
seconds: 1650306146
nanos: 713800907
}
message: "Done consuming work."
log_location: "/usr/local/lib/python3.9/site-packages/apache_beam/runners/worker/sdk_worker.py:257"
thread: "MainThread"
INFO:root:severity: INFO
timestamp {
seconds: 1650306146
nanos: 713876724
}
message: "Python sdk harness exiting."
log_location: "/usr/local/lib/python3.9/site-packages/apache_beam/runners/worker/sdk_worker_main.py:181"
thread: "MainThread"
INFO:apache_beam.runners.portability.local_job_service:Completed job in 9.779328107833862 seconds with state DONE.
INFO:root:Completed job in 9.779328107833862 seconds with state DONE.
INFO:apache_beam.runners.portability.portable_runner:Job state changed to DONE
> Task :sdks:python:test-suites:portable:py39:portableWordCountSparkRunnerBatch
INFO:apache_beam.runners.worker.worker_pool_main:Listening for workers at localhost:43985
WARNING:root:Make sure that locally built Python SDK docker image has Python 3.9 interpreter.
INFO:root:Default Python SDK image for environment is apache/beam_python3.9_sdk:2.39.0.dev
INFO:apache_beam.runners.portability.fn_api_runner.translations:==================== <function pack_combiners at 0x7f4b552f5b80> ====================
INFO:apache_beam.runners.portability.fn_api_runner.translations:==================== <function lift_combiners at 0x7f4b552f5c10> ====================
INFO:apache_beam.runners.portability.fn_api_runner.translations:==================== <function sort_stages at 0x7f4b552f63a0> ====================
INFO:apache_beam.utils.subprocess_server:Starting service with ['java' '-jar' '<https://ci-beam.apache.org/job/beam_PostCommit_Python39/ws/src/runners/spark/2/job-server/build/libs/beam-runners-spark-job-server-2.39.0-SNAPSHOT.jar'> '--spark-master-url' 'local[4]' '--artifacts-dir' '/tmp/beam-temprt5ojcuv/artifactsedys97ag' '--job-port' '49019' '--artifact-port' '0' '--expansion-port' '0']
E0418 18:22:29.816911178 2581598 fork_posix.cc:70] Fork support is only compatible with the epoll1 and poll polling strategies
INFO:apache_beam.utils.subprocess_server:b'22/04/18 18:22:31 WARN software.amazon.awssdk.regions.internal.util.EC2MetadataUtils: Unable to retrieve the requested metadata.'
INFO:apache_beam.utils.subprocess_server:b'22/04/18 18:22:31 INFO org.apache.beam.runners.jobsubmission.JobServerDriver: ArtifactStagingService started on localhost:39829'
INFO:apache_beam.utils.subprocess_server:b'22/04/18 18:22:31 INFO org.apache.beam.runners.jobsubmission.JobServerDriver: Java ExpansionService started on localhost:34075'
INFO:apache_beam.utils.subprocess_server:b'22/04/18 18:22:31 INFO org.apache.beam.runners.jobsubmission.JobServerDriver: JobService started on localhost:49019'
INFO:apache_beam.utils.subprocess_server:b'22/04/18 18:22:31 INFO org.apache.beam.runners.jobsubmission.JobServerDriver: Job server now running, terminate with Ctrl+C'
WARNING:apache_beam.options.pipeline_options:Discarding unparseable args: ['--parallelism=2']
INFO:apache_beam.utils.subprocess_server:b'22/04/18 18:22:32 INFO org.apache.beam.runners.fnexecution.artifact.ArtifactStagingService: Staging artifacts for job_914844a5-f4a7-4dbb-b554-54a91baea5cb.'
INFO:apache_beam.utils.subprocess_server:b'22/04/18 18:22:32 INFO org.apache.beam.runners.fnexecution.artifact.ArtifactStagingService: Resolving artifacts for job_914844a5-f4a7-4dbb-b554-54a91baea5cb.ref_Environment_default_environment_1.'
INFO:apache_beam.utils.subprocess_server:b'22/04/18 18:22:32 INFO org.apache.beam.runners.fnexecution.artifact.ArtifactStagingService: Getting 1 artifacts for job_914844a5-f4a7-4dbb-b554-54a91baea5cb.null.'
INFO:apache_beam.utils.subprocess_server:b'22/04/18 18:22:32 INFO org.apache.beam.runners.fnexecution.artifact.ArtifactStagingService: Artifacts fully staged for job_914844a5-f4a7-4dbb-b554-54a91baea5cb.'
INFO:apache_beam.utils.subprocess_server:b'22/04/18 18:22:32 INFO org.apache.beam.runners.spark.SparkJobInvoker: Invoking job BeamApp-jenkins-0418182232-d18d79ba_548c9f55-bd1d-4561-a3b5-ccda87bb772c'
INFO:apache_beam.utils.subprocess_server:b'22/04/18 18:22:32 INFO org.apache.beam.runners.jobsubmission.JobInvocation: Starting job invocation BeamApp-jenkins-0418182232-d18d79ba_548c9f55-bd1d-4561-a3b5-ccda87bb772c'
INFO:apache_beam.runners.portability.portable_runner:Environment "LOOPBACK" has started a component necessary for the execution. Be sure to run the pipeline using
with Pipeline() as p:
p.apply(..)
This ensures that the pipeline finishes before this program exits.
INFO:apache_beam.runners.portability.portable_runner:Job state changed to STOPPED
INFO:apache_beam.runners.portability.portable_runner:Job state changed to STARTING
INFO:apache_beam.runners.portability.portable_runner:Job state changed to RUNNING
INFO:apache_beam.utils.subprocess_server:b'22/04/18 18:22:33 INFO org.apache.beam.runners.spark.translation.SparkContextFactory: Creating a brand new Spark Context.'
INFO:apache_beam.utils.subprocess_server:b'22/04/18 18:22:33 WARN org.apache.hadoop.util.NativeCodeLoader: Unable to load native-hadoop library for your platform... using builtin-java classes where applicable'
INFO:apache_beam.utils.subprocess_server:b'22/04/18 18:22:34 INFO org.apache.beam.runners.spark.aggregators.AggregatorsAccumulator: Instantiated aggregators accumulator:'
INFO:apache_beam.utils.subprocess_server:b'22/04/18 18:22:34 INFO org.apache.beam.runners.spark.metrics.MetricsAccumulator: Instantiated metrics accumulator: MetricQueryResults()'
INFO:apache_beam.utils.subprocess_server:b'22/04/18 18:22:34 WARN software.amazon.awssdk.regions.internal.util.EC2MetadataUtils: Unable to retrieve the requested metadata.'
INFO:apache_beam.utils.subprocess_server:b'22/04/18 18:22:34 INFO org.apache.beam.runners.spark.SparkPipelineRunner: Running job BeamApp-jenkins-0418182232-d18d79ba_548c9f55-bd1d-4561-a3b5-ccda87bb772c on Spark master local[4]'
INFO:apache_beam.utils.subprocess_server:b'22/04/18 18:22:34 WARN software.amazon.awssdk.regions.internal.util.EC2MetadataUtils: Unable to retrieve the requested metadata.'
INFO:apache_beam.utils.subprocess_server:b'22/04/18 18:22:34 WARN software.amazon.awssdk.regions.internal.util.EC2MetadataUtils: Unable to retrieve the requested metadata.'
INFO:apache_beam.utils.subprocess_server:b'22/04/18 18:22:34 WARN software.amazon.awssdk.regions.internal.util.EC2MetadataUtils: Unable to retrieve the requested metadata.'
INFO:apache_beam.utils.subprocess_server:b'22/04/18 18:22:34 WARN software.amazon.awssdk.regions.internal.util.EC2MetadataUtils: Unable to retrieve the requested metadata.'
INFO:apache_beam.runners.worker.statecache:Creating state cache with size 0
INFO:apache_beam.runners.worker.sdk_worker:Creating insecure control channel for localhost:42965.
INFO:apache_beam.runners.worker.sdk_worker:Control channel established.
INFO:apache_beam.runners.worker.sdk_worker:Initializing SDKHarness with unbounded number of workers.
INFO:apache_beam.utils.subprocess_server:b'22/04/18 18:22:35 INFO org.apache.beam.runners.fnexecution.control.FnApiControlClientPoolService: Beam Fn Control client connected with id 1-1'
INFO:apache_beam.utils.subprocess_server:b'22/04/18 18:22:35 INFO org.apache.beam.runners.fnexecution.control.FnApiControlClientPoolService: getProcessBundleDescriptor request with id 1-2'
INFO:apache_beam.runners.worker.sdk_worker:Creating insecure state channel for localhost:34391.
INFO:apache_beam.runners.worker.sdk_worker:State channel established.
INFO:apache_beam.runners.worker.data_plane:Creating client data channel for localhost:39377
INFO:apache_beam.utils.subprocess_server:b'22/04/18 18:22:35 INFO org.apache.beam.runners.fnexecution.data.GrpcDataService: Beam Fn Data client connected.'
INFO:apache_beam.utils.subprocess_server:b'22/04/18 18:22:35 INFO org.apache.beam.runners.fnexecution.control.FnApiControlClientPoolService: getProcessBundleDescriptor request with id 1-3'
INFO:apache_beam.utils.subprocess_server:b'22/04/18 18:22:35 WARN software.amazon.awssdk.regions.internal.util.EC2MetadataUtils: Unable to retrieve the requested metadata.'
INFO:apache_beam.utils.subprocess_server:b'22/04/18 18:22:35 WARN software.amazon.awssdk.regions.internal.util.EC2MetadataUtils: Unable to retrieve the requested metadata.'
INFO:apache_beam.utils.subprocess_server:b'22/04/18 18:22:35 WARN software.amazon.awssdk.regions.internal.util.EC2MetadataUtils: Unable to retrieve the requested metadata.'
INFO:apache_beam.utils.subprocess_server:b'22/04/18 18:22:35 WARN software.amazon.awssdk.regions.internal.util.EC2MetadataUtils: Unable to retrieve the requested metadata.'
INFO:apache_beam.utils.subprocess_server:b'22/04/18 18:22:35 INFO org.apache.beam.runners.fnexecution.control.FnApiControlClientPoolService: getProcessBundleDescriptor request with id 1-4'
INFO:apache_beam.utils.subprocess_server:b'22/04/18 18:22:35 INFO org.apache.beam.runners.fnexecution.control.FnApiControlClientPoolService: getProcessBundleDescriptor request with id 1-5'
INFO:apache_beam.utils.subprocess_server:b'22/04/18 18:22:35 WARN software.amazon.awssdk.regions.internal.util.EC2MetadataUtils: Unable to retrieve the requested metadata.'
INFO:apache_beam.utils.subprocess_server:b'22/04/18 18:22:35 WARN software.amazon.awssdk.regions.internal.util.EC2MetadataUtils: Unable to retrieve the requested metadata.'
INFO:apache_beam.utils.subprocess_server:b'22/04/18 18:22:35 WARN software.amazon.awssdk.regions.internal.util.EC2MetadataUtils: Unable to retrieve the requested metadata.'
INFO:apache_beam.utils.subprocess_server:b'22/04/18 18:22:35 WARN software.amazon.awssdk.regions.internal.util.EC2MetadataUtils: Unable to retrieve the requested metadata.'
INFO:apache_beam.utils.subprocess_server:b'22/04/18 18:22:35 INFO org.apache.beam.runners.fnexecution.control.FnApiControlClientPoolService: getProcessBundleDescriptor request with id 1-7'
INFO:apache_beam.utils.subprocess_server:b'22/04/18 18:22:35 INFO org.apache.beam.runners.fnexecution.control.FnApiControlClientPoolService: getProcessBundleDescriptor request with id 1-8'
INFO:apache_beam.utils.subprocess_server:b'22/04/18 18:22:35 INFO org.apache.beam.runners.fnexecution.control.FnApiControlClientPoolService: getProcessBundleDescriptor request with id 1-6'
INFO:apache_beam.utils.subprocess_server:b'22/04/18 18:22:35 INFO org.apache.beam.runners.fnexecution.control.FnApiControlClientPoolService: getProcessBundleDescriptor request with id 1-9'
INFO:apache_beam.utils.subprocess_server:b'22/04/18 18:22:35 INFO org.apache.beam.runners.fnexecution.control.FnApiControlClientPoolService: getProcessBundleDescriptor request with id 1-10'
INFO:apache_beam.utils.subprocess_server:b'22/04/18 18:22:35 INFO org.apache.beam.runners.fnexecution.control.FnApiControlClientPoolService: getProcessBundleDescriptor request with id 1-11'
INFO:apache_beam.utils.subprocess_server:b'22/04/18 18:22:35 INFO org.apache.beam.runners.fnexecution.control.FnApiControlClientPoolService: getProcessBundleDescriptor request with id 1-12'
INFO:apache_beam.utils.subprocess_server:b'22/04/18 18:22:35 INFO org.apache.beam.runners.fnexecution.control.FnApiControlClientPoolService: getProcessBundleDescriptor request with id 1-13'
INFO:apache_beam.utils.subprocess_server:b'22/04/18 18:22:35 WARN software.amazon.awssdk.regions.internal.util.EC2MetadataUtils: Unable to retrieve the requested metadata.'
INFO:apache_beam.utils.subprocess_server:b'22/04/18 18:22:35 WARN software.amazon.awssdk.regions.internal.util.EC2MetadataUtils: Unable to retrieve the requested metadata.'
INFO:apache_beam.utils.subprocess_server:b'22/04/18 18:22:35 WARN software.amazon.awssdk.regions.internal.util.EC2MetadataUtils: Unable to retrieve the requested metadata.'
INFO:apache_beam.utils.subprocess_server:b'22/04/18 18:22:35 WARN software.amazon.awssdk.regions.internal.util.EC2MetadataUtils: Unable to retrieve the requested metadata.'
INFO:apache_beam.utils.subprocess_server:b'22/04/18 18:22:35 INFO org.apache.beam.runners.fnexecution.control.FnApiControlClientPoolService: getProcessBundleDescriptor request with id 1-14'
INFO:apache_beam.utils.subprocess_server:b'22/04/18 18:22:35 WARN software.amazon.awssdk.regions.internal.util.EC2MetadataUtils: Unable to retrieve the requested metadata.'
INFO:apache_beam.utils.subprocess_server:b'22/04/18 18:22:35 WARN software.amazon.awssdk.regions.internal.util.EC2MetadataUtils: Unable to retrieve the requested metadata.'
INFO:apache_beam.utils.subprocess_server:b'22/04/18 18:22:35 WARN software.amazon.awssdk.regions.internal.util.EC2MetadataUtils: Unable to retrieve the requested metadata.'
INFO:apache_beam.utils.subprocess_server:b'22/04/18 18:22:35 WARN software.amazon.awssdk.regions.internal.util.EC2MetadataUtils: Unable to retrieve the requested metadata.'
INFO:apache_beam.utils.subprocess_server:b'22/04/18 18:22:35 INFO org.apache.beam.runners.fnexecution.control.FnApiControlClientPoolService: getProcessBundleDescriptor request with id 1-15'
INFO:apache_beam.utils.subprocess_server:b'22/04/18 18:22:35 INFO org.apache.beam.runners.spark.SparkPipelineRunner: Job BeamApp-jenkins-0418182232-d18d79ba_548c9f55-bd1d-4561-a3b5-ccda87bb772c: Pipeline translated successfully. Computing outputs'
INFO:apache_beam.utils.subprocess_server:b'22/04/18 18:22:35 WARN software.amazon.awssdk.regions.internal.util.EC2MetadataUtils: Unable to retrieve the requested metadata.'
INFO:apache_beam.utils.subprocess_server:b'22/04/18 18:22:35 WARN software.amazon.awssdk.regions.internal.util.EC2MetadataUtils: Unable to retrieve the requested metadata.'
INFO:apache_beam.utils.subprocess_server:b'22/04/18 18:22:35 WARN software.amazon.awssdk.regions.internal.util.EC2MetadataUtils: Unable to retrieve the requested metadata.'
INFO:apache_beam.utils.subprocess_server:b'22/04/18 18:22:35 WARN software.amazon.awssdk.regions.internal.util.EC2MetadataUtils: Unable to retrieve the requested metadata.'
INFO:apache_beam.utils.subprocess_server:b'22/04/18 18:22:35 INFO org.apache.beam.runners.fnexecution.control.FnApiControlClientPoolService: getProcessBundleDescriptor request with id 1-16'
INFO:apache_beam.io.filebasedsink:Starting finalize_write threads with num_shards: 4 (skipped: 0), batches: 4, num_threads: 4
INFO:apache_beam.io.filebasedsink:Renamed 4 shards in 0.01 seconds.
INFO:apache_beam.utils.subprocess_server:b'22/04/18 18:22:36 INFO org.apache.beam.runners.spark.SparkPipelineRunner: Job BeamApp-jenkins-0418182232-d18d79ba_548c9f55-bd1d-4561-a3b5-ccda87bb772c finished.'
INFO:apache_beam.runners.portability.portable_runner:Job state changed to DONE
Exception in thread run_worker_1-1:
Traceback (most recent call last):
File "/usr/lib/python3.9/threading.py", line 973, in _bootstrap_inner
Exception in thread read_state:
Traceback (most recent call last):
File "/usr/lib/python3.9/threading.py", line 973, in _bootstrap_inner
self.run()
File "/usr/lib/python3.9/threading.py", line 910, in run
self.run()
File "/usr/lib/python3.9/threading.py", line 910, in run
self._target(*self._args, **self._kwargs)
File "<https://ci-beam.apache.org/job/beam_PostCommit_Python39/ws/src/sdks/python/apache_beam/runners/worker/sdk_worker.py",> line 234, in run
self._target(*self._args, **self._kwargs)
File "<https://ci-beam.apache.org/job/beam_PostCommit_Python39/ws/src/sdks/python/apache_beam/runners/worker/sdk_worker.py",> line 990, in pull_responses
for work_request in self._control_stub.Control(get_responses()):
File "<https://ci-beam.apache.org/job/beam_PostCommit_Python39/ws/src/build/gradleenv/2022703443/lib/python3.9/site-packages/grpc/_channel.py",> line 426, in __next__
ERROR:apache_beam.runners.worker.data_plane:Failed to read inputs in the data plane.
Traceback (most recent call last):
File "<https://ci-beam.apache.org/job/beam_PostCommit_Python39/ws/src/sdks/python/apache_beam/runners/worker/data_plane.py",> line 634, in _read_inputs
for elements in elements_iterator:
File "<https://ci-beam.apache.org/job/beam_PostCommit_Python39/ws/src/build/gradleenv/2022703443/lib/python3.9/site-packages/grpc/_channel.py",> line 426, in __next__
return self._next()
File "<https://ci-beam.apache.org/job/beam_PostCommit_Python39/ws/src/build/gradleenv/2022703443/lib/python3.9/site-packages/grpc/_channel.py",> line 826, in _next
raise self
grpc._channel._MultiThreadedRendezvous: <_MultiThreadedRendezvous of RPC that terminated with:
status = StatusCode.UNAVAILABLE
details = "Connection reset by peer"
debug_error_string = "{"created":"@1650306156.509490669","description":"Error received from peer ipv6:[::1]:39377","file":"src/core/lib/surface/call.cc","file_line":903,"grpc_message":"Connection reset by peer","grpc_status":14}"
>
Exception in thread read_grpc_client_inputs:
Traceback (most recent call last):
File "/usr/lib/python3.9/threading.py", line 973, in _bootstrap_inner
for response in responses:
return self._next()
self.run()
File "/usr/lib/python3.9/threading.py", line 910, in run
File "<https://ci-beam.apache.org/job/beam_PostCommit_Python39/ws/src/build/gradleenv/2022703443/lib/python3.9/site-packages/grpc/_channel.py",> line 826, in _next
File "<https://ci-beam.apache.org/job/beam_PostCommit_Python39/ws/src/build/gradleenv/2022703443/lib/python3.9/site-packages/grpc/_channel.py",> line 426, in __next__
self._target(*self._args, **self._kwargs)
return self._next()
raise self
File "<https://ci-beam.apache.org/job/beam_PostCommit_Python39/ws/src/sdks/python/apache_beam/runners/worker/data_plane.py",> line 651, in <lambda>
grpc._channel._MultiThreadedRendezvous: <_MultiThreadedRendezvous of RPC that terminated with:
status = StatusCode.UNAVAILABLE
details = "Socket closed"
debug_error_string = "{"created":"@1650306156.509522652","description":"Error received from peer ipv6:[::1]:42965","file":"src/core/lib/surface/call.cc","file_line":903,"grpc_message":"Socket closed","grpc_status":14}"
>
File "<https://ci-beam.apache.org/job/beam_PostCommit_Python39/ws/src/build/gradleenv/2022703443/lib/python3.9/site-packages/grpc/_channel.py",> line 826, in _next
target=lambda: self._read_inputs(elements_iterator),
File "<https://ci-beam.apache.org/job/beam_PostCommit_Python39/ws/src/sdks/python/apache_beam/runners/worker/data_plane.py",> line 634, in _read_inputs
raise self
grpc._channel._MultiThreadedRendezvous: <_MultiThreadedRendezvous of RPC that terminated with:
status = StatusCode.UNAVAILABLE
details = "Connection reset by peer"
debug_error_string = "{"created":"@1650306156.509546412","description":"Error received from peer ipv6:[::1]:34391","file":"src/core/lib/surface/call.cc","file_line":903,"grpc_message":"Connection reset by peer","grpc_status":14}"
>
for elements in elements_iterator:
File "<https://ci-beam.apache.org/job/beam_PostCommit_Python39/ws/src/build/gradleenv/2022703443/lib/python3.9/site-packages/grpc/_channel.py",> line 426, in __next__
return self._next()
File "<https://ci-beam.apache.org/job/beam_PostCommit_Python39/ws/src/build/gradleenv/2022703443/lib/python3.9/site-packages/grpc/_channel.py",> line 826, in _next
raise self
grpc._channel._MultiThreadedRendezvous: <_MultiThreadedRendezvous of RPC that terminated with:
status = StatusCode.UNAVAILABLE
details = "Connection reset by peer"
debug_error_string = "{"created":"@1650306156.509490669","description":"Error received from peer ipv6:[::1]:39377","file":"src/core/lib/surface/call.cc","file_line":903,"grpc_message":"Connection reset by peer","grpc_status":14}"
>
> Task :sdks:python:test-suites:portable:py39:postCommitPy39
> Task :sdks:python:test-suites:dataflow:py39:postCommitIT
E0418 18:23:28.964761375 2559310 fork_posix.cc:70] Fork support is only compatible with the epoll1 and poll polling strategies
E0418 18:25:37.836446836 2559366 fork_posix.cc:70] Fork support is only compatible with the epoll1 and poll polling strategies
E0418 18:27:47.349645070 2559329 fork_posix.cc:70] Fork support is only compatible with the epoll1 and poll polling strategies
E0418 18:29:55.961311429 2559255 fork_posix.cc:70] Fork support is only compatible with the epoll1 and poll polling strategies
E0418 18:32:28.536994407 2559366 fork_posix.cc:70] Fork support is only compatible with the epoll1 and poll polling strategies
E0418 18:35:18.537444611 2559329 fork_posix.cc:70] Fork support is only compatible with the epoll1 and poll polling strategies
E0418 18:36:30.790213424 2559255 fork_posix.cc:70] Fork support is only compatible with the epoll1 and poll polling strategies
E0418 18:39:02.052745705 2559366 fork_posix.cc:70] Fork support is only compatible with the epoll1 and poll polling strategies
E0418 18:44:21.221897410 2559255 fork_posix.cc:70] Fork support is only compatible with the epoll1 and poll polling strategies
E0418 18:46:23.046171294 2559366 fork_posix.cc:70] Fork support is only compatible with the epoll1 and poll polling strategies
E0418 18:52:28.441689422 2559255 fork_posix.cc:70] Fork support is only compatible with the epoll1 and poll polling strategies
E0418 19:00:13.382415660 2559255 fork_posix.cc:70] Fork support is only compatible with the epoll1 and poll polling strategies
E0418 19:03:34.519599194 2559366 fork_posix.cc:70] Fork support is only compatible with the epoll1 and poll polling strategies
E0418 19:07:14.089398983 2559255 fork_posix.cc:70] Fork support is only compatible with the epoll1 and poll polling strategies
E0418 19:14:29.340467869 2559255 fork_posix.cc:70] Fork support is only compatible with the epoll1 and poll polling strategies
E0418 19:16:56.656751435 2559348 fork_posix.cc:70] Fork support is only compatible with the epoll1 and poll polling strategies
E0418 19:20:28.983805255 2559366 fork_posix.cc:70] Fork support is only compatible with the epoll1 and poll polling strategies
E0418 19:21:54.272582139 2559255 fork_posix.cc:70] Fork support is only compatible with the epoll1 and poll polling strategies
E0418 19:27:24.091416052 2559348 fork_posix.cc:70] Fork support is only compatible with the epoll1 and poll polling strategies
E0418 19:28:29.255296851 2559255 fork_posix.cc:70] Fork support is only compatible with the epoll1 and poll polling strategies
E0418 19:34:48.264701230 2559255 fork_posix.cc:70] Fork support is only compatible with the epoll1 and poll polling strategies
> Task :sdks:python:test-suites:dataflow:py39:postCommitIT FAILED
FAILURE: Build failed with an exception.
* Where:
Script '<https://ci-beam.apache.org/job/beam_PostCommit_Python39/ws/src/sdks/python/test-suites/dataflow/common.gradle'> line: 121
* What went wrong:
Execution failed for task ':sdks:python:test-suites:dataflow:py39:postCommitIT'.
> Process 'command 'sh'' finished with non-zero exit value 1
* Try:
> Run with --stacktrace option to get the stack trace.
> Run with --info or --debug option to get more log output.
> Run with --scan to get full insights.
* Get more help at https://help.gradle.org
Deprecated Gradle features were used in this build, making it incompatible with Gradle 8.0.
You can use '--warning-mode all' to show the individual deprecation warnings and determine if they come from your own scripts or plugins.
See https://docs.gradle.org/7.4/userguide/command_line_interface.html#sec:command_line_warnings
Execution optimizations have been disabled for 1 invalid unit(s) of work during this build to ensure correctness.
Please consult deprecation warnings for more details.
BUILD FAILED in 1h 31m 4s
219 actionable tasks: 149 executed, 64 from cache, 6 up-to-date
Publishing build scan...
https://gradle.com/s/5hidc5g6qt5wq
Build step 'Invoke Gradle script' changed build result to FAILURE
Build step 'Invoke Gradle script' marked build as failure
---------------------------------------------------------------------
To unsubscribe, e-mail: builds-unsubscribe@beam.apache.org
For additional commands, e-mail: builds-help@beam.apache.org