You are viewing a plain text version of this content. The canonical link for it is here.
Posted to builds@beam.apache.org by Apache Jenkins Server <je...@builds.apache.org> on 2018/12/10 06:43:49 UTC

Build failed in Jenkins: beam_PerformanceTests_ParquetIOIT #829

See <https://builds.apache.org/job/beam_PerformanceTests_ParquetIOIT/829/display/redirect>

------------------------------------------
[...truncated 98.85 KB...]
:buildSrc:processTestResources (Thread[Task worker for ':buildSrc',5,main]) completed. Took 0.001 secs.
:buildSrc:testClasses (Thread[Task worker for ':buildSrc',5,main]) started.

> Task :buildSrc:testClasses UP-TO-DATE
Skipping task ':buildSrc:testClasses' as it has no actions.
:buildSrc:testClasses (Thread[Task worker for ':buildSrc',5,main]) completed. Took 0.0 secs.
:buildSrc:test (Thread[Task worker for ':buildSrc',5,main]) started.

> Task :buildSrc:test NO-SOURCE
Skipping task ':buildSrc:test' as it has no source files and no previous output files.
:buildSrc:test (Thread[Task worker for ':buildSrc',5,main]) completed. Took 0.003 secs.
:buildSrc:check (Thread[Task worker for ':buildSrc',5,main]) started.

> Task :buildSrc:check UP-TO-DATE
Skipping task ':buildSrc:check' as it has no actions.
:buildSrc:check (Thread[Task worker for ':buildSrc',5,main]) completed. Took 0.0 secs.
:buildSrc:build (Thread[Task worker for ':buildSrc',5,main]) started.

> Task :buildSrc:build UP-TO-DATE
Skipping task ':buildSrc:build' as it has no actions.
:buildSrc:build (Thread[Task worker for ':buildSrc',5,main]) completed. Took 0.0 secs.
Settings evaluated using settings file '<https://builds.apache.org/job/beam_PerformanceTests_ParquetIOIT/ws/src/settings.gradle'.>
Using local directory build cache for the root build (location = /home/jenkins/.gradle/caches/build-cache-1, removeUnusedEntriesAfter = 7 days).
Projects loaded. Root project using build file '<https://builds.apache.org/job/beam_PerformanceTests_ParquetIOIT/ws/src/build.gradle'.>
Included projects: [root project 'beam', project ':beam-examples-java', project ':beam-model-fn-execution', project ':beam-model-job-management', project ':beam-model-pipeline', project ':beam-runners-apex', project ':beam-runners-core-construction-java', project ':beam-runners-core-java', project ':beam-runners-direct-java', project ':beam-runners-extensions-java-metrics', project ':beam-runners-flink_2.11', project ':beam-runners-flink_2.11-job-server', project ':beam-runners-flink_2.11-job-server-container', project ':beam-runners-gcp-gcemd', project ':beam-runners-gcp-gcsproxy', project ':beam-runners-gearpump', project ':beam-runners-google-cloud-dataflow-java', project ':beam-runners-google-cloud-dataflow-java-examples', project ':beam-runners-google-cloud-dataflow-java-examples-streaming', project ':beam-runners-google-cloud-dataflow-java-fn-api-worker', project ':beam-runners-google-cloud-dataflow-java-legacy-worker', project ':beam-runners-google-cloud-dataflow-java-windmill', project ':beam-runners-java-fn-execution', project ':beam-runners-local-java-core', project ':beam-runners-reference-java', project ':beam-runners-reference-job-server', project ':beam-runners-samza', project ':beam-runners-spark', project ':beam-sdks-go', project ':beam-sdks-go-container', project ':beam-sdks-go-examples', project ':beam-sdks-go-test', project ':beam-sdks-java-build-tools', project ':beam-sdks-java-container', project ':beam-sdks-java-core', project ':beam-sdks-java-extensions-euphoria', project ':beam-sdks-java-extensions-google-cloud-platform-core', project ':beam-sdks-java-extensions-join-library', project ':beam-sdks-java-extensions-json-jackson', project ':beam-sdks-java-extensions-kryo', project ':beam-sdks-java-extensions-protobuf', project ':beam-sdks-java-extensions-sketching', project ':beam-sdks-java-extensions-sorter', project ':beam-sdks-java-extensions-sql', project ':beam-sdks-java-extensions-sql-jdbc', project ':beam-sdks-java-extensions-sql-shell', project ':beam-sdks-java-fn-execution', project ':beam-sdks-java-harness', project ':beam-sdks-java-io-amazon-web-services', project ':beam-sdks-java-io-amqp', project ':beam-sdks-java-io-cassandra', project ':beam-sdks-java-io-common', project ':beam-sdks-java-io-elasticsearch', project ':beam-sdks-java-io-elasticsearch-tests-2', project ':beam-sdks-java-io-elasticsearch-tests-5', project ':beam-sdks-java-io-elasticsearch-tests-6', project ':beam-sdks-java-io-elasticsearch-tests-common', project ':beam-sdks-java-io-file-based-io-tests', project ':beam-sdks-java-io-google-cloud-platform', project ':beam-sdks-java-io-hadoop-common', project ':beam-sdks-java-io-hadoop-file-system', project ':beam-sdks-java-io-hadoop-format', project ':beam-sdks-java-io-hadoop-input-format', project ':beam-sdks-java-io-hbase', project ':beam-sdks-java-io-hcatalog', project ':beam-sdks-java-io-jdbc', project ':beam-sdks-java-io-jms', project ':beam-sdks-java-io-kafka', project ':beam-sdks-java-io-kinesis', project ':beam-sdks-java-io-kudu', project ':beam-sdks-java-io-mongodb', project ':beam-sdks-java-io-mqtt', project ':beam-sdks-java-io-parquet', project ':beam-sdks-java-io-rabbitmq', project ':beam-sdks-java-io-redis', project ':beam-sdks-java-io-solr', project ':beam-sdks-java-io-synthetic', project ':beam-sdks-java-io-tika', project ':beam-sdks-java-io-xml', project ':beam-sdks-java-javadoc', project ':beam-sdks-java-load-tests', project ':beam-sdks-java-maven-archetypes-examples', project ':beam-sdks-java-maven-archetypes-starter', project ':beam-sdks-java-nexmark', project ':beam-sdks-java-test-utils', project ':beam-sdks-python', project ':beam-sdks-python-container', project ':beam-sdks-python-container-py3', project ':beam-sdks-python-precommit-dataflow', project ':beam-test-infra-metrics', project ':beam-vendor-grpc-1_13_1', project ':beam-vendor-guava-20_0', project ':beam-vendor-sdks-java-extensions-protobuf', project ':beam-website', project ':release']
Parallel execution with configuration on demand is an incubating feature.

> Configure project :
Evaluating root project 'beam' using build file '<https://builds.apache.org/job/beam_PerformanceTests_ParquetIOIT/ws/src/build.gradle'.>
Offline dependencies root configured at 'offline-repository'

> Configure project :beam-runners-google-cloud-dataflow-java-fn-api-worker
Evaluating project ':beam-runners-google-cloud-dataflow-java-fn-api-worker' using build file '<https://builds.apache.org/job/beam_PerformanceTests_ParquetIOIT/ws/src/runners/google-cloud-dataflow-java/worker/build.gradle'.>
Offline dependencies root configured at 'offline-repository'

> Configure project :beam-runners-google-cloud-dataflow-java-legacy-worker
Evaluating project ':beam-runners-google-cloud-dataflow-java-legacy-worker' using build file '<https://builds.apache.org/job/beam_PerformanceTests_ParquetIOIT/ws/src/runners/google-cloud-dataflow-java/worker/legacy-worker/build.gradle'.>
Offline dependencies root configured at 'offline-repository'
file or directory '<https://builds.apache.org/job/beam_PerformanceTests_ParquetIOIT/ws/src/runners/google-cloud-dataflow-java/worker/legacy-worker/src/main/java',> not found
file or directory '<https://builds.apache.org/job/beam_PerformanceTests_ParquetIOIT/ws/src/runners/google-cloud-dataflow-java/worker/legacy-worker/src/test/java',> not found

> Configure project :beam-sdks-java-io-file-based-io-tests
Evaluating project ':beam-sdks-java-io-file-based-io-tests' using build file '<https://builds.apache.org/job/beam_PerformanceTests_ParquetIOIT/ws/src/sdks/java/io/file-based-io-tests/build.gradle'.>
Offline dependencies root configured at 'offline-repository'
file or directory '<https://builds.apache.org/job/beam_PerformanceTests_ParquetIOIT/ws/src/sdks/java/io/file-based-io-tests/src/main/java',> not found
Selected primary task 'integrationTest' from project :beam-sdks-java-io-file-based-io-tests

> Configure project :beam-sdks-java-core
Evaluating project ':beam-sdks-java-core' using build file '<https://builds.apache.org/job/beam_PerformanceTests_ParquetIOIT/ws/src/sdks/java/core/build.gradle'.>
Offline dependencies root configured at 'offline-repository'

> Configure project :beam-sdks-java-io-common
Evaluating project ':beam-sdks-java-io-common' using build file '<https://builds.apache.org/job/beam_PerformanceTests_ParquetIOIT/ws/src/sdks/java/io/common/build.gradle'.>
Offline dependencies root configured at 'offline-repository'
file or directory '<https://builds.apache.org/job/beam_PerformanceTests_ParquetIOIT/ws/src/sdks/java/io/common/src/main/java',> not found

> Configure project :beam-sdks-java-io-xml
Evaluating project ':beam-sdks-java-io-xml' using build file '<https://builds.apache.org/job/beam_PerformanceTests_ParquetIOIT/ws/src/sdks/java/io/xml/build.gradle'.>
Offline dependencies root configured at 'offline-repository'

> Configure project :beam-sdks-java-io-parquet
Evaluating project ':beam-sdks-java-io-parquet' using build file '<https://builds.apache.org/job/beam_PerformanceTests_ParquetIOIT/ws/src/sdks/java/io/parquet/build.gradle'.>
Offline dependencies root configured at 'offline-repository'

> Configure project :beam-sdks-java-io-google-cloud-platform
Evaluating project ':beam-sdks-java-io-google-cloud-platform' using build file '<https://builds.apache.org/job/beam_PerformanceTests_ParquetIOIT/ws/src/sdks/java/io/google-cloud-platform/build.gradle'.>
Offline dependencies root configured at 'offline-repository'

> Configure project :beam-examples-java
Evaluating project ':beam-examples-java' using build file '<https://builds.apache.org/job/beam_PerformanceTests_ParquetIOIT/ws/src/examples/java/build.gradle'.>
Offline dependencies root configured at 'offline-repository'

> Configure project :beam-sdks-java-container
Evaluating project ':beam-sdks-java-container' using build file '<https://builds.apache.org/job/beam_PerformanceTests_ParquetIOIT/ws/src/sdks/java/container/build.gradle'.>
Offline dependencies root configured at 'offline-repository'
Ignore packages globally: appengine,a,gen,shared,common,thrifttest,appengine_internal,thrift,tutorial

> Configure project :release
Evaluating project ':release' using build file '<https://builds.apache.org/job/beam_PerformanceTests_ParquetIOIT/ws/src/release/build.gradle'.>

> Configure project :beam-runners-google-cloud-dataflow-java
Evaluating project ':beam-runners-google-cloud-dataflow-java' using build file '<https://builds.apache.org/job/beam_PerformanceTests_ParquetIOIT/ws/src/runners/google-cloud-dataflow-java/build.gradle'.>
Offline dependencies root configured at 'offline-repository'

> Configure project :beam-model-pipeline
Evaluating project ':beam-model-pipeline' using build file '<https://builds.apache.org/job/beam_PerformanceTests_ParquetIOIT/ws/src/model/pipeline/build.gradle'.>
Offline dependencies root configured at 'offline-repository'
applyPortabilityNature with [shadowJarValidationExcludes:[org/apache/beam/model/pipeline/v1/**]] for project beam-model-pipeline
file or directory '<https://builds.apache.org/job/beam_PerformanceTests_ParquetIOIT/ws/src/model/pipeline/src/main/java',> not found
file or directory '<https://builds.apache.org/job/beam_PerformanceTests_ParquetIOIT/ws/src/model/pipeline/src/test/java',> not found
------------------------------------------------------------------------
Detecting the operating system and CPU architecture
------------------------------------------------------------------------
os.detected.name=linux
os.detected.arch=x86_64
os.detected.release=ubuntu
os.detected.release.version=16.04
os.detected.release.like.ubuntu=true
os.detected.release.like.debian=true
os.detected.classifier=linux-x86_64

> Configure project :beam-sdks-java-extensions-google-cloud-platform-core
Evaluating project ':beam-sdks-java-extensions-google-cloud-platform-core' using build file '<https://builds.apache.org/job/beam_PerformanceTests_ParquetIOIT/ws/src/sdks/java/extensions/google-cloud-platform-core/build.gradle'.>
Offline dependencies root configured at 'offline-repository'

> Configure project :beam-runners-core-construction-java
Evaluating project ':beam-runners-core-construction-java' using build file '<https://builds.apache.org/job/beam_PerformanceTests_ParquetIOIT/ws/src/runners/core-construction-java/build.gradle'.>
Offline dependencies root configured at 'offline-repository'

> Configure project :beam-sdks-java-extensions-protobuf
Evaluating project ':beam-sdks-java-extensions-protobuf' using build file '<https://builds.apache.org/job/beam_PerformanceTests_ParquetIOIT/ws/src/sdks/java/extensions/protobuf/build.gradle'.>
Offline dependencies root configured at 'offline-repository'
------------------------------------------------------------------------
Detecting the operating system and CPU architecture
------------------------------------------------------------------------
os.detected.name=linux
os.detected.arch=x86_64
os.detected.release=ubuntu
os.detected.release.version=16.04
os.detected.release.like.ubuntu=true
os.detected.release.like.debian=true
os.detected.classifier=linux-x86_64

> Configure project :beam-model-job-management
Evaluating project ':beam-model-job-management' using build file '<https://builds.apache.org/job/beam_PerformanceTests_ParquetIOIT/ws/src/model/job-management/build.gradle'.>
Offline dependencies root configured at 'offline-repository'
applyPortabilityNature with [shadowJarValidationExcludes:[org/apache/beam/model/jobmanagement/v1/**]] for project beam-model-job-management
file or directory '<https://builds.apache.org/job/beam_PerformanceTests_ParquetIOIT/ws/src/model/job-management/src/main/java',> not found
file or directory '<https://builds.apache.org/job/beam_PerformanceTests_ParquetIOIT/ws/src/model/job-management/src/test/java',> not found
------------------------------------------------------------------------
Detecting the operating system and CPU architecture
------------------------------------------------------------------------
os.detected.name=linux
os.detected.arch=x86_64
os.detected.release=ubuntu
os.detected.release.version=16.04
os.detected.release.like.ubuntu=true
os.detected.release.like.debian=true
os.detected.classifier=linux-x86_64

> Configure project :beam-runners-core-java
Evaluating project ':beam-runners-core-java' using build file '<https://builds.apache.org/job/beam_PerformanceTests_ParquetIOIT/ws/src/runners/core-java/build.gradle'.>
Offline dependencies root configured at 'offline-repository'

> Configure project :beam-runners-direct-java
Evaluating project ':beam-runners-direct-java' using build file '<https://builds.apache.org/job/beam_PerformanceTests_ParquetIOIT/ws/src/runners/direct-java/build.gradle'.>
Offline dependencies root configured at 'offline-repository'

> Configure project :beam-runners-local-java-core
Evaluating project ':beam-runners-local-java-core' using build file '<https://builds.apache.org/job/beam_PerformanceTests_ParquetIOIT/ws/src/runners/local-java/build.gradle'.>
Offline dependencies root configured at 'offline-repository'

> Configure project :beam-runners-java-fn-execution
Evaluating project ':beam-runners-java-fn-execution' using build file '<https://builds.apache.org/job/beam_PerformanceTests_ParquetIOIT/ws/src/runners/java-fn-execution/build.gradle'.>
Offline dependencies root configured at 'offline-repository'

> Configure project :beam-sdks-java-fn-execution
Evaluating project ':beam-sdks-java-fn-execution' using build file '<https://builds.apache.org/job/beam_PerformanceTests_ParquetIOIT/ws/src/sdks/java/fn-execution/build.gradle'.>
Offline dependencies root configured at 'offline-repository'

> Configure project :beam-model-fn-execution
Evaluating project ':beam-model-fn-execution' using build file '<https://builds.apache.org/job/beam_PerformanceTests_ParquetIOIT/ws/src/model/fn-execution/build.gradle'.>
Offline dependencies root configured at 'offline-repository'
applyPortabilityNature with [shadowJarValidationExcludes:[org/apache/beam/model/fnexecution/v1/**]] for project beam-model-fn-execution
file or directory '<https://builds.apache.org/job/beam_PerformanceTests_ParquetIOIT/ws/src/model/fn-execution/src/main/java',> not found
file or directory '<https://builds.apache.org/job/beam_PerformanceTests_ParquetIOIT/ws/src/model/fn-execution/src/test/java',> not found
------------------------------------------------------------------------
Detecting the operating system and CPU architecture
------------------------------------------------------------------------
os.detected.name=linux
os.detected.arch=x86_64
os.detected.release=ubuntu
os.detected.release.version=16.04
os.detected.release.like.ubuntu=true
os.detected.release.like.debian=true
os.detected.classifier=linux-x86_64

> Configure project :beam-vendor-sdks-java-extensions-protobuf
Evaluating project ':beam-vendor-sdks-java-extensions-protobuf' using build file '<https://builds.apache.org/job/beam_PerformanceTests_ParquetIOIT/ws/src/vendor/sdks-java-extensions-protobuf/build.gradle'.>
Offline dependencies root configured at 'offline-repository'
file or directory '<https://builds.apache.org/job/beam_PerformanceTests_ParquetIOIT/ws/src/vendor/sdks-java-extensions-protobuf/src/main/java',> not found
file or directory '<https://builds.apache.org/job/beam_PerformanceTests_ParquetIOIT/ws/src/vendor/sdks-java-extensions-protobuf/src/test/java',> not found

> Configure project :beam-sdks-java-harness
Evaluating project ':beam-sdks-java-harness' using build file '<https://builds.apache.org/job/beam_PerformanceTests_ParquetIOIT/ws/src/sdks/java/harness/build.gradle'.>
Offline dependencies root configured at 'offline-repository'

> Configure project :beam-runners-google-cloud-dataflow-java-windmill
Evaluating project ':beam-runners-google-cloud-dataflow-java-windmill' using build file '<https://builds.apache.org/job/beam_PerformanceTests_ParquetIOIT/ws/src/runners/google-cloud-dataflow-java/worker/windmill/build.gradle'.>
Offline dependencies root configured at 'offline-repository'
applyPortabilityNature with [shadowJarValidationExcludes:[org/apache/beam/runners/dataflow/worker/windmill/**]] for project beam-runners-google-cloud-dataflow-java-windmill
file or directory '<https://builds.apache.org/job/beam_PerformanceTests_ParquetIOIT/ws/src/runners/google-cloud-dataflow-java/worker/windmill/src/main/java',> not found
file or directory '<https://builds.apache.org/job/beam_PerformanceTests_ParquetIOIT/ws/src/runners/google-cloud-dataflow-java/worker/windmill/src/test/java',> not found
------------------------------------------------------------------------
Detecting the operating system and CPU architecture
------------------------------------------------------------------------
os.detected.name=linux
os.detected.arch=x86_64
os.detected.release=ubuntu
os.detected.release.version=16.04
os.detected.release.like.ubuntu=true
os.detected.release.like.debian=true
os.detected.classifier=linux-x86_64
All projects evaluated.
Tasks to be executed: [task ':beam-model-pipeline:extractIncludeProto', task ':beam-model-pipeline:extractProto', task ':beam-model-pipeline:generateProto', task ':beam-model-pipeline:compileJava', task ':beam-model-pipeline:processResources', task ':beam-model-pipeline:classes', task ':beam-model-pipeline:jar', task ':beam-model-job-management:extractIncludeProto', task ':beam-model-job-management:extractProto', task ':beam-model-job-management:generateProto', task ':beam-model-job-management:compileJava', task ':beam-model-job-management:processResources', task ':beam-model-job-management:classes', task ':beam-model-pipeline:shadowJar', task ':beam-model-job-management:shadowJar', task ':beam-sdks-java-core:generateAvroProtocol', task ':beam-sdks-java-core:generateAvroJava', task ':beam-sdks-java-core:compileJava', task ':beam-sdks-java-core:processResources', task ':beam-sdks-java-core:classes', task ':beam-sdks-java-core:shadowJar', task ':beam-runners-core-construction-java:compileJava', task ':beam-runners-core-construction-java:processResources', task ':beam-runners-core-construction-java:classes', task ':beam-runners-core-construction-java:shadowJar', task ':beam-model-fn-execution:extractIncludeProto', task ':beam-model-fn-execution:extractProto', task ':beam-model-fn-execution:generateProto', task ':beam-model-fn-execution:compileJava', task ':beam-model-fn-execution:processResources', task ':beam-model-fn-execution:classes', task ':beam-model-fn-execution:shadowJar', task ':beam-sdks-java-fn-execution:compileJava', task ':beam-sdks-java-fn-execution:processResources', task ':beam-sdks-java-fn-execution:classes', task ':beam-sdks-java-fn-execution:shadowJar', task ':beam-runners-core-java:compileJava', task ':beam-runners-core-java:processResources', task ':beam-runners-core-java:classes', task ':beam-runners-core-java:shadowJar', task ':beam-sdks-java-extensions-google-cloud-platform-core:compileJava', task ':beam-sdks-java-extensions-google-cloud-platform-core:processResources', task ':beam-sdks-java-extensions-google-cloud-platform-core:classes', task ':beam-sdks-java-extensions-google-cloud-platform-core:shadowJar', task ':beam-sdks-java-harness:compileJava', task ':beam-sdks-java-harness:processResources', task ':beam-sdks-java-harness:classes', task ':beam-sdks-java-harness:jar', task ':beam-sdks-java-harness:shadowJar', task ':beam-vendor-sdks-java-extensions-protobuf:compileJava', task ':beam-vendor-sdks-java-extensions-protobuf:processResources', task ':beam-vendor-sdks-java-extensions-protobuf:classes', task ':beam-vendor-sdks-java-extensions-protobuf:shadowJar', task ':beam-runners-java-fn-execution:compileJava', task ':beam-runners-java-fn-execution:processResources', task ':beam-runners-java-fn-execution:classes', task ':beam-runners-java-fn-execution:shadowJar', task ':beam-runners-local-java-core:compileJava', task ':beam-runners-local-java-core:processResources', task ':beam-runners-local-java-core:classes', task ':beam-runners-local-java-core:shadowJar', task ':beam-runners-direct-java:compileJava', task ':beam-runners-direct-java:processResources', task ':beam-runners-direct-java:classes', task ':beam-runners-direct-java:shadowJar', task ':beam-sdks-java-extensions-protobuf:extractIncludeProto', task ':beam-sdks-java-extensions-protobuf:extractProto', task ':beam-sdks-java-extensions-protobuf:generateProto', task ':beam-sdks-java-extensions-protobuf:compileJava', task ':beam-sdks-java-extensions-protobuf:processResources', task ':beam-sdks-java-extensions-protobuf:classes', task ':beam-sdks-java-extensions-protobuf:shadowJar', task ':beam-sdks-java-io-google-cloud-platform:compileJava', task ':beam-sdks-java-io-google-cloud-platform:processResources', task ':beam-sdks-java-io-google-cloud-platform:classes', task ':beam-sdks-java-io-google-cloud-platform:shadowJar', task ':beam-runners-google-cloud-dataflow-java:compileJava', task ':beam-runners-google-cloud-dataflow-java:processResources', task ':beam-runners-google-cloud-dataflow-java:classes', task ':beam-runners-google-cloud-dataflow-java:shadowJar', task ':beam-sdks-java-core:generateTestAvroProtocol', task ':beam-sdks-java-core:generateTestAvroJava', task ':beam-sdks-java-core:compileTestJava', task ':beam-sdks-java-core:processTestResources', task ':beam-sdks-java-core:testClasses', task ':beam-sdks-java-core:shadowTestJar', task ':beam-sdks-java-extensions-google-cloud-platform-core:compileTestJava', task ':beam-sdks-java-extensions-google-cloud-platform-core:processTestResources', task ':beam-sdks-java-extensions-google-cloud-platform-core:testClasses', task ':beam-sdks-java-extensions-google-cloud-platform-core:shadowTestJar', task ':beam-sdks-java-io-google-cloud-platform:compileTestJava', task ':beam-sdks-java-io-google-cloud-platform:processTestResources', task ':beam-sdks-java-io-google-cloud-platform:testClasses', task ':beam-sdks-java-io-google-cloud-platform:shadowTestJar', task ':beam-runners-google-cloud-dataflow-java:compileTestJava', task ':beam-runners-google-cloud-dataflow-java:processTestResources', task ':beam-runners-google-cloud-dataflow-java:testClasses', task ':beam-runners-google-cloud-dataflow-java:shadowTestJar', task ':beam-runners-google-cloud-dataflow-java-windmill:extractIncludeProto', task ':beam-runners-google-cloud-dataflow-java-windmill:extractProto', task ':beam-runners-google-cloud-dataflow-java-windmill:generateProto', task ':beam-runners-google-cloud-dataflow-java-windmill:compileJava', task ':beam-runners-google-cloud-dataflow-java-windmill:processResources', task ':beam-runners-google-cloud-dataflow-java-windmill:classes', task ':beam-runners-google-cloud-dataflow-java-windmill:shadowJar', task ':beam-runners-google-cloud-dataflow-java-legacy-worker:compileJava', task ':beam-runners-google-cloud-dataflow-java-legacy-worker:processResources', task ':beam-runners-google-cloud-dataflow-java-legacy-worker:classes', task ':beam-runners-google-cloud-dataflow-java-legacy-worker:shadowJar', task ':beam-sdks-java-io-common:compileJava', task ':beam-sdks-java-io-common:processResources', task ':beam-sdks-java-io-common:classes', task ':beam-sdks-java-io-common:shadowJar', task ':beam-sdks-java-io-common:compileTestJava', task ':beam-sdks-java-io-common:processTestResources', task ':beam-sdks-java-io-common:testClasses', task ':beam-sdks-java-io-common:shadowTestJar', task ':beam-sdks-java-io-file-based-io-tests:compileJava', task ':beam-sdks-java-io-file-based-io-tests:processResources', task ':beam-sdks-java-io-file-based-io-tests:classes', task ':beam-sdks-java-io-parquet:compileJava', task ':beam-sdks-java-io-parquet:processResources', task ':beam-sdks-java-io-parquet:classes', task ':beam-sdks-java-io-parquet:shadowJar', task ':beam-sdks-java-io-parquet:compileTestJava', task ':beam-sdks-java-io-parquet:processTestResources', task ':beam-sdks-java-io-parquet:testClasses', task ':beam-sdks-java-io-parquet:shadowTestJar', task ':beam-sdks-java-io-xml:compileJava', task ':beam-sdks-java-io-xml:processResources', task ':beam-sdks-java-io-xml:classes', task ':beam-sdks-java-io-xml:shadowJar', task ':beam-sdks-java-io-xml:compileTestJava', task ':beam-sdks-java-io-xml:processTestResources', task ':beam-sdks-java-io-xml:testClasses', task ':beam-sdks-java-io-xml:shadowTestJar', task ':beam-sdks-java-io-file-based-io-tests:compileTestJava', task ':beam-sdks-java-io-file-based-io-tests:processTestResources', task ':beam-sdks-java-io-file-based-io-tests:testClasses', task ':beam-sdks-java-io-file-based-io-tests:integrationTest']
VisTEG: Dependency graph written into <https://builds.apache.org/job/beam_PerformanceTests_ParquetIOIT/ws/src/build/reports/visteg.dot>
:beam-model-pipeline:extractIncludeProto (Thread[Task worker for ':',5,main]) started.
:beam-model-job-management:extractProto (Thread[Task worker for ':' Thread 3,5,main]) started.
:beam-sdks-java-core:generateAvroProtocol (Thread[Task worker for ':' Thread 2,5,main]) started.

> Task :beam-sdks-java-core:generateAvroProtocol

STDERR: 
2018-12-10 06:43:48,558 07b3f387 MainThread beam_integration_benchmark(1/1) ERROR    Error during benchmark beam_integration_benchmark
Traceback (most recent call last):
  File "<https://builds.apache.org/job/beam_PerformanceTests_ParquetIOIT/ws/PerfKitBenchmarker/perfkitbenchmarker/pkb.py",> line 719, in RunBenchmark
    DoRunPhase(spec, collector, detailed_timer)
  File "<https://builds.apache.org/job/beam_PerformanceTests_ParquetIOIT/ws/PerfKitBenchmarker/perfkitbenchmarker/pkb.py",> line 580, in DoRunPhase
    samples = spec.BenchmarkRun(spec)
  File "<https://builds.apache.org/job/beam_PerformanceTests_ParquetIOIT/ws/PerfKitBenchmarker/perfkitbenchmarker/linux_benchmarks/beam_integration_benchmark.py",> line 160, in Run
    job_type=job_type)
  File "<https://builds.apache.org/job/beam_PerformanceTests_ParquetIOIT/ws/PerfKitBenchmarker/perfkitbenchmarker/providers/gcp/gcp_dpb_dataflow.py",> line 90, in SubmitJob
    assert retcode == 0, "Integration Test Failed."
AssertionError: Integration Test Failed.
2018-12-10 06:43:48,559 07b3f387 MainThread beam_integration_benchmark(1/1) INFO     Cleaning up benchmark beam_integration_benchmark
2018-12-10 06:43:48,561 07b3f387 MainThread beam_integration_benchmark(1/1) ERROR    Exception running benchmark
Traceback (most recent call last):
  File "<https://builds.apache.org/job/beam_PerformanceTests_ParquetIOIT/ws/PerfKitBenchmarker/perfkitbenchmarker/pkb.py",> line 860, in RunBenchmarkTask
    RunBenchmark(spec, collector)
  File "<https://builds.apache.org/job/beam_PerformanceTests_ParquetIOIT/ws/PerfKitBenchmarker/perfkitbenchmarker/pkb.py",> line 719, in RunBenchmark
    DoRunPhase(spec, collector, detailed_timer)
  File "<https://builds.apache.org/job/beam_PerformanceTests_ParquetIOIT/ws/PerfKitBenchmarker/perfkitbenchmarker/pkb.py",> line 580, in DoRunPhase
    samples = spec.BenchmarkRun(spec)
  File "<https://builds.apache.org/job/beam_PerformanceTests_ParquetIOIT/ws/PerfKitBenchmarker/perfkitbenchmarker/linux_benchmarks/beam_integration_benchmark.py",> line 160, in Run
    job_type=job_type)
  File "<https://builds.apache.org/job/beam_PerformanceTests_ParquetIOIT/ws/PerfKitBenchmarker/perfkitbenchmarker/providers/gcp/gcp_dpb_dataflow.py",> line 90, in SubmitJob
    assert retcode == 0, "Integration Test Failed."
AssertionError: Integration Test Failed.
2018-12-10 06:43:48,562 07b3f387 MainThread beam_integration_benchmark(1/1) ERROR    Benchmark 1/1 beam_integration_benchmark (UID: beam_integration_benchmark0) failed. Execution will continue.
2018-12-10 06:43:48,562 07b3f387 MainThread beam_integration_benchmark(1/1) INFO     Benchmark run statuses:
---------------------------------------------------------------------------------
Name                        UID                          Status  Failed Substatus
---------------------------------------------------------------------------------
beam_integration_benchmark  beam_integration_benchmark0  FAILED                  
---------------------------------------------------------------------------------
Success rate: 0.00% (0/1)
2018-12-10 06:43:48,562 07b3f387 MainThread beam_integration_benchmark(1/1) INFO     Complete logs can be found at: <https://builds.apache.org/job/beam_PerformanceTests_ParquetIOIT/ws/runs/07b3f387/pkb.log>
2018-12-10 06:43:48,562 07b3f387 MainThread beam_integration_benchmark(1/1) INFO     Completion statuses can be found at: <https://builds.apache.org/job/beam_PerformanceTests_ParquetIOIT/ws/runs/07b3f387/completion_statuses.json>
Build step 'Execute shell' marked build as failure

---------------------------------------------------------------------
To unsubscribe, e-mail: builds-unsubscribe@beam.apache.org
For additional commands, e-mail: builds-help@beam.apache.org


Jenkins build is back to normal : beam_PerformanceTests_ParquetIOIT #831

Posted by Apache Jenkins Server <je...@builds.apache.org>.
See <https://builds.apache.org/job/beam_PerformanceTests_ParquetIOIT/831/display/redirect?page=changes>


---------------------------------------------------------------------
To unsubscribe, e-mail: builds-unsubscribe@beam.apache.org
For additional commands, e-mail: builds-help@beam.apache.org


Build failed in Jenkins: beam_PerformanceTests_ParquetIOIT #830

Posted by Apache Jenkins Server <je...@builds.apache.org>.
See <https://builds.apache.org/job/beam_PerformanceTests_ParquetIOIT/830/display/redirect?page=changes>

Changes:

[robertwb] [BEAM-4150] Use unwindowed coder in FnApiRunner optimization phases.

[robertwb] [BEAM-6186] Optimization cleanup: move phase utilities out of local

[robertwb] [BEAM-6167] Add class ReadFromTextWithFilename (Python) (#7193)

[robertwb] [BEAM-6120] Support retrieval of large gbk iterables over the state API.

------------------------------------------
[...truncated 77.03 KB...]
Build cache key for task ':beam-runners-google-cloud-dataflow-java-windmill:generateProto' is da1a1d77f3b5faf0e650d5a4fbf11d0c
Caching disabled for task ':beam-runners-google-cloud-dataflow-java-windmill:generateProto': Caching has not been enabled for the task
Task ':beam-runners-google-cloud-dataflow-java-windmill:generateProto' is not up-to-date because:
  No history is available.
Resolving artifact: [group:io.grpc, name:protoc-gen-grpc-java, version:1.13.1, classifier:linux-x86_64, ext:exe]
Resolved artifact: /home/jenkins/.gradle/caches/modules-2/files-2.1/io.grpc/protoc-gen-grpc-java/1.13.1/32590221d5e5271fbe323957729a69264cb269bc/protoc-gen-grpc-java-1.13.1-linux-x86_64.exe
Resolving artifact: [group:com.google.protobuf, name:protoc, version:3.6.0, classifier:linux-x86_64, ext:exe]
Resolved artifact: /home/jenkins/.gradle/caches/modules-2/files-2.1/com.google.protobuf/protoc/3.6.0/20e0eb4a72c8c2debd831936262626a36032bda6/protoc-3.6.0-linux-x86_64.exe
[/home/jenkins/.gradle/caches/modules-2/files-2.1/com.google.protobuf/protoc/3.6.0/20e0eb4a72c8c2debd831936262626a36032bda6/protoc-3.6.0-linux-x86_64.exe, -I<https://builds.apache.org/job/beam_PerformanceTests_ParquetIOIT/ws/src/runners/google-cloud-dataflow-java/worker/windmill/src/main/proto,> -I<https://builds.apache.org/job/beam_PerformanceTests_ParquetIOIT/ws/src/runners/google-cloud-dataflow-java/worker/windmill/build/extracted-protos/main,> -I<https://builds.apache.org/job/beam_PerformanceTests_ParquetIOIT/ws/src/runners/google-cloud-dataflow-java/worker/windmill/build/extracted-include-protos/main,> --java_out=<https://builds.apache.org/job/beam_PerformanceTests_ParquetIOIT/ws/src/runners/google-cloud-dataflow-java/worker/windmill/build/generated/source/proto/main/java,> --grpc_out=<https://builds.apache.org/job/beam_PerformanceTests_ParquetIOIT/ws/src/runners/google-cloud-dataflow-java/worker/windmill/build/generated/source/proto/main/grpc,> --plugin=protoc-gen-grpc=/home/jenkins/.gradle/caches/modules-2/files-2.1/io.grpc/protoc-gen-grpc-java/1.13.1/32590221d5e5271fbe323957729a69264cb269bc/protoc-gen-grpc-java-1.13.1-linux-x86_64.exe, <https://builds.apache.org/job/beam_PerformanceTests_ParquetIOIT/ws/src/runners/google-cloud-dataflow-java/worker/windmill/src/main/proto/pubsub.proto,> <https://builds.apache.org/job/beam_PerformanceTests_ParquetIOIT/ws/src/runners/google-cloud-dataflow-java/worker/windmill/src/main/proto/windmill.proto,> <https://builds.apache.org/job/beam_PerformanceTests_ParquetIOIT/ws/src/runners/google-cloud-dataflow-java/worker/windmill/src/main/proto/windmill_service.proto]>
:beam-runners-google-cloud-dataflow-java-windmill:generateProto (Thread[Task worker for ':' Thread 9,5,main]) completed. Took 0.092 secs.

> Task :beam-model-pipeline:generateProto FAILED
Build cache key for task ':beam-model-pipeline:generateProto' is 247d750d7187941f0c63777a647c1276
Caching disabled for task ':beam-model-pipeline:generateProto': Caching has not been enabled for the task
Task ':beam-model-pipeline:generateProto' is not up-to-date because:
  No history is available.
Resolving artifact: [group:io.grpc, name:protoc-gen-grpc-java, version:1.13.1, classifier:linux-x86_64, ext:exe]
Resolved artifact: /home/jenkins/.gradle/caches/modules-2/files-2.1/io.grpc/protoc-gen-grpc-java/1.13.1/32590221d5e5271fbe323957729a69264cb269bc/protoc-gen-grpc-java-1.13.1-linux-x86_64.exe
Resolving artifact: [group:com.google.protobuf, name:protoc, version:3.6.0, classifier:linux-x86_64, ext:exe]
Resolved artifact: /home/jenkins/.gradle/caches/modules-2/files-2.1/com.google.protobuf/protoc/3.6.0/20e0eb4a72c8c2debd831936262626a36032bda6/protoc-3.6.0-linux-x86_64.exe
[/home/jenkins/.gradle/caches/modules-2/files-2.1/com.google.protobuf/protoc/3.6.0/20e0eb4a72c8c2debd831936262626a36032bda6/protoc-3.6.0-linux-x86_64.exe, -I<https://builds.apache.org/job/beam_PerformanceTests_ParquetIOIT/ws/src/model/pipeline/src/main/proto,> -I<https://builds.apache.org/job/beam_PerformanceTests_ParquetIOIT/ws/src/model/pipeline/build/extracted-protos/main,> -I<https://builds.apache.org/job/beam_PerformanceTests_ParquetIOIT/ws/src/model/pipeline/build/extracted-include-protos/main,> --java_out=<https://builds.apache.org/job/beam_PerformanceTests_ParquetIOIT/ws/src/model/pipeline/build/generated/source/proto/main/java,> --grpc_out=<https://builds.apache.org/job/beam_PerformanceTests_ParquetIOIT/ws/src/model/pipeline/build/generated/source/proto/main/grpc,> --plugin=protoc-gen-grpc=/home/jenkins/.gradle/caches/modules-2/files-2.1/io.grpc/protoc-gen-grpc-java/1.13.1/32590221d5e5271fbe323957729a69264cb269bc/protoc-gen-grpc-java-1.13.1-linux-x86_64.exe, <https://builds.apache.org/job/beam_PerformanceTests_ParquetIOIT/ws/src/model/pipeline/src/main/proto/beam_runner_api.proto,> <https://builds.apache.org/job/beam_PerformanceTests_ParquetIOIT/ws/src/model/pipeline/src/main/proto/endpoints.proto,> <https://builds.apache.org/job/beam_PerformanceTests_ParquetIOIT/ws/src/model/pipeline/src/main/proto/standard_window_fns.proto]>
:beam-model-pipeline:generateProto (Thread[Task worker for ':',5,main]) completed. Took 0.089 secs.

> Task :beam-sdks-java-core:generateTestAvroJava
Build cache key for task ':beam-sdks-java-core:generateTestAvroJava' is 474b3169f13eed8153f5415bad5af4af
Caching disabled for task ':beam-sdks-java-core:generateTestAvroJava': Caching has not been enabled for the task
Task ':beam-sdks-java-core:generateTestAvroJava' is not up-to-date because:
  No history is available.
Found 1 files
Processed src/test/avro/org/apache/beam/sdk/io/user.avsc
:beam-sdks-java-core:generateTestAvroJava (Thread[Task worker for ':' Thread 4,5,main]) completed. Took 0.845 secs.

Deprecated Gradle features were used in this build, making it incompatible with Gradle 5.0.
Use '--warning-mode all' to show the individual deprecation warnings.
See https://docs.gradle.org/4.10.2/userguide/command_line_interface.html#sec:command_line_warnings
15 actionable tasks: 15 executed

Publishing build scan...
https://gradle.com/s/byoyvocfs22gs


STDERR: 
FAILURE: Build completed with 2 failures.

1: Task failed with an exception.
-----------
* What went wrong:
Execution failed for task ':beam-runners-google-cloud-dataflow-java-windmill:generateProto'.
> java.io.IOException: Cannot run program "/home/jenkins/.gradle/caches/modules-2/files-2.1/com.google.protobuf/protoc/3.6.0/20e0eb4a72c8c2debd831936262626a36032bda6/protoc-3.6.0-linux-x86_64.exe": error=11, Resource temporarily unavailable

* Try:
Run with --debug option to get more log output. Run with --scan to get full insights.

* Exception is:
org.gradle.api.tasks.TaskExecutionException: Execution failed for task ':beam-runners-google-cloud-dataflow-java-windmill:generateProto'.
	at org.gradle.api.internal.tasks.execution.ExecuteActionsTaskExecuter.executeActions(ExecuteActionsTaskExecuter.java:110)
	at org.gradle.api.internal.tasks.execution.ExecuteActionsTaskExecuter.execute(ExecuteActionsTaskExecuter.java:77)
	at org.gradle.api.internal.tasks.execution.OutputDirectoryCreatingTaskExecuter.execute(OutputDirectoryCreatingTaskExecuter.java:51)
	at org.gradle.api.internal.tasks.execution.SkipCachedTaskExecuter.execute(SkipCachedTaskExecuter.java:105)
	at org.gradle.api.internal.tasks.execution.SkipUpToDateTaskExecuter.execute(SkipUpToDateTaskExecuter.java:59)
	at org.gradle.api.internal.tasks.execution.ResolveTaskOutputCachingStateExecuter.execute(ResolveTaskOutputCachingStateExecuter.java:54)
	at org.gradle.api.internal.tasks.execution.ResolveBuildCacheKeyExecuter.execute(ResolveBuildCacheKeyExecuter.java:79)
	at org.gradle.api.internal.tasks.execution.ValidatingTaskExecuter.execute(ValidatingTaskExecuter.java:59)
	at org.gradle.api.internal.tasks.execution.SkipEmptySourceFilesTaskExecuter.execute(SkipEmptySourceFilesTaskExecuter.java:101)
	at org.gradle.api.internal.tasks.execution.FinalizeInputFilePropertiesTaskExecuter.execute(FinalizeInputFilePropertiesTaskExecuter.java:44)
	at org.gradle.api.internal.tasks.execution.CleanupStaleOutputsExecuter.execute(CleanupStaleOutputsExecuter.java:91)
	at org.gradle.api.internal.tasks.execution.ResolveTaskArtifactStateTaskExecuter.execute(ResolveTaskArtifactStateTaskExecuter.java:62)
	at org.gradle.api.internal.tasks.execution.SkipTaskWithNoActionsExecuter.execute(SkipTaskWithNoActionsExecuter.java:59)
	at org.gradle.api.internal.tasks.execution.SkipOnlyIfTaskExecuter.execute(SkipOnlyIfTaskExecuter.java:54)
	at org.gradle.api.internal.tasks.execution.ExecuteAtMostOnceTaskExecuter.execute(ExecuteAtMostOnceTaskExecuter.java:43)
	at org.gradle.api.internal.tasks.execution.CatchExceptionTaskExecuter.execute(CatchExceptionTaskExecuter.java:34)
	at org.gradle.api.internal.tasks.execution.EventFiringTaskExecuter$1.run(EventFiringTaskExecuter.java:51)
	at org.gradle.internal.operations.DefaultBuildOperationExecutor$RunnableBuildOperationWorker.execute(DefaultBuildOperationExecutor.java:300)
	at org.gradle.internal.operations.DefaultBuildOperationExecutor$RunnableBuildOperationWorker.execute(DefaultBuildOperationExecutor.java:292)
	at org.gradle.internal.operations.DefaultBuildOperationExecutor.execute(DefaultBuildOperationExecutor.java:174)
	at org.gradle.internal.operations.DefaultBuildOperationExecutor.run(DefaultBuildOperationExecutor.java:90)
	at org.gradle.internal.operations.DelegatingBuildOperationExecutor.run(DelegatingBuildOperationExecutor.java:31)
	at org.gradle.api.internal.tasks.execution.EventFiringTaskExecuter.execute(EventFiringTaskExecuter.java:46)
	at org.gradle.execution.taskgraph.LocalTaskInfoExecutor.execute(LocalTaskInfoExecutor.java:42)
	at org.gradle.execution.taskgraph.DefaultTaskExecutionGraph$BuildOperationAwareWorkItemExecutor.execute(DefaultTaskExecutionGraph.java:277)
	at org.gradle.execution.taskgraph.DefaultTaskExecutionGraph$BuildOperationAwareWorkItemExecutor.execute(DefaultTaskExecutionGraph.java:262)
	at org.gradle.execution.taskgraph.DefaultTaskPlanExecutor$ExecutorWorker$1.execute(DefaultTaskPlanExecutor.java:135)
	at org.gradle.execution.taskgraph.DefaultTaskPlanExecutor$ExecutorWorker$1.execute(DefaultTaskPlanExecutor.java:130)
	at org.gradle.execution.taskgraph.DefaultTaskPlanExecutor$ExecutorWorker.execute(DefaultTaskPlanExecutor.java:200)
	at org.gradle.execution.taskgraph.DefaultTaskPlanExecutor$ExecutorWorker.executeWithWork(DefaultTaskPlanExecutor.java:191)
	at org.gradle.execution.taskgraph.DefaultTaskPlanExecutor$ExecutorWorker.run(DefaultTaskPlanExecutor.java:130)
	at org.gradle.internal.concurrent.ExecutorPolicy$CatchAndRecordFailures.onExecute(ExecutorPolicy.java:63)
	at org.gradle.internal.concurrent.ManagedExecutorImpl$1.run(ManagedExecutorImpl.java:46)
	at org.gradle.internal.concurrent.ThreadFactoryImpl$ManagedThreadRunnable.run(ThreadFactoryImpl.java:55)
Caused by: org.gradle.api.UncheckedIOException: java.io.IOException: Cannot run program "/home/jenkins/.gradle/caches/modules-2/files-2.1/com.google.protobuf/protoc/3.6.0/20e0eb4a72c8c2debd831936262626a36032bda6/protoc-3.6.0-linux-x86_64.exe": error=11, Resource temporarily unavailable
	at org.gradle.internal.UncheckedException.throwAsUncheckedException(UncheckedException.java:57)
	at org.gradle.internal.UncheckedException.throwAsUncheckedException(UncheckedException.java:40)
	at org.gradle.internal.reflect.JavaMethod.invoke(JavaMethod.java:76)
	at org.gradle.api.internal.project.taskfactory.StandardTaskAction.doExecute(StandardTaskAction.java:46)
	at org.gradle.api.internal.project.taskfactory.StandardTaskAction.execute(StandardTaskAction.java:39)
	at org.gradle.api.internal.project.taskfactory.StandardTaskAction.execute(StandardTaskAction.java:26)
	at org.gradle.api.internal.AbstractTask$TaskActionWrapper.execute(AbstractTask.java:801)
	at org.gradle.api.internal.AbstractTask$TaskActionWrapper.execute(AbstractTask.java:768)
	at org.gradle.api.internal.tasks.execution.ExecuteActionsTaskExecuter$1.run(ExecuteActionsTaskExecuter.java:131)
	at org.gradle.internal.operations.DefaultBuildOperationExecutor$RunnableBuildOperationWorker.execute(DefaultBuildOperationExecutor.java:300)
	at org.gradle.internal.operations.DefaultBuildOperationExecutor$RunnableBuildOperationWorker.execute(DefaultBuildOperationExecutor.java:292)
	at org.gradle.internal.operations.DefaultBuildOperationExecutor.execute(DefaultBuildOperationExecutor.java:174)
	at org.gradle.internal.operations.DefaultBuildOperationExecutor.run(DefaultBuildOperationExecutor.java:90)
	at org.gradle.internal.operations.DelegatingBuildOperationExecutor.run(DelegatingBuildOperationExecutor.java:31)
	at org.gradle.api.internal.tasks.execution.ExecuteActionsTaskExecuter.executeAction(ExecuteActionsTaskExecuter.java:120)
	at org.gradle.api.internal.tasks.execution.ExecuteActionsTaskExecuter.executeActions(ExecuteActionsTaskExecuter.java:99)
	... 33 more
Caused by: java.io.IOException: Cannot run program "/home/jenkins/.gradle/caches/modules-2/files-2.1/com.google.protobuf/protoc/3.6.0/20e0eb4a72c8c2debd831936262626a36032bda6/protoc-3.6.0-linux-x86_64.exe": error=11, Resource temporarily unavailable
	at com.google.protobuf.gradle.GenerateProtoTask.compileFiles(GenerateProtoTask.groovy:465)
	at com.google.protobuf.gradle.GenerateProtoTask.compile(GenerateProtoTask.groovy:456)
	at org.gradle.internal.reflect.JavaMethod.invoke(JavaMethod.java:73)
	... 46 more
Caused by: java.io.IOException: error=11, Resource temporarily unavailable
	... 49 more

==============================================================================

2: Task failed with an exception.
-----------
* What went wrong:
Execution failed for task ':beam-model-pipeline:generateProto'.
> unable to create new native thread

* Try:
Run with --debug option to get more log output. Run with --scan to get full insights.

* Exception is:
org.gradle.api.tasks.TaskExecutionException: Execution failed for task ':beam-model-pipeline:generateProto'.
	at org.gradle.api.internal.tasks.execution.ExecuteActionsTaskExecuter.executeActions(ExecuteActionsTaskExecuter.java:110)
	at org.gradle.api.internal.tasks.execution.ExecuteActionsTaskExecuter.execute(ExecuteActionsTaskExecuter.java:77)
	at org.gradle.api.internal.tasks.execution.OutputDirectoryCreatingTaskExecuter.execute(OutputDirectoryCreatingTaskExecuter.java:51)
	at org.gradle.api.internal.tasks.execution.SkipCachedTaskExecuter.execute(SkipCachedTaskExecuter.java:105)
	at org.gradle.api.internal.tasks.execution.SkipUpToDateTaskExecuter.execute(SkipUpToDateTaskExecuter.java:59)
	at org.gradle.api.internal.tasks.execution.ResolveTaskOutputCachingStateExecuter.execute(ResolveTaskOutputCachingStateExecuter.java:54)
	at org.gradle.api.internal.tasks.execution.ResolveBuildCacheKeyExecuter.execute(ResolveBuildCacheKeyExecuter.java:79)
	at org.gradle.api.internal.tasks.execution.ValidatingTaskExecuter.execute(ValidatingTaskExecuter.java:59)
	at org.gradle.api.internal.tasks.execution.SkipEmptySourceFilesTaskExecuter.execute(SkipEmptySourceFilesTaskExecuter.java:101)
	at org.gradle.api.internal.tasks.execution.FinalizeInputFilePropertiesTaskExecuter.execute(FinalizeInputFilePropertiesTaskExecuter.java:44)
	at org.gradle.api.internal.tasks.execution.CleanupStaleOutputsExecuter.execute(CleanupStaleOutputsExecuter.java:91)
	at org.gradle.api.internal.tasks.execution.ResolveTaskArtifactStateTaskExecuter.execute(ResolveTaskArtifactStateTaskExecuter.java:62)
	at org.gradle.api.internal.tasks.execution.SkipTaskWithNoActionsExecuter.execute(SkipTaskWithNoActionsExecuter.java:59)
	at org.gradle.api.internal.tasks.execution.SkipOnlyIfTaskExecuter.execute(SkipOnlyIfTaskExecuter.java:54)
	at org.gradle.api.internal.tasks.execution.ExecuteAtMostOnceTaskExecuter.execute(ExecuteAtMostOnceTaskExecuter.java:43)
	at org.gradle.api.internal.tasks.execution.CatchExceptionTaskExecuter.execute(CatchExceptionTaskExecuter.java:34)
	at org.gradle.api.internal.tasks.execution.EventFiringTaskExecuter$1.run(EventFiringTaskExecuter.java:51)
	at org.gradle.internal.operations.DefaultBuildOperationExecutor$RunnableBuildOperationWorker.execute(DefaultBuildOperationExecutor.java:300)
	at org.gradle.internal.operations.DefaultBuildOperationExecutor$RunnableBuildOperationWorker.execute(DefaultBuildOperationExecutor.java:292)
	at org.gradle.internal.operations.DefaultBuildOperationExecutor.execute(DefaultBuildOperationExecutor.java:174)
	at org.gradle.internal.operations.DefaultBuildOperationExecutor.run(DefaultBuildOperationExecutor.java:90)
	at org.gradle.internal.operations.DelegatingBuildOperationExecutor.run(DelegatingBuildOperationExecutor.java:31)
	at org.gradle.api.internal.tasks.execution.EventFiringTaskExecuter.execute(EventFiringTaskExecuter.java:46)
	at org.gradle.execution.taskgraph.LocalTaskInfoExecutor.execute(LocalTaskInfoExecutor.java:42)
	at org.gradle.execution.taskgraph.DefaultTaskExecutionGraph$BuildOperationAwareWorkItemExecutor.execute(DefaultTaskExecutionGraph.java:277)
	at org.gradle.execution.taskgraph.DefaultTaskExecutionGraph$BuildOperationAwareWorkItemExecutor.execute(DefaultTaskExecutionGraph.java:262)
	at org.gradle.execution.taskgraph.DefaultTaskPlanExecutor$ExecutorWorker$1.execute(DefaultTaskPlanExecutor.java:135)
	at org.gradle.execution.taskgraph.DefaultTaskPlanExecutor$ExecutorWorker$1.execute(DefaultTaskPlanExecutor.java:130)
	at org.gradle.execution.taskgraph.DefaultTaskPlanExecutor$ExecutorWorker.execute(DefaultTaskPlanExecutor.java:200)
	at org.gradle.execution.taskgraph.DefaultTaskPlanExecutor$ExecutorWorker.executeWithWork(DefaultTaskPlanExecutor.java:191)
	at org.gradle.execution.taskgraph.DefaultTaskPlanExecutor$ExecutorWorker.run(DefaultTaskPlanExecutor.java:130)
	at org.gradle.internal.concurrent.ExecutorPolicy$CatchAndRecordFailures.onExecute(ExecutorPolicy.java:63)
	at org.gradle.internal.concurrent.ManagedExecutorImpl$1.run(ManagedExecutorImpl.java:46)
	at java.util.concurrent.ThreadPoolExecutor.runWorker(ThreadPoolExecutor.java:1149)
	at java.util.concurrent.ThreadPoolExecutor$Worker.run(ThreadPoolExecutor.java:624)
	at org.gradle.internal.concurrent.ThreadFactoryImpl$ManagedThreadRunnable.run(ThreadFactoryImpl.java:55)
	at java.lang.Thread.run(Thread.java:748)
Caused by: java.lang.OutOfMemoryError: unable to create new native thread
	at java.lang.Thread.start0(Native Method)
	at java.lang.Thread.start(Thread.java:717)
	at org.codehaus.groovy.runtime.ProcessGroovyMethods.consumeProcessOutputStream(ProcessGroovyMethods.java:319)
	at org.codehaus.groovy.runtime.ProcessGroovyMethods.waitForProcessOutput(ProcessGroovyMethods.java:242)
	at org.codehaus.groovy.runtime.dgm$914.invoke(Unknown Source)
	at org.codehaus.groovy.runtime.callsite.PojoMetaMethodSite$PojoMetaMethodSiteNoUnwrapNoCoerce.invoke(PojoMetaMethodSite.java:274)
	at org.codehaus.groovy.runtime.callsite.PojoMetaMethodSite.call(PojoMetaMethodSite.java:56)
	at org.codehaus.groovy.runtime.callsite.CallSiteArray.defaultCall(CallSiteArray.java:47)
	at org.codehaus.groovy.runtime.callsite.AbstractCallSite.call(AbstractCallSite.java:116)
	at org.codehaus.groovy.runtime.callsite.AbstractCallSite.call(AbstractCallSite.java:136)
	at com.google.protobuf.gradle.GenerateProtoTask.compileFiles(GenerateProtoTask.groovy:466)
	at sun.reflect.NativeMethodAccessorImpl.invoke0(Native Method)
	at sun.reflect.NativeMethodAccessorImpl.invoke(NativeMethodAccessorImpl.java:62)
	at sun.reflect.DelegatingMethodAccessorImpl.invoke(DelegatingMethodAccessorImpl.java:43)
	at java.lang.reflect.Method.invoke(Method.java:498)
	at org.codehaus.groovy.runtime.callsite.PogoMetaMethodSite$PogoCachedMethodSiteNoUnwrapNoCoerce.invoke(PogoMetaMethodSite.java:210)
	at org.codehaus.groovy.runtime.callsite.PogoMetaMethodSite.callCurrent(PogoMetaMethodSite.java:59)
	at org.codehaus.groovy.runtime.callsite.CallSiteArray.defaultCallCurrent(CallSiteArray.java:51)
	at org.codehaus.groovy.runtime.callsite.AbstractCallSite.callCurrent(AbstractCallSite.java:157)
	at org.codehaus.groovy.runtime.callsite.AbstractCallSite.callCurrent(AbstractCallSite.java:169)
	at com.google.protobuf.gradle.GenerateProtoTask.compile(GenerateProtoTask.groovy:456)
	at sun.reflect.NativeMethodAccessorImpl.invoke0(Native Method)
	at sun.reflect.NativeMethodAccessorImpl.invoke(NativeMethodAccessorImpl.java:62)
	at sun.reflect.DelegatingMethodAccessorImpl.invoke(DelegatingMethodAccessorImpl.java:43)
	at java.lang.reflect.Method.invoke(Method.java:498)
	at org.gradle.internal.reflect.JavaMethod.invoke(JavaMethod.java:73)
	at org.gradle.api.internal.project.taskfactory.StandardTaskAction.doExecute(StandardTaskAction.java:46)
	at org.gradle.api.internal.project.taskfactory.StandardTaskAction.execute(StandardTaskAction.java:39)
	at org.gradle.api.internal.project.taskfactory.StandardTaskAction.execute(StandardTaskAction.java:26)
	at org.gradle.api.internal.AbstractTask$TaskActionWrapper.execute(AbstractTask.java:801)
	at org.gradle.api.internal.AbstractTask$TaskActionWrapper.execute(AbstractTask.java:768)
	at org.gradle.api.internal.tasks.execution.ExecuteActionsTaskExecuter$1.run(ExecuteActionsTaskExecuter.java:131)
	at org.gradle.internal.operations.DefaultBuildOperationExecutor$RunnableBuildOperationWorker.execute(DefaultBuildOperationExecutor.java:300)
	at org.gradle.internal.operations.DefaultBuildOperationExecutor$RunnableBuildOperationWorker.execute(DefaultBuildOperationExecutor.java:292)
	at org.gradle.internal.operations.DefaultBuildOperationExecutor.execute(DefaultBuildOperationExecutor.java:174)
	at org.gradle.internal.operations.DefaultBuildOperationExecutor.run(DefaultBuildOperationExecutor.java:90)
	at org.gradle.internal.operations.DelegatingBuildOperationExecutor.run(DelegatingBuildOperationExecutor.java:31)
	at org.gradle.api.internal.tasks.execution.ExecuteActionsTaskExecuter.executeAction(ExecuteActionsTaskExecuter.java:120)
	at org.gradle.api.internal.tasks.execution.ExecuteActionsTaskExecuter.executeActions(ExecuteActionsTaskExecuter.java:99)
	... 36 more

==============================================================================

* Get more help at https://help.gradle.org

BUILD FAILED in 17s

2018-12-10 12:48:50,604 98075e21 MainThread beam_integration_benchmark(1/1) ERROR    Error during benchmark beam_integration_benchmark
Traceback (most recent call last):
  File "<https://builds.apache.org/job/beam_PerformanceTests_ParquetIOIT/ws/PerfKitBenchmarker/perfkitbenchmarker/pkb.py",> line 719, in RunBenchmark
    DoRunPhase(spec, collector, detailed_timer)
  File "<https://builds.apache.org/job/beam_PerformanceTests_ParquetIOIT/ws/PerfKitBenchmarker/perfkitbenchmarker/pkb.py",> line 580, in DoRunPhase
    samples = spec.BenchmarkRun(spec)
  File "<https://builds.apache.org/job/beam_PerformanceTests_ParquetIOIT/ws/PerfKitBenchmarker/perfkitbenchmarker/linux_benchmarks/beam_integration_benchmark.py",> line 160, in Run
    job_type=job_type)
  File "<https://builds.apache.org/job/beam_PerformanceTests_ParquetIOIT/ws/PerfKitBenchmarker/perfkitbenchmarker/providers/gcp/gcp_dpb_dataflow.py",> line 90, in SubmitJob
    assert retcode == 0, "Integration Test Failed."
AssertionError: Integration Test Failed.
2018-12-10 12:48:50,605 98075e21 MainThread beam_integration_benchmark(1/1) INFO     Cleaning up benchmark beam_integration_benchmark
2018-12-10 12:48:50,607 98075e21 MainThread beam_integration_benchmark(1/1) ERROR    Exception running benchmark
Traceback (most recent call last):
  File "<https://builds.apache.org/job/beam_PerformanceTests_ParquetIOIT/ws/PerfKitBenchmarker/perfkitbenchmarker/pkb.py",> line 860, in RunBenchmarkTask
    RunBenchmark(spec, collector)
  File "<https://builds.apache.org/job/beam_PerformanceTests_ParquetIOIT/ws/PerfKitBenchmarker/perfkitbenchmarker/pkb.py",> line 719, in RunBenchmark
    DoRunPhase(spec, collector, detailed_timer)
  File "<https://builds.apache.org/job/beam_PerformanceTests_ParquetIOIT/ws/PerfKitBenchmarker/perfkitbenchmarker/pkb.py",> line 580, in DoRunPhase
    samples = spec.BenchmarkRun(spec)
  File "<https://builds.apache.org/job/beam_PerformanceTests_ParquetIOIT/ws/PerfKitBenchmarker/perfkitbenchmarker/linux_benchmarks/beam_integration_benchmark.py",> line 160, in Run
    job_type=job_type)
  File "<https://builds.apache.org/job/beam_PerformanceTests_ParquetIOIT/ws/PerfKitBenchmarker/perfkitbenchmarker/providers/gcp/gcp_dpb_dataflow.py",> line 90, in SubmitJob
    assert retcode == 0, "Integration Test Failed."
AssertionError: Integration Test Failed.
2018-12-10 12:48:50,607 98075e21 MainThread beam_integration_benchmark(1/1) ERROR    Benchmark 1/1 beam_integration_benchmark (UID: beam_integration_benchmark0) failed. Execution will continue.
2018-12-10 12:48:50,607 98075e21 MainThread beam_integration_benchmark(1/1) INFO     Benchmark run statuses:
---------------------------------------------------------------------------------
Name                        UID                          Status  Failed Substatus
---------------------------------------------------------------------------------
beam_integration_benchmark  beam_integration_benchmark0  FAILED                  
---------------------------------------------------------------------------------
Success rate: 0.00% (0/1)
2018-12-10 12:48:50,607 98075e21 MainThread beam_integration_benchmark(1/1) INFO     Complete logs can be found at: <https://builds.apache.org/job/beam_PerformanceTests_ParquetIOIT/ws/runs/98075e21/pkb.log>
2018-12-10 12:48:50,608 98075e21 MainThread beam_integration_benchmark(1/1) INFO     Completion statuses can be found at: <https://builds.apache.org/job/beam_PerformanceTests_ParquetIOIT/ws/runs/98075e21/completion_statuses.json>
Build step 'Execute shell' marked build as failure

---------------------------------------------------------------------
To unsubscribe, e-mail: builds-unsubscribe@beam.apache.org
For additional commands, e-mail: builds-help@beam.apache.org