You are viewing a plain text version of this content. The canonical link for it is here.
Posted to dev@zookeeper.apache.org by Apache Jenkins Server <je...@builds.apache.org> on 2013/11/18 12:06:21 UTC
ZooKeeper-trunk - Build # 2123 - Failure
See https://builds.apache.org/job/ZooKeeper-trunk/2123/
###################################################################################
########################## LAST 60 LINES OF THE CONSOLE ###########################
[...truncated 241354 lines...]
[junit] 2013-11-18 11:02:12,354 [myid:] - INFO [ProcessThread(sid:0 cport:-1)::PrepRequestProcessor@156] - PrepRequestProcessor exited loop!
[junit] 2013-11-18 11:02:12,354 [myid:] - INFO [SyncThread:0:SyncRequestProcessor@168] - SyncRequestProcessor exited!
[junit] 2013-11-18 11:02:12,355 [myid:] - INFO [main:FinalRequestProcessor@442] - shutdown of request processor complete
[junit] 2013-11-18 11:02:12,355 [myid:] - INFO [main:FourLetterWordMain@43] - connecting to 127.0.0.1 11221
[junit] 2013-11-18 11:02:12,356 [myid:] - INFO [main:JMXEnv@133] - ensureOnly:[]
[junit] 2013-11-18 11:02:12,357 [myid:] - INFO [main:ClientBase@414] - STARTING server
[junit] 2013-11-18 11:02:12,357 [myid:] - INFO [main:ZooKeeperServer@149] - Created server with tickTime 3000 minSessionTimeout 6000 maxSessionTimeout 60000 datadir /home/jenkins/jenkins-slave/workspace/ZooKeeper-trunk/trunk/build/test/tmp/test3358269508012417832.junit.dir/version-2 snapdir /home/jenkins/jenkins-slave/workspace/ZooKeeper-trunk/trunk/build/test/tmp/test3358269508012417832.junit.dir/version-2
[junit] 2013-11-18 11:02:12,358 [myid:] - INFO [main:NIOServerCnxnFactory@670] - Configuring NIO connection handler with 10s sessionless connection timeout, 2 selector thread(s), 16 worker threads, and 64 kB direct buffers.
[junit] 2013-11-18 11:02:12,358 [myid:] - INFO [main:NIOServerCnxnFactory@683] - binding to port 0.0.0.0/0.0.0.0:11221
[junit] 2013-11-18 11:02:12,359 [myid:] - INFO [main:FileSnap@83] - Reading snapshot /home/jenkins/jenkins-slave/workspace/ZooKeeper-trunk/trunk/build/test/tmp/test3358269508012417832.junit.dir/version-2/snapshot.b
[junit] 2013-11-18 11:02:12,362 [myid:] - INFO [main:FileTxnSnapLog@297] - Snapshotting: 0xb to /home/jenkins/jenkins-slave/workspace/ZooKeeper-trunk/trunk/build/test/tmp/test3358269508012417832.junit.dir/version-2/snapshot.b
[junit] 2013-11-18 11:02:12,364 [myid:] - INFO [main:FourLetterWordMain@43] - connecting to 127.0.0.1 11221
[junit] 2013-11-18 11:02:12,364 [myid:] - INFO [NIOServerCxnFactory.AcceptThread:0.0.0.0/0.0.0.0:11221:NIOServerCnxnFactory$AcceptThread@296] - Accepted socket connection from /127.0.0.1:51005
[junit] 2013-11-18 11:02:12,365 [myid:] - INFO [NIOWorkerThread-1:NIOServerCnxn@828] - Processing stat command from /127.0.0.1:51005
[junit] 2013-11-18 11:02:12,365 [myid:] - INFO [NIOWorkerThread-1:NIOServerCnxn$StatCommand@677] - Stat command output
[junit] 2013-11-18 11:02:12,365 [myid:] - INFO [NIOWorkerThread-1:NIOServerCnxn@999] - Closed socket connection for client /127.0.0.1:51005 (no session established for client)
[junit] 2013-11-18 11:02:12,366 [myid:] - INFO [main:JMXEnv@133] - ensureOnly:[InMemoryDataTree, StandaloneServer_port]
[junit] 2013-11-18 11:02:12,367 [myid:] - INFO [main:JMXEnv@105] - expect:InMemoryDataTree
[junit] 2013-11-18 11:02:12,367 [myid:] - INFO [main:JMXEnv@108] - found:InMemoryDataTree org.apache.ZooKeeperService:name0=StandaloneServer_port-1,name1=InMemoryDataTree
[junit] 2013-11-18 11:02:12,367 [myid:] - INFO [main:JMXEnv@105] - expect:StandaloneServer_port
[junit] 2013-11-18 11:02:12,367 [myid:] - INFO [main:JMXEnv@108] - found:StandaloneServer_port org.apache.ZooKeeperService:name0=StandaloneServer_port-1
[junit] 2013-11-18 11:02:12,368 [myid:] - INFO [main:JUnit4ZKTestRunner$LoggedInvokeMethod@57] - FINISHED TEST METHOD testQuota
[junit] 2013-11-18 11:02:12,368 [myid:] - INFO [main:ClientBase@451] - tearDown starting
[junit] 2013-11-18 11:02:12,434 [myid:] - INFO [main:ZooKeeper@777] - Session: 0x1426adff7770000 closed
[junit] 2013-11-18 11:02:12,434 [myid:] - INFO [main-EventThread:ClientCnxn$EventThread@513] - EventThread shut down
[junit] 2013-11-18 11:02:12,434 [myid:] - INFO [main:ClientBase@421] - STOPPING server
[junit] 2013-11-18 11:02:12,434 [myid:] - INFO [ConnnectionExpirer:NIOServerCnxnFactory$ConnectionExpirerThread@583] - ConnnectionExpirerThread interrupted
[junit] 2013-11-18 11:02:12,435 [myid:] - INFO [NIOServerCxnFactory.SelectorThread-1:NIOServerCnxnFactory$SelectorThread@420] - selector thread exitted run method
[junit] 2013-11-18 11:02:12,434 [myid:] - INFO [NIOServerCxnFactory.SelectorThread-0:NIOServerCnxnFactory$SelectorThread@420] - selector thread exitted run method
[junit] 2013-11-18 11:02:12,434 [myid:] - INFO [NIOServerCxnFactory.AcceptThread:0.0.0.0/0.0.0.0:11221:NIOServerCnxnFactory$AcceptThread@219] - accept thread exitted run method
[junit] 2013-11-18 11:02:12,435 [myid:] - INFO [main:ZooKeeperServer@428] - shutting down
[junit] 2013-11-18 11:02:12,435 [myid:] - INFO [main:SessionTrackerImpl@183] - Shutting down
[junit] 2013-11-18 11:02:12,435 [myid:] - INFO [main:PrepRequestProcessor@972] - Shutting down
[junit] 2013-11-18 11:02:12,436 [myid:] - INFO [main:SyncRequestProcessor@190] - Shutting down
[junit] 2013-11-18 11:02:12,436 [myid:] - INFO [ProcessThread(sid:0 cport:-1)::PrepRequestProcessor@156] - PrepRequestProcessor exited loop!
[junit] 2013-11-18 11:02:12,436 [myid:] - INFO [SyncThread:0:SyncRequestProcessor@168] - SyncRequestProcessor exited!
[junit] 2013-11-18 11:02:12,436 [myid:] - INFO [main:FinalRequestProcessor@442] - shutdown of request processor complete
[junit] 2013-11-18 11:02:12,437 [myid:] - INFO [main:FourLetterWordMain@43] - connecting to 127.0.0.1 11221
[junit] 2013-11-18 11:02:12,437 [myid:] - INFO [main:JMXEnv@133] - ensureOnly:[]
[junit] 2013-11-18 11:02:12,440 [myid:] - INFO [main:ClientBase@476] - fdcount after test is: 41 at start it was 28
[junit] 2013-11-18 11:02:12,441 [myid:] - INFO [main:ClientBase@478] - sleeping for 20 secs
[junit] 2013-11-18 11:02:12,442 [myid:] - INFO [main:ZKTestCase$1@61] - SUCCEEDED testQuota
[junit] 2013-11-18 11:02:12,442 [myid:] - INFO [main:ZKTestCase$1@56] - FINISHED testQuota
[junit] Tests run: 1, Failures: 0, Errors: 0, Time elapsed: 0.712 sec
BUILD FAILED
/home/jenkins/jenkins-slave/workspace/ZooKeeper-trunk/trunk/build.xml:1353: The following error occurred while executing this line:
/home/jenkins/jenkins-slave/workspace/ZooKeeper-trunk/trunk/build.xml:1264: Tests failed!
Total time: 28 minutes 47 seconds
Build step 'Execute shell' marked build as failure
[FINDBUGS] Skipping publisher since build result is FAILURE
[WARNINGS] Skipping publisher since build result is FAILURE
Archiving artifacts
Recording fingerprints
Recording test results
Publishing Javadoc
Email was triggered for: Failure
Sending email for trigger: Failure
###################################################################################
############################## FAILED TESTS (if any) ##############################
1 tests failed.
REGRESSION: org.apache.zookeeper.test.FLEZeroWeightTest.testZeroWeightQuorum
Error Message:
Threads didn't join
Stack Trace:
junit.framework.AssertionFailedError: Threads didn't join
at org.apache.zookeeper.test.FLEZeroWeightTest.testZeroWeightQuorum(FLEZeroWeightTest.java:169)
at org.apache.zookeeper.JUnit4ZKTestRunner$LoggedInvokeMethod.evaluate(JUnit4ZKTestRunner.java:52)