You are viewing a plain text version of this content. The canonical link for it is here.
Posted to dev@zookeeper.apache.org by Apache Jenkins Server <je...@builds.apache.org> on 2015/02/25 12:12:03 UTC
ZooKeeper_branch35_jdk7 - Build # 214 - Still Failing
See https://builds.apache.org/job/ZooKeeper_branch35_jdk7/214/
###################################################################################
########################## LAST 60 LINES OF THE CONSOLE ###########################
[...truncated 349889 lines...]
[junit] 2015-02-25 11:11:56,721 [myid:] - INFO [main:JMXEnv@142] - ensureOnly:[]
[junit] 2015-02-25 11:11:56,722 [myid:] - INFO [main:ClientBase@444] - STARTING server
[junit] 2015-02-25 11:11:56,722 [myid:] - INFO [main:ClientBase@365] - CREATING server instance 127.0.0.1:11221
[junit] 2015-02-25 11:11:56,723 [myid:] - INFO [main:NIOServerCnxnFactory@670] - Configuring NIO connection handler with 10s sessionless connection timeout, 2 selector thread(s), 32 worker threads, and 64 kB direct buffers.
[junit] 2015-02-25 11:11:56,723 [myid:] - INFO [main:NIOServerCnxnFactory@683] - binding to port 0.0.0.0/0.0.0.0:11221
[junit] 2015-02-25 11:11:56,723 [myid:] - INFO [main:ClientBase@340] - STARTING server instance 127.0.0.1:11221
[junit] 2015-02-25 11:11:56,723 [myid:] - INFO [main:ZooKeeperServer@778] - minSessionTimeout set to 6000
[junit] 2015-02-25 11:11:56,724 [myid:] - INFO [main:ZooKeeperServer@787] - maxSessionTimeout set to 60000
[junit] 2015-02-25 11:11:56,724 [myid:] - INFO [main:ZooKeeperServer@153] - Created server with tickTime 3000 minSessionTimeout 6000 maxSessionTimeout 60000 datadir /home/jenkins/jenkins-slave/workspace/ZooKeeper_branch35_jdk7/branch-3.5/build/test/tmp/test5600076861367233995.junit.dir/version-2 snapdir /home/jenkins/jenkins-slave/workspace/ZooKeeper_branch35_jdk7/branch-3.5/build/test/tmp/test5600076861367233995.junit.dir/version-2
[junit] 2015-02-25 11:11:56,725 [myid:] - INFO [main:FileSnap@83] - Reading snapshot /home/jenkins/jenkins-slave/workspace/ZooKeeper_branch35_jdk7/branch-3.5/build/test/tmp/test5600076861367233995.junit.dir/version-2/snapshot.b
[junit] 2015-02-25 11:11:56,728 [myid:] - INFO [main:FileTxnSnapLog@298] - Snapshotting: 0xb to /home/jenkins/jenkins-slave/workspace/ZooKeeper_branch35_jdk7/branch-3.5/build/test/tmp/test5600076861367233995.junit.dir/version-2/snapshot.b
[junit] 2015-02-25 11:11:56,730 [myid:] - INFO [main:FourLetterWordMain@43] - connecting to 127.0.0.1 11221
[junit] 2015-02-25 11:11:56,731 [myid:] - INFO [NIOServerCxnFactory.AcceptThread:0.0.0.0/0.0.0.0:11221:NIOServerCnxnFactory$AcceptThread@296] - Accepted socket connection from /127.0.0.1:58585
[junit] 2015-02-25 11:11:56,732 [myid:] - INFO [NIOWorkerThread-1:NIOServerCnxn@835] - Processing stat command from /127.0.0.1:58585
[junit] 2015-02-25 11:11:56,732 [myid:] - INFO [NIOWorkerThread-1:NIOServerCnxn$StatCommand@684] - Stat command output
[junit] 2015-02-25 11:11:56,732 [myid:] - INFO [NIOWorkerThread-1:NIOServerCnxn@1006] - Closed socket connection for client /127.0.0.1:58585 (no session established for client)
[junit] 2015-02-25 11:11:56,733 [myid:] - INFO [main:JMXEnv@224] - ensureParent:[InMemoryDataTree, StandaloneServer_port]
[junit] 2015-02-25 11:11:56,735 [myid:] - INFO [main:JMXEnv@241] - expect:InMemoryDataTree
[junit] 2015-02-25 11:11:56,735 [myid:] - INFO [main:JMXEnv@245] - found:InMemoryDataTree org.apache.ZooKeeperService:name0=StandaloneServer_port11221,name1=InMemoryDataTree
[junit] 2015-02-25 11:11:56,735 [myid:] - INFO [main:JMXEnv@241] - expect:StandaloneServer_port
[junit] 2015-02-25 11:11:56,735 [myid:] - INFO [main:JMXEnv@245] - found:StandaloneServer_port org.apache.ZooKeeperService:name0=StandaloneServer_port11221
[junit] 2015-02-25 11:11:56,736 [myid:] - INFO [main:JUnit4ZKTestRunner$LoggedInvokeMethod@55] - Memory used 18060
[junit] 2015-02-25 11:11:56,736 [myid:] - INFO [main:JUnit4ZKTestRunner$LoggedInvokeMethod@60] - Number of threads 24
[junit] 2015-02-25 11:11:56,736 [myid:] - INFO [main:JUnit4ZKTestRunner$LoggedInvokeMethod@65] - FINISHED TEST METHOD testQuota
[junit] 2015-02-25 11:11:56,736 [myid:] - INFO [main:ClientBase@521] - tearDown starting
[junit] 2015-02-25 11:11:56,803 [myid:] - INFO [main-EventThread:ClientCnxn$EventThread@531] - EventThread shut down
[junit] 2015-02-25 11:11:56,803 [myid:] - INFO [main:ZooKeeper@968] - Session: 0x100d55a3bbd0000 closed
[junit] 2015-02-25 11:11:56,803 [myid:] - INFO [main:ClientBase@491] - STOPPING server
[junit] 2015-02-25 11:11:56,804 [myid:] - INFO [ConnnectionExpirer:NIOServerCnxnFactory$ConnectionExpirerThread@583] - ConnnectionExpirerThread interrupted
[junit] 2015-02-25 11:11:56,804 [myid:] - INFO [NIOServerCxnFactory.SelectorThread-1:NIOServerCnxnFactory$SelectorThread@420] - selector thread exitted run method
[junit] 2015-02-25 11:11:56,804 [myid:] - INFO [NIOServerCxnFactory.AcceptThread:0.0.0.0/0.0.0.0:11221:NIOServerCnxnFactory$AcceptThread@219] - accept thread exitted run method
[junit] 2015-02-25 11:11:56,804 [myid:] - INFO [NIOServerCxnFactory.SelectorThread-0:NIOServerCnxnFactory$SelectorThread@420] - selector thread exitted run method
[junit] 2015-02-25 11:11:56,805 [myid:] - INFO [main:ZooKeeperServer@440] - shutting down
[junit] 2015-02-25 11:11:56,805 [myid:] - INFO [main:SessionTrackerImpl@232] - Shutting down
[junit] 2015-02-25 11:11:56,805 [myid:] - INFO [main:PrepRequestProcessor@974] - Shutting down
[junit] 2015-02-25 11:11:56,805 [myid:] - INFO [main:SyncRequestProcessor@191] - Shutting down
[junit] 2015-02-25 11:11:56,805 [myid:] - INFO [ProcessThread(sid:0 cport:11221)::PrepRequestProcessor@156] - PrepRequestProcessor exited loop!
[junit] 2015-02-25 11:11:56,805 [myid:] - INFO [SyncThread:0:SyncRequestProcessor@169] - SyncRequestProcessor exited!
[junit] 2015-02-25 11:11:56,806 [myid:] - INFO [main:FinalRequestProcessor@477] - shutdown of request processor complete
[junit] 2015-02-25 11:11:56,806 [myid:] - INFO [main:MBeanRegistry@119] - Unregister MBean [org.apache.ZooKeeperService:name0=StandaloneServer_port11221,name1=InMemoryDataTree]
[junit] 2015-02-25 11:11:56,807 [myid:] - INFO [main:MBeanRegistry@119] - Unregister MBean [org.apache.ZooKeeperService:name0=StandaloneServer_port11221]
[junit] 2015-02-25 11:11:56,807 [myid:] - INFO [main:FourLetterWordMain@43] - connecting to 127.0.0.1 11221
[junit] 2015-02-25 11:11:56,807 [myid:] - INFO [main:JMXEnv@142] - ensureOnly:[]
[junit] 2015-02-25 11:11:56,816 [myid:] - INFO [main:ClientBase@546] - fdcount after test is: 47 at start it was 33
[junit] 2015-02-25 11:11:56,816 [myid:] - INFO [main:ClientBase@548] - sleeping for 20 secs
[junit] 2015-02-25 11:11:56,818 [myid:] - INFO [main:ZKTestCase$1@65] - SUCCEEDED testQuota
[junit] 2015-02-25 11:11:56,818 [myid:] - INFO [main:ZKTestCase$1@60] - FINISHED testQuota
[junit] Tests run: 1, Failures: 0, Errors: 0, Skipped: 0, Time elapsed: 0.557 sec
BUILD FAILED
/home/jenkins/jenkins-slave/workspace/ZooKeeper_branch35_jdk7/branch-3.5/build.xml:1422: The following error occurred while executing this line:
/home/jenkins/jenkins-slave/workspace/ZooKeeper_branch35_jdk7/branch-3.5/build.xml:1333: Tests failed!
Total time: 43 minutes 37 seconds
Build step 'Invoke Ant' marked build as failure
Archiving artifacts
Recording test results
Email was triggered for: Failure
Sending email for trigger: Failure
###################################################################################
############################## FAILED TESTS (if any) ##############################
1 tests failed.
FAILED: org.apache.zookeeper.test.AsyncHammerTest.testHammer
Error Message:
null
Stack Trace:
junit.framework.AssertionFailedError
at org.apache.zookeeper.test.AsyncHammerTest.testHammer(AsyncHammerTest.java:186)
at org.apache.zookeeper.JUnit4ZKTestRunner$LoggedInvokeMethod.evaluate(JUnit4ZKTestRunner.java:52)
ZooKeeper_branch35_jdk7 - Build # 219 - Still Failing
Posted by Apache Jenkins Server <je...@builds.apache.org>.
See https://builds.apache.org/job/ZooKeeper_branch35_jdk7/219/
###################################################################################
########################## LAST 60 LINES OF THE CONSOLE ###########################
[...truncated 349723 lines...]
[junit] 2015-03-02 11:36:32,906 [myid:] - INFO [main:JMXEnv@142] - ensureOnly:[]
[junit] 2015-03-02 11:36:32,908 [myid:] - INFO [main:ClientBase@444] - STARTING server
[junit] 2015-03-02 11:36:32,908 [myid:] - INFO [main:ClientBase@365] - CREATING server instance 127.0.0.1:11221
[junit] 2015-03-02 11:36:32,908 [myid:] - INFO [main:NIOServerCnxnFactory@670] - Configuring NIO connection handler with 10s sessionless connection timeout, 2 selector thread(s), 32 worker threads, and 64 kB direct buffers.
[junit] 2015-03-02 11:36:32,909 [myid:] - INFO [main:NIOServerCnxnFactory@683] - binding to port 0.0.0.0/0.0.0.0:11221
[junit] 2015-03-02 11:36:32,909 [myid:] - INFO [main:ClientBase@340] - STARTING server instance 127.0.0.1:11221
[junit] 2015-03-02 11:36:32,909 [myid:] - INFO [main:ZooKeeperServer@778] - minSessionTimeout set to 6000
[junit] 2015-03-02 11:36:32,909 [myid:] - INFO [main:ZooKeeperServer@787] - maxSessionTimeout set to 60000
[junit] 2015-03-02 11:36:32,910 [myid:] - INFO [main:ZooKeeperServer@153] - Created server with tickTime 3000 minSessionTimeout 6000 maxSessionTimeout 60000 datadir /home/jenkins/jenkins-slave/workspace/ZooKeeper_branch35_jdk7/branch-3.5/build/test/tmp/test6298281802717248488.junit.dir/version-2 snapdir /home/jenkins/jenkins-slave/workspace/ZooKeeper_branch35_jdk7/branch-3.5/build/test/tmp/test6298281802717248488.junit.dir/version-2
[junit] 2015-03-02 11:36:32,911 [myid:] - INFO [main:FileSnap@83] - Reading snapshot /home/jenkins/jenkins-slave/workspace/ZooKeeper_branch35_jdk7/branch-3.5/build/test/tmp/test6298281802717248488.junit.dir/version-2/snapshot.b
[junit] 2015-03-02 11:36:32,913 [myid:] - INFO [main:FileTxnSnapLog@298] - Snapshotting: 0xb to /home/jenkins/jenkins-slave/workspace/ZooKeeper_branch35_jdk7/branch-3.5/build/test/tmp/test6298281802717248488.junit.dir/version-2/snapshot.b
[junit] 2015-03-02 11:36:32,915 [myid:] - INFO [main:FourLetterWordMain@43] - connecting to 127.0.0.1 11221
[junit] 2015-03-02 11:36:32,916 [myid:] - INFO [NIOServerCxnFactory.AcceptThread:0.0.0.0/0.0.0.0:11221:NIOServerCnxnFactory$AcceptThread@296] - Accepted socket connection from /127.0.0.1:54429
[junit] 2015-03-02 11:36:32,917 [myid:] - INFO [NIOWorkerThread-1:NIOServerCnxn@835] - Processing stat command from /127.0.0.1:54429
[junit] 2015-03-02 11:36:32,917 [myid:] - INFO [NIOWorkerThread-1:NIOServerCnxn$StatCommand@684] - Stat command output
[junit] 2015-03-02 11:36:32,917 [myid:] - INFO [NIOWorkerThread-1:NIOServerCnxn@1006] - Closed socket connection for client /127.0.0.1:54429 (no session established for client)
[junit] 2015-03-02 11:36:32,918 [myid:] - INFO [main:JMXEnv@224] - ensureParent:[InMemoryDataTree, StandaloneServer_port]
[junit] 2015-03-02 11:36:32,920 [myid:] - INFO [main:JMXEnv@241] - expect:InMemoryDataTree
[junit] 2015-03-02 11:36:32,920 [myid:] - INFO [main:JMXEnv@245] - found:InMemoryDataTree org.apache.ZooKeeperService:name0=StandaloneServer_port11221,name1=InMemoryDataTree
[junit] 2015-03-02 11:36:32,920 [myid:] - INFO [main:JMXEnv@241] - expect:StandaloneServer_port
[junit] 2015-03-02 11:36:32,920 [myid:] - INFO [main:JMXEnv@245] - found:StandaloneServer_port org.apache.ZooKeeperService:name0=StandaloneServer_port11221
[junit] 2015-03-02 11:36:32,921 [myid:] - INFO [main:JUnit4ZKTestRunner$LoggedInvokeMethod@55] - Memory used 18105
[junit] 2015-03-02 11:36:32,921 [myid:] - INFO [main:JUnit4ZKTestRunner$LoggedInvokeMethod@60] - Number of threads 24
[junit] 2015-03-02 11:36:32,921 [myid:] - INFO [main:JUnit4ZKTestRunner$LoggedInvokeMethod@65] - FINISHED TEST METHOD testQuota
[junit] 2015-03-02 11:36:32,921 [myid:] - INFO [main:ClientBase@521] - tearDown starting
[junit] 2015-03-02 11:36:32,984 [myid:] - INFO [main:ZooKeeper@968] - Session: 0x103029c20230000 closed
[junit] 2015-03-02 11:36:32,984 [myid:] - INFO [main:ClientBase@491] - STOPPING server
[junit] 2015-03-02 11:36:32,984 [myid:] - INFO [main-EventThread:ClientCnxn$EventThread@531] - EventThread shut down
[junit] 2015-03-02 11:36:32,985 [myid:] - INFO [ConnnectionExpirer:NIOServerCnxnFactory$ConnectionExpirerThread@583] - ConnnectionExpirerThread interrupted
[junit] 2015-03-02 11:36:32,985 [myid:] - INFO [NIOServerCxnFactory.SelectorThread-1:NIOServerCnxnFactory$SelectorThread@420] - selector thread exitted run method
[junit] 2015-03-02 11:36:32,985 [myid:] - INFO [NIOServerCxnFactory.AcceptThread:0.0.0.0/0.0.0.0:11221:NIOServerCnxnFactory$AcceptThread@219] - accept thread exitted run method
[junit] 2015-03-02 11:36:32,985 [myid:] - INFO [NIOServerCxnFactory.SelectorThread-0:NIOServerCnxnFactory$SelectorThread@420] - selector thread exitted run method
[junit] 2015-03-02 11:36:32,986 [myid:] - INFO [main:ZooKeeperServer@440] - shutting down
[junit] 2015-03-02 11:36:32,986 [myid:] - INFO [main:SessionTrackerImpl@232] - Shutting down
[junit] 2015-03-02 11:36:32,986 [myid:] - INFO [main:PrepRequestProcessor@974] - Shutting down
[junit] 2015-03-02 11:36:32,986 [myid:] - INFO [main:SyncRequestProcessor@191] - Shutting down
[junit] 2015-03-02 11:36:32,986 [myid:] - INFO [ProcessThread(sid:0 cport:11221)::PrepRequestProcessor@156] - PrepRequestProcessor exited loop!
[junit] 2015-03-02 11:36:32,987 [myid:] - INFO [SyncThread:0:SyncRequestProcessor@169] - SyncRequestProcessor exited!
[junit] 2015-03-02 11:36:32,987 [myid:] - INFO [main:FinalRequestProcessor@477] - shutdown of request processor complete
[junit] 2015-03-02 11:36:32,987 [myid:] - INFO [main:MBeanRegistry@119] - Unregister MBean [org.apache.ZooKeeperService:name0=StandaloneServer_port11221,name1=InMemoryDataTree]
[junit] 2015-03-02 11:36:32,988 [myid:] - INFO [main:MBeanRegistry@119] - Unregister MBean [org.apache.ZooKeeperService:name0=StandaloneServer_port11221]
[junit] 2015-03-02 11:36:32,988 [myid:] - INFO [main:FourLetterWordMain@43] - connecting to 127.0.0.1 11221
[junit] 2015-03-02 11:36:32,989 [myid:] - INFO [main:JMXEnv@142] - ensureOnly:[]
[junit] 2015-03-02 11:36:32,998 [myid:] - INFO [main:ClientBase@546] - fdcount after test is: 47 at start it was 33
[junit] 2015-03-02 11:36:32,999 [myid:] - INFO [main:ClientBase@548] - sleeping for 20 secs
[junit] 2015-03-02 11:36:33,000 [myid:] - INFO [main:ZKTestCase$1@65] - SUCCEEDED testQuota
[junit] 2015-03-02 11:36:33,000 [myid:] - INFO [main:ZKTestCase$1@60] - FINISHED testQuota
[junit] Tests run: 1, Failures: 0, Errors: 0, Skipped: 0, Time elapsed: 0.581 sec
BUILD FAILED
/home/jenkins/jenkins-slave/workspace/ZooKeeper_branch35_jdk7/branch-3.5/build.xml:1422: The following error occurred while executing this line:
/home/jenkins/jenkins-slave/workspace/ZooKeeper_branch35_jdk7/branch-3.5/build.xml:1333: Tests failed!
Total time: 44 minutes 1 second
Build step 'Invoke Ant' marked build as failure
Archiving artifacts
Recording test results
Email was triggered for: Failure
Sending email for trigger: Failure
###################################################################################
############################## FAILED TESTS (if any) ##############################
1 tests failed.
FAILED: org.apache.zookeeper.test.ReconfigTest.testPortChange
Error Message:
expected:<test[1]> but was:<test[0]>
Stack Trace:
junit.framework.AssertionFailedError: expected:<test[1]> but was:<test[0]>
at org.apache.zookeeper.test.ReconfigTest.testNormalOperation(ReconfigTest.java:151)
at org.apache.zookeeper.test.ReconfigTest.testPortChange(ReconfigTest.java:600)
at org.apache.zookeeper.JUnit4ZKTestRunner$LoggedInvokeMethod.evaluate(JUnit4ZKTestRunner.java:52)
ZooKeeper_branch35_jdk7 - Build # 218 - Still Failing
Posted by Apache Jenkins Server <je...@builds.apache.org>.
See https://builds.apache.org/job/ZooKeeper_branch35_jdk7/218/
###################################################################################
########################## LAST 60 LINES OF THE CONSOLE ###########################
[...truncated 345988 lines...]
[junit] 2015-03-01 10:56:22,665 [myid:] - INFO [main:JMXEnv@142] - ensureOnly:[]
[junit] 2015-03-01 10:56:22,667 [myid:] - INFO [main:ClientBase@444] - STARTING server
[junit] 2015-03-01 10:56:22,667 [myid:] - INFO [main:ClientBase@365] - CREATING server instance 127.0.0.1:11221
[junit] 2015-03-01 10:56:22,667 [myid:] - INFO [main:NIOServerCnxnFactory@670] - Configuring NIO connection handler with 10s sessionless connection timeout, 2 selector thread(s), 32 worker threads, and 64 kB direct buffers.
[junit] 2015-03-01 10:56:22,668 [myid:] - INFO [main:NIOServerCnxnFactory@683] - binding to port 0.0.0.0/0.0.0.0:11221
[junit] 2015-03-01 10:56:22,668 [myid:] - INFO [main:ClientBase@340] - STARTING server instance 127.0.0.1:11221
[junit] 2015-03-01 10:56:22,668 [myid:] - INFO [main:ZooKeeperServer@778] - minSessionTimeout set to 6000
[junit] 2015-03-01 10:56:22,669 [myid:] - INFO [main:ZooKeeperServer@787] - maxSessionTimeout set to 60000
[junit] 2015-03-01 10:56:22,669 [myid:] - INFO [main:ZooKeeperServer@153] - Created server with tickTime 3000 minSessionTimeout 6000 maxSessionTimeout 60000 datadir /home/jenkins/jenkins-slave/workspace/ZooKeeper_branch35_jdk7/branch-3.5/build/test/tmp/test7412488359009052536.junit.dir/version-2 snapdir /home/jenkins/jenkins-slave/workspace/ZooKeeper_branch35_jdk7/branch-3.5/build/test/tmp/test7412488359009052536.junit.dir/version-2
[junit] 2015-03-01 10:56:22,670 [myid:] - INFO [main:FileSnap@83] - Reading snapshot /home/jenkins/jenkins-slave/workspace/ZooKeeper_branch35_jdk7/branch-3.5/build/test/tmp/test7412488359009052536.junit.dir/version-2/snapshot.b
[junit] 2015-03-01 10:56:22,673 [myid:] - INFO [main:FileTxnSnapLog@298] - Snapshotting: 0xb to /home/jenkins/jenkins-slave/workspace/ZooKeeper_branch35_jdk7/branch-3.5/build/test/tmp/test7412488359009052536.junit.dir/version-2/snapshot.b
[junit] 2015-03-01 10:56:22,675 [myid:] - INFO [main:FourLetterWordMain@43] - connecting to 127.0.0.1 11221
[junit] 2015-03-01 10:56:22,675 [myid:] - INFO [NIOServerCxnFactory.AcceptThread:0.0.0.0/0.0.0.0:11221:NIOServerCnxnFactory$AcceptThread@296] - Accepted socket connection from /127.0.0.1:45842
[junit] 2015-03-01 10:56:22,676 [myid:] - INFO [NIOWorkerThread-1:NIOServerCnxn@835] - Processing stat command from /127.0.0.1:45842
[junit] 2015-03-01 10:56:22,677 [myid:] - INFO [NIOWorkerThread-1:NIOServerCnxn$StatCommand@684] - Stat command output
[junit] 2015-03-01 10:56:22,677 [myid:] - INFO [NIOWorkerThread-1:NIOServerCnxn@1006] - Closed socket connection for client /127.0.0.1:45842 (no session established for client)
[junit] 2015-03-01 10:56:22,677 [myid:] - INFO [main:JMXEnv@224] - ensureParent:[InMemoryDataTree, StandaloneServer_port]
[junit] 2015-03-01 10:56:22,680 [myid:] - INFO [main:JMXEnv@241] - expect:InMemoryDataTree
[junit] 2015-03-01 10:56:22,680 [myid:] - INFO [main:JMXEnv@245] - found:InMemoryDataTree org.apache.ZooKeeperService:name0=StandaloneServer_port11221,name1=InMemoryDataTree
[junit] 2015-03-01 10:56:22,680 [myid:] - INFO [main:JMXEnv@241] - expect:StandaloneServer_port
[junit] 2015-03-01 10:56:22,680 [myid:] - INFO [main:JMXEnv@245] - found:StandaloneServer_port org.apache.ZooKeeperService:name0=StandaloneServer_port11221
[junit] 2015-03-01 10:56:22,681 [myid:] - INFO [main:JUnit4ZKTestRunner$LoggedInvokeMethod@55] - Memory used 18103
[junit] 2015-03-01 10:56:22,682 [myid:] - INFO [main:JUnit4ZKTestRunner$LoggedInvokeMethod@60] - Number of threads 24
[junit] 2015-03-01 10:56:22,682 [myid:] - INFO [main:JUnit4ZKTestRunner$LoggedInvokeMethod@65] - FINISHED TEST METHOD testQuota
[junit] 2015-03-01 10:56:22,683 [myid:] - INFO [main:ClientBase@521] - tearDown starting
[junit] 2015-03-01 10:56:22,747 [myid:] - INFO [main:ZooKeeper@968] - Session: 0x102fd50fd230000 closed
[junit] 2015-03-01 10:56:22,748 [myid:] - INFO [main:ClientBase@491] - STOPPING server
[junit] 2015-03-01 10:56:22,747 [myid:] - INFO [main-EventThread:ClientCnxn$EventThread@531] - EventThread shut down
[junit] 2015-03-01 10:56:22,748 [myid:] - INFO [ConnnectionExpirer:NIOServerCnxnFactory$ConnectionExpirerThread@583] - ConnnectionExpirerThread interrupted
[junit] 2015-03-01 10:56:22,748 [myid:] - INFO [NIOServerCxnFactory.SelectorThread-0:NIOServerCnxnFactory$SelectorThread@420] - selector thread exitted run method
[junit] 2015-03-01 10:56:22,748 [myid:] - INFO [NIOServerCxnFactory.SelectorThread-1:NIOServerCnxnFactory$SelectorThread@420] - selector thread exitted run method
[junit] 2015-03-01 10:56:22,748 [myid:] - INFO [NIOServerCxnFactory.AcceptThread:0.0.0.0/0.0.0.0:11221:NIOServerCnxnFactory$AcceptThread@219] - accept thread exitted run method
[junit] 2015-03-01 10:56:22,749 [myid:] - INFO [main:ZooKeeperServer@440] - shutting down
[junit] 2015-03-01 10:56:22,749 [myid:] - INFO [main:SessionTrackerImpl@232] - Shutting down
[junit] 2015-03-01 10:56:22,749 [myid:] - INFO [main:PrepRequestProcessor@974] - Shutting down
[junit] 2015-03-01 10:56:22,750 [myid:] - INFO [main:SyncRequestProcessor@191] - Shutting down
[junit] 2015-03-01 10:56:22,750 [myid:] - INFO [ProcessThread(sid:0 cport:11221)::PrepRequestProcessor@156] - PrepRequestProcessor exited loop!
[junit] 2015-03-01 10:56:22,750 [myid:] - INFO [SyncThread:0:SyncRequestProcessor@169] - SyncRequestProcessor exited!
[junit] 2015-03-01 10:56:22,750 [myid:] - INFO [main:FinalRequestProcessor@477] - shutdown of request processor complete
[junit] 2015-03-01 10:56:22,751 [myid:] - INFO [main:MBeanRegistry@119] - Unregister MBean [org.apache.ZooKeeperService:name0=StandaloneServer_port11221,name1=InMemoryDataTree]
[junit] 2015-03-01 10:56:22,751 [myid:] - INFO [main:MBeanRegistry@119] - Unregister MBean [org.apache.ZooKeeperService:name0=StandaloneServer_port11221]
[junit] 2015-03-01 10:56:22,751 [myid:] - INFO [main:FourLetterWordMain@43] - connecting to 127.0.0.1 11221
[junit] 2015-03-01 10:56:22,752 [myid:] - INFO [main:JMXEnv@142] - ensureOnly:[]
[junit] 2015-03-01 10:56:22,766 [myid:] - INFO [main:ClientBase@546] - fdcount after test is: 47 at start it was 33
[junit] 2015-03-01 10:56:22,767 [myid:] - INFO [main:ClientBase@548] - sleeping for 20 secs
[junit] 2015-03-01 10:56:22,768 [myid:] - INFO [main:ZKTestCase$1@65] - SUCCEEDED testQuota
[junit] 2015-03-01 10:56:22,768 [myid:] - INFO [main:ZKTestCase$1@60] - FINISHED testQuota
[junit] Tests run: 1, Failures: 0, Errors: 0, Skipped: 0, Time elapsed: 0.599 sec
BUILD FAILED
/home/jenkins/jenkins-slave/workspace/ZooKeeper_branch35_jdk7/branch-3.5/build.xml:1422: The following error occurred while executing this line:
/home/jenkins/jenkins-slave/workspace/ZooKeeper_branch35_jdk7/branch-3.5/build.xml:1333: Tests failed!
Total time: 42 minutes 59 seconds
Build step 'Invoke Ant' marked build as failure
Archiving artifacts
Recording test results
Email was triggered for: Failure
Sending email for trigger: Failure
###################################################################################
############################## FAILED TESTS (if any) ##############################
2 tests failed.
REGRESSION: org.apache.zookeeper.test.ReconfigTest.testPortChange
Error Message:
expected:<test[1]> but was:<test[0]>
Stack Trace:
junit.framework.AssertionFailedError: expected:<test[1]> but was:<test[0]>
at org.apache.zookeeper.test.ReconfigTest.testNormalOperation(ReconfigTest.java:151)
at org.apache.zookeeper.test.ReconfigTest.testPortChange(ReconfigTest.java:600)
at org.apache.zookeeper.JUnit4ZKTestRunner$LoggedInvokeMethod.evaluate(JUnit4ZKTestRunner.java:52)
FAILED: org.apache.zookeeper.test.AsyncHammerTest.testHammer
Error Message:
null
Stack Trace:
junit.framework.AssertionFailedError
at org.apache.zookeeper.test.AsyncHammerTest.testHammer(AsyncHammerTest.java:186)
at org.apache.zookeeper.JUnit4ZKTestRunner$LoggedInvokeMethod.evaluate(JUnit4ZKTestRunner.java:52)
ZooKeeper_branch35_jdk7 - Build # 217 - Still Failing
Posted by Apache Jenkins Server <je...@builds.apache.org>.
See https://builds.apache.org/job/ZooKeeper_branch35_jdk7/217/
###################################################################################
########################## LAST 60 LINES OF THE CONSOLE ###########################
[...truncated 353520 lines...]
[junit] 2015-02-28 11:02:43,124 [myid:] - INFO [main:JMXEnv@142] - ensureOnly:[]
[junit] 2015-02-28 11:02:43,126 [myid:] - INFO [main:ClientBase@444] - STARTING server
[junit] 2015-02-28 11:02:43,126 [myid:] - INFO [main:ClientBase@365] - CREATING server instance 127.0.0.1:11221
[junit] 2015-02-28 11:02:43,127 [myid:] - INFO [main:NIOServerCnxnFactory@670] - Configuring NIO connection handler with 10s sessionless connection timeout, 2 selector thread(s), 32 worker threads, and 64 kB direct buffers.
[junit] 2015-02-28 11:02:43,127 [myid:] - INFO [main:NIOServerCnxnFactory@683] - binding to port 0.0.0.0/0.0.0.0:11221
[junit] 2015-02-28 11:02:43,127 [myid:] - INFO [main:ClientBase@340] - STARTING server instance 127.0.0.1:11221
[junit] 2015-02-28 11:02:43,128 [myid:] - INFO [main:ZooKeeperServer@778] - minSessionTimeout set to 6000
[junit] 2015-02-28 11:02:43,128 [myid:] - INFO [main:ZooKeeperServer@787] - maxSessionTimeout set to 60000
[junit] 2015-02-28 11:02:43,128 [myid:] - INFO [main:ZooKeeperServer@153] - Created server with tickTime 3000 minSessionTimeout 6000 maxSessionTimeout 60000 datadir /home/jenkins/jenkins-slave/workspace/ZooKeeper_branch35_jdk7/branch-3.5/build/test/tmp/test1301989628432797170.junit.dir/version-2 snapdir /home/jenkins/jenkins-slave/workspace/ZooKeeper_branch35_jdk7/branch-3.5/build/test/tmp/test1301989628432797170.junit.dir/version-2
[junit] 2015-02-28 11:02:43,129 [myid:] - INFO [main:FileSnap@83] - Reading snapshot /home/jenkins/jenkins-slave/workspace/ZooKeeper_branch35_jdk7/branch-3.5/build/test/tmp/test1301989628432797170.junit.dir/version-2/snapshot.b
[junit] 2015-02-28 11:02:43,131 [myid:] - INFO [main:FileTxnSnapLog@298] - Snapshotting: 0xb to /home/jenkins/jenkins-slave/workspace/ZooKeeper_branch35_jdk7/branch-3.5/build/test/tmp/test1301989628432797170.junit.dir/version-2/snapshot.b
[junit] 2015-02-28 11:02:43,133 [myid:] - INFO [main:FourLetterWordMain@43] - connecting to 127.0.0.1 11221
[junit] 2015-02-28 11:02:43,133 [myid:] - INFO [NIOServerCxnFactory.AcceptThread:0.0.0.0/0.0.0.0:11221:NIOServerCnxnFactory$AcceptThread@296] - Accepted socket connection from /127.0.0.1:38671
[junit] 2015-02-28 11:02:43,134 [myid:] - INFO [NIOWorkerThread-1:NIOServerCnxn@835] - Processing stat command from /127.0.0.1:38671
[junit] 2015-02-28 11:02:43,135 [myid:] - INFO [NIOWorkerThread-1:NIOServerCnxn$StatCommand@684] - Stat command output
[junit] 2015-02-28 11:02:43,135 [myid:] - INFO [NIOWorkerThread-1:NIOServerCnxn@1006] - Closed socket connection for client /127.0.0.1:38671 (no session established for client)
[junit] 2015-02-28 11:02:43,135 [myid:] - INFO [main:JMXEnv@224] - ensureParent:[InMemoryDataTree, StandaloneServer_port]
[junit] 2015-02-28 11:02:43,137 [myid:] - INFO [main:JMXEnv@241] - expect:InMemoryDataTree
[junit] 2015-02-28 11:02:43,137 [myid:] - INFO [main:JMXEnv@245] - found:InMemoryDataTree org.apache.ZooKeeperService:name0=StandaloneServer_port11221,name1=InMemoryDataTree
[junit] 2015-02-28 11:02:43,137 [myid:] - INFO [main:JMXEnv@241] - expect:StandaloneServer_port
[junit] 2015-02-28 11:02:43,137 [myid:] - INFO [main:JMXEnv@245] - found:StandaloneServer_port org.apache.ZooKeeperService:name0=StandaloneServer_port11221
[junit] 2015-02-28 11:02:43,138 [myid:] - INFO [main:JUnit4ZKTestRunner$LoggedInvokeMethod@55] - Memory used 18106
[junit] 2015-02-28 11:02:43,138 [myid:] - INFO [main:JUnit4ZKTestRunner$LoggedInvokeMethod@60] - Number of threads 24
[junit] 2015-02-28 11:02:43,138 [myid:] - INFO [main:JUnit4ZKTestRunner$LoggedInvokeMethod@65] - FINISHED TEST METHOD testQuota
[junit] 2015-02-28 11:02:43,138 [myid:] - INFO [main:ClientBase@521] - tearDown starting
[junit] 2015-02-28 11:02:43,198 [myid:] - INFO [main:ZooKeeper@968] - Session: 0x1005fc1a8d80000 closed
[junit] 2015-02-28 11:02:43,199 [myid:] - INFO [main:ClientBase@491] - STOPPING server
[junit] 2015-02-28 11:02:43,198 [myid:] - INFO [main-EventThread:ClientCnxn$EventThread@531] - EventThread shut down
[junit] 2015-02-28 11:02:43,199 [myid:] - INFO [ConnnectionExpirer:NIOServerCnxnFactory$ConnectionExpirerThread@583] - ConnnectionExpirerThread interrupted
[junit] 2015-02-28 11:02:43,199 [myid:] - INFO [NIOServerCxnFactory.SelectorThread-1:NIOServerCnxnFactory$SelectorThread@420] - selector thread exitted run method
[junit] 2015-02-28 11:02:43,199 [myid:] - INFO [NIOServerCxnFactory.SelectorThread-0:NIOServerCnxnFactory$SelectorThread@420] - selector thread exitted run method
[junit] 2015-02-28 11:02:43,199 [myid:] - INFO [NIOServerCxnFactory.AcceptThread:0.0.0.0/0.0.0.0:11221:NIOServerCnxnFactory$AcceptThread@219] - accept thread exitted run method
[junit] 2015-02-28 11:02:43,200 [myid:] - INFO [main:ZooKeeperServer@440] - shutting down
[junit] 2015-02-28 11:02:43,200 [myid:] - INFO [main:SessionTrackerImpl@232] - Shutting down
[junit] 2015-02-28 11:02:43,200 [myid:] - INFO [main:PrepRequestProcessor@974] - Shutting down
[junit] 2015-02-28 11:02:43,201 [myid:] - INFO [main:SyncRequestProcessor@191] - Shutting down
[junit] 2015-02-28 11:02:43,201 [myid:] - INFO [ProcessThread(sid:0 cport:11221)::PrepRequestProcessor@156] - PrepRequestProcessor exited loop!
[junit] 2015-02-28 11:02:43,201 [myid:] - INFO [SyncThread:0:SyncRequestProcessor@169] - SyncRequestProcessor exited!
[junit] 2015-02-28 11:02:43,201 [myid:] - INFO [main:FinalRequestProcessor@477] - shutdown of request processor complete
[junit] 2015-02-28 11:02:43,202 [myid:] - INFO [main:MBeanRegistry@119] - Unregister MBean [org.apache.ZooKeeperService:name0=StandaloneServer_port11221,name1=InMemoryDataTree]
[junit] 2015-02-28 11:02:43,202 [myid:] - INFO [main:MBeanRegistry@119] - Unregister MBean [org.apache.ZooKeeperService:name0=StandaloneServer_port11221]
[junit] 2015-02-28 11:02:43,202 [myid:] - INFO [main:FourLetterWordMain@43] - connecting to 127.0.0.1 11221
[junit] 2015-02-28 11:02:43,203 [myid:] - INFO [main:JMXEnv@142] - ensureOnly:[]
[junit] 2015-02-28 11:02:43,212 [myid:] - INFO [main:ClientBase@546] - fdcount after test is: 47 at start it was 33
[junit] 2015-02-28 11:02:43,212 [myid:] - INFO [main:ClientBase@548] - sleeping for 20 secs
[junit] 2015-02-28 11:02:43,213 [myid:] - INFO [main:ZKTestCase$1@65] - SUCCEEDED testQuota
[junit] 2015-02-28 11:02:43,213 [myid:] - INFO [main:ZKTestCase$1@60] - FINISHED testQuota
[junit] Tests run: 1, Failures: 0, Errors: 0, Skipped: 0, Time elapsed: 0.66 sec
BUILD FAILED
/home/jenkins/jenkins-slave/workspace/ZooKeeper_branch35_jdk7/branch-3.5/build.xml:1422: The following error occurred while executing this line:
/home/jenkins/jenkins-slave/workspace/ZooKeeper_branch35_jdk7/branch-3.5/build.xml:1333: Tests failed!
Total time: 52 minutes 4 seconds
Build step 'Invoke Ant' marked build as failure
Archiving artifacts
Recording test results
Email was triggered for: Failure
Sending email for trigger: Failure
###################################################################################
############################## FAILED TESTS (if any) ##############################
1 tests failed.
REGRESSION: org.apache.zookeeper.test.AsyncHammerTest.testHammer
Error Message:
null
Stack Trace:
junit.framework.AssertionFailedError
at org.apache.zookeeper.test.AsyncHammerTest.testHammer(AsyncHammerTest.java:186)
at org.apache.zookeeper.JUnit4ZKTestRunner$LoggedInvokeMethod.evaluate(JUnit4ZKTestRunner.java:52)
ZooKeeper_branch35_jdk7 - Build # 216 - Still Failing
Posted by Apache Jenkins Server <je...@builds.apache.org>.
See https://builds.apache.org/job/ZooKeeper_branch35_jdk7/216/
###################################################################################
########################## LAST 60 LINES OF THE CONSOLE ###########################
[...truncated 346810 lines...]
[junit] 2015-02-27 10:57:13,595 [myid:] - INFO [main:NIOServerCnxnFactory@670] - Configuring NIO connection handler with 10s sessionless connection timeout, 2 selector thread(s), 32 worker threads, and 64 kB direct buffers.
[junit] 2015-02-27 10:57:13,596 [myid:] - INFO [main:NIOServerCnxnFactory@683] - binding to port 0.0.0.0/0.0.0.0:11221
[junit] 2015-02-27 10:57:13,596 [myid:] - INFO [main:ClientBase@340] - STARTING server instance 127.0.0.1:11221
[junit] 2015-02-27 10:57:13,596 [myid:] - INFO [main:ZooKeeperServer@778] - minSessionTimeout set to 6000
[junit] 2015-02-27 10:57:13,596 [myid:] - INFO [main:ZooKeeperServer@787] - maxSessionTimeout set to 60000
[junit] 2015-02-27 10:57:13,596 [myid:] - INFO [main:ZooKeeperServer@153] - Created server with tickTime 3000 minSessionTimeout 6000 maxSessionTimeout 60000 datadir /home/jenkins/jenkins-slave/workspace/ZooKeeper_branch35_jdk7/branch-3.5/build/test/tmp/test2550402739285998860.junit.dir/version-2 snapdir /home/jenkins/jenkins-slave/workspace/ZooKeeper_branch35_jdk7/branch-3.5/build/test/tmp/test2550402739285998860.junit.dir/version-2
[junit] 2015-02-27 10:57:13,597 [myid:] - INFO [main:FileSnap@83] - Reading snapshot /home/jenkins/jenkins-slave/workspace/ZooKeeper_branch35_jdk7/branch-3.5/build/test/tmp/test2550402739285998860.junit.dir/version-2/snapshot.b
[junit] 2015-02-27 10:57:13,600 [myid:] - INFO [main:FileTxnSnapLog@298] - Snapshotting: 0xb to /home/jenkins/jenkins-slave/workspace/ZooKeeper_branch35_jdk7/branch-3.5/build/test/tmp/test2550402739285998860.junit.dir/version-2/snapshot.b
[junit] 2015-02-27 10:57:13,602 [myid:] - INFO [main:FourLetterWordMain@43] - connecting to 127.0.0.1 11221
[junit] 2015-02-27 10:57:13,603 [myid:] - INFO [NIOServerCxnFactory.AcceptThread:0.0.0.0/0.0.0.0:11221:NIOServerCnxnFactory$AcceptThread@296] - Accepted socket connection from /127.0.0.1:33195
[junit] 2015-02-27 10:57:13,604 [myid:] - INFO [NIOWorkerThread-1:NIOServerCnxn@835] - Processing stat command from /127.0.0.1:33195
[junit] 2015-02-27 10:57:13,604 [myid:] - INFO [NIOWorkerThread-1:NIOServerCnxn$StatCommand@684] - Stat command output
[junit] 2015-02-27 10:57:13,605 [myid:] - INFO [NIOWorkerThread-1:NIOServerCnxn@1006] - Closed socket connection for client /127.0.0.1:33195 (no session established for client)
[junit] 2015-02-27 10:57:13,605 [myid:] - INFO [main:JMXEnv@224] - ensureParent:[InMemoryDataTree, StandaloneServer_port]
[junit] 2015-02-27 10:57:13,607 [myid:] - INFO [main:JMXEnv@241] - expect:InMemoryDataTree
[junit] 2015-02-27 10:57:13,608 [myid:] - INFO [main:JMXEnv@245] - found:InMemoryDataTree org.apache.ZooKeeperService:name0=StandaloneServer_port11221,name1=InMemoryDataTree
[junit] 2015-02-27 10:57:13,608 [myid:] - INFO [main:JMXEnv@241] - expect:StandaloneServer_port
[junit] 2015-02-27 10:57:13,608 [myid:] - INFO [main:JMXEnv@245] - found:StandaloneServer_port org.apache.ZooKeeperService:name0=StandaloneServer_port11221
[junit] 2015-02-27 10:57:13,608 [myid:] - INFO [main:JUnit4ZKTestRunner$LoggedInvokeMethod@55] - Memory used 18105
[junit] 2015-02-27 10:57:13,609 [myid:] - INFO [main:JUnit4ZKTestRunner$LoggedInvokeMethod@60] - Number of threads 24
[junit] 2015-02-27 10:57:13,609 [myid:] - INFO [main:JUnit4ZKTestRunner$LoggedInvokeMethod@65] - FINISHED TEST METHOD testQuota
[junit] 2015-02-27 10:57:13,609 [myid:] - INFO [main:ClientBase@521] - tearDown starting
[junit] 2015-02-27 10:57:13,672 [myid:] - INFO [main:ZooKeeper@968] - Session: 0x102f304d8cb0000 closed
[junit] 2015-02-27 10:57:13,672 [myid:] - INFO [main:ClientBase@491] - STOPPING server
[junit] 2015-02-27 10:57:13,672 [myid:] - INFO [main-EventThread:ClientCnxn$EventThread@531] - EventThread shut down
[junit] 2015-02-27 10:57:13,673 [myid:] - INFO [ConnnectionExpirer:NIOServerCnxnFactory$ConnectionExpirerThread@583] - ConnnectionExpirerThread interrupted
[junit] 2015-02-27 10:57:13,673 [myid:] - INFO [NIOServerCxnFactory.SelectorThread-1:NIOServerCnxnFactory$SelectorThread@420] - selector thread exitted run method
[junit] 2015-02-27 10:57:13,673 [myid:] - INFO [NIOServerCxnFactory.AcceptThread:0.0.0.0/0.0.0.0:11221:NIOServerCnxnFactory$AcceptThread@219] - accept thread exitted run method
[junit] 2015-02-27 10:57:13,673 [myid:] - INFO [NIOServerCxnFactory.SelectorThread-0:NIOServerCnxnFactory$SelectorThread@420] - selector thread exitted run method
[junit] 2015-02-27 10:57:13,674 [myid:] - INFO [main:ZooKeeperServer@440] - shutting down
[junit] 2015-02-27 10:57:13,674 [myid:] - INFO [main:SessionTrackerImpl@232] - Shutting down
[junit] 2015-02-27 10:57:13,674 [myid:] - INFO [main:PrepRequestProcessor@974] - Shutting down
[junit] 2015-02-27 10:57:13,675 [myid:] - INFO [main:SyncRequestProcessor@191] - Shutting down
[junit] 2015-02-27 10:57:13,675 [myid:] - INFO [ProcessThread(sid:0 cport:11221)::PrepRequestProcessor@156] - PrepRequestProcessor exited loop!
[junit] 2015-02-27 10:57:13,675 [myid:] - INFO [SyncThread:0:SyncRequestProcessor@169] - SyncRequestProcessor exited!
[junit] 2015-02-27 10:57:13,675 [myid:] - INFO [main:FinalRequestProcessor@477] - shutdown of request processor complete
[junit] 2015-02-27 10:57:13,676 [myid:] - INFO [main:MBeanRegistry@119] - Unregister MBean [org.apache.ZooKeeperService:name0=StandaloneServer_port11221,name1=InMemoryDataTree]
[junit] 2015-02-27 10:57:13,676 [myid:] - INFO [main:MBeanRegistry@119] - Unregister MBean [org.apache.ZooKeeperService:name0=StandaloneServer_port11221]
[junit] 2015-02-27 10:57:13,676 [myid:] - INFO [main:FourLetterWordMain@43] - connecting to 127.0.0.1 11221
[junit] 2015-02-27 10:57:13,677 [myid:] - INFO [main:JMXEnv@142] - ensureOnly:[]
[junit] 2015-02-27 10:57:13,683 [myid:] - INFO [SessionTracker:SessionTrackerImpl@158] - SessionTrackerImpl exited loop!
[junit] 2015-02-27 10:57:13,684 [myid:] - INFO [SessionTracker:SessionTrackerImpl@158] - SessionTrackerImpl exited loop!
[junit] 2015-02-27 10:57:13,684 [myid:] - INFO [SessionTracker:SessionTrackerImpl@158] - SessionTrackerImpl exited loop!
[junit] 2015-02-27 10:57:13,685 [myid:] - INFO [main:ClientBase@546] - fdcount after test is: 47 at start it was 33
[junit] 2015-02-27 10:57:13,685 [myid:] - INFO [main:ClientBase@548] - sleeping for 20 secs
[junit] 2015-02-27 10:57:13,686 [myid:] - INFO [main:ZKTestCase$1@65] - SUCCEEDED testQuota
[junit] 2015-02-27 10:57:13,686 [myid:] - INFO [main:ZKTestCase$1@60] - FINISHED testQuota
[junit] Tests run: 1, Failures: 0, Errors: 0, Skipped: 0, Time elapsed: 0.559 sec
BUILD FAILED
/home/jenkins/jenkins-slave/workspace/ZooKeeper_branch35_jdk7/branch-3.5/build.xml:1422: The following error occurred while executing this line:
/home/jenkins/jenkins-slave/workspace/ZooKeeper_branch35_jdk7/branch-3.5/build.xml:1333: Tests failed!
Total time: 43 minutes 35 seconds
Build step 'Invoke Ant' marked build as failure
Archiving artifacts
Recording test results
Email was triggered for: Failure
Sending email for trigger: Failure
###################################################################################
############################## FAILED TESTS (if any) ##############################
2 tests failed.
REGRESSION: org.apache.zookeeper.test.ClientPortBindTest.testBindByAddress
Error Message:
No such device
Stack Trace:
java.net.SocketException: No such device
at java.net.NetworkInterface.isLoopback0(Native Method)
at java.net.NetworkInterface.isLoopback(NetworkInterface.java:390)
at org.apache.zookeeper.test.ClientPortBindTest.testBindByAddress(ClientPortBindTest.java:61)
at org.apache.zookeeper.JUnit4ZKTestRunner$LoggedInvokeMethod.evaluate(JUnit4ZKTestRunner.java:52)
REGRESSION: org.apache.zookeeper.test.ReconfigTest.testPortChange
Error Message:
expected:<test[1]> but was:<test[0]>
Stack Trace:
junit.framework.AssertionFailedError: expected:<test[1]> but was:<test[0]>
at org.apache.zookeeper.test.ReconfigTest.testNormalOperation(ReconfigTest.java:151)
at org.apache.zookeeper.test.ReconfigTest.testPortChange(ReconfigTest.java:600)
at org.apache.zookeeper.JUnit4ZKTestRunner$LoggedInvokeMethod.evaluate(JUnit4ZKTestRunner.java:52)
ZooKeeper_branch35_jdk7 - Build # 215 - Still Failing
Posted by Apache Jenkins Server <je...@builds.apache.org>.
See https://builds.apache.org/job/ZooKeeper_branch35_jdk7/215/
###################################################################################
########################## LAST 60 LINES OF THE CONSOLE ###########################
[...truncated 347159 lines...]
[junit] 2015-02-26 11:29:11,494 [myid:] - INFO [main:JMXEnv@142] - ensureOnly:[]
[junit] 2015-02-26 11:29:11,495 [myid:] - INFO [main:ClientBase@444] - STARTING server
[junit] 2015-02-26 11:29:11,496 [myid:] - INFO [main:ClientBase@365] - CREATING server instance 127.0.0.1:11221
[junit] 2015-02-26 11:29:11,496 [myid:] - INFO [main:NIOServerCnxnFactory@670] - Configuring NIO connection handler with 10s sessionless connection timeout, 2 selector thread(s), 32 worker threads, and 64 kB direct buffers.
[junit] 2015-02-26 11:29:11,496 [myid:] - INFO [main:NIOServerCnxnFactory@683] - binding to port 0.0.0.0/0.0.0.0:11221
[junit] 2015-02-26 11:29:11,497 [myid:] - INFO [main:ClientBase@340] - STARTING server instance 127.0.0.1:11221
[junit] 2015-02-26 11:29:11,497 [myid:] - INFO [main:ZooKeeperServer@778] - minSessionTimeout set to 6000
[junit] 2015-02-26 11:29:11,497 [myid:] - INFO [main:ZooKeeperServer@787] - maxSessionTimeout set to 60000
[junit] 2015-02-26 11:29:11,498 [myid:] - INFO [main:ZooKeeperServer@153] - Created server with tickTime 3000 minSessionTimeout 6000 maxSessionTimeout 60000 datadir /home/jenkins/jenkins-slave/workspace/ZooKeeper_branch35_jdk7/branch-3.5/build/test/tmp/test6299048529481444580.junit.dir/version-2 snapdir /home/jenkins/jenkins-slave/workspace/ZooKeeper_branch35_jdk7/branch-3.5/build/test/tmp/test6299048529481444580.junit.dir/version-2
[junit] 2015-02-26 11:29:11,499 [myid:] - INFO [main:FileSnap@83] - Reading snapshot /home/jenkins/jenkins-slave/workspace/ZooKeeper_branch35_jdk7/branch-3.5/build/test/tmp/test6299048529481444580.junit.dir/version-2/snapshot.b
[junit] 2015-02-26 11:29:11,501 [myid:] - INFO [main:FileTxnSnapLog@298] - Snapshotting: 0xb to /home/jenkins/jenkins-slave/workspace/ZooKeeper_branch35_jdk7/branch-3.5/build/test/tmp/test6299048529481444580.junit.dir/version-2/snapshot.b
[junit] 2015-02-26 11:29:11,504 [myid:] - INFO [main:FourLetterWordMain@43] - connecting to 127.0.0.1 11221
[junit] 2015-02-26 11:29:11,504 [myid:] - INFO [NIOServerCxnFactory.AcceptThread:0.0.0.0/0.0.0.0:11221:NIOServerCnxnFactory$AcceptThread@296] - Accepted socket connection from /127.0.0.1:43980
[junit] 2015-02-26 11:29:11,505 [myid:] - INFO [NIOWorkerThread-1:NIOServerCnxn@835] - Processing stat command from /127.0.0.1:43980
[junit] 2015-02-26 11:29:11,505 [myid:] - INFO [NIOWorkerThread-1:NIOServerCnxn$StatCommand@684] - Stat command output
[junit] 2015-02-26 11:29:11,506 [myid:] - INFO [NIOWorkerThread-1:NIOServerCnxn@1006] - Closed socket connection for client /127.0.0.1:43980 (no session established for client)
[junit] 2015-02-26 11:29:11,506 [myid:] - INFO [main:JMXEnv@224] - ensureParent:[InMemoryDataTree, StandaloneServer_port]
[junit] 2015-02-26 11:29:11,508 [myid:] - INFO [main:JMXEnv@241] - expect:InMemoryDataTree
[junit] 2015-02-26 11:29:11,508 [myid:] - INFO [main:JMXEnv@245] - found:InMemoryDataTree org.apache.ZooKeeperService:name0=StandaloneServer_port11221,name1=InMemoryDataTree
[junit] 2015-02-26 11:29:11,508 [myid:] - INFO [main:JMXEnv@241] - expect:StandaloneServer_port
[junit] 2015-02-26 11:29:11,508 [myid:] - INFO [main:JMXEnv@245] - found:StandaloneServer_port org.apache.ZooKeeperService:name0=StandaloneServer_port11221
[junit] 2015-02-26 11:29:11,509 [myid:] - INFO [main:JUnit4ZKTestRunner$LoggedInvokeMethod@55] - Memory used 18104
[junit] 2015-02-26 11:29:11,509 [myid:] - INFO [main:JUnit4ZKTestRunner$LoggedInvokeMethod@60] - Number of threads 24
[junit] 2015-02-26 11:29:11,509 [myid:] - INFO [main:JUnit4ZKTestRunner$LoggedInvokeMethod@65] - FINISHED TEST METHOD testQuota
[junit] 2015-02-26 11:29:11,509 [myid:] - INFO [main:ClientBase@521] - tearDown starting
[junit] 2015-02-26 11:29:11,570 [myid:] - INFO [main:ZooKeeper@968] - Session: 0x102edfbf3e00000 closed
[junit] 2015-02-26 11:29:11,571 [myid:] - INFO [main:ClientBase@491] - STOPPING server
[junit] 2015-02-26 11:29:11,570 [myid:] - INFO [main-EventThread:ClientCnxn$EventThread@531] - EventThread shut down
[junit] 2015-02-26 11:29:11,571 [myid:] - INFO [ConnnectionExpirer:NIOServerCnxnFactory$ConnectionExpirerThread@583] - ConnnectionExpirerThread interrupted
[junit] 2015-02-26 11:29:11,571 [myid:] - INFO [NIOServerCxnFactory.AcceptThread:0.0.0.0/0.0.0.0:11221:NIOServerCnxnFactory$AcceptThread@219] - accept thread exitted run method
[junit] 2015-02-26 11:29:11,571 [myid:] - INFO [NIOServerCxnFactory.SelectorThread-1:NIOServerCnxnFactory$SelectorThread@420] - selector thread exitted run method
[junit] 2015-02-26 11:29:11,571 [myid:] - INFO [NIOServerCxnFactory.SelectorThread-0:NIOServerCnxnFactory$SelectorThread@420] - selector thread exitted run method
[junit] 2015-02-26 11:29:11,572 [myid:] - INFO [main:ZooKeeperServer@440] - shutting down
[junit] 2015-02-26 11:29:11,572 [myid:] - INFO [main:SessionTrackerImpl@232] - Shutting down
[junit] 2015-02-26 11:29:11,572 [myid:] - INFO [main:PrepRequestProcessor@974] - Shutting down
[junit] 2015-02-26 11:29:11,572 [myid:] - INFO [main:SyncRequestProcessor@191] - Shutting down
[junit] 2015-02-26 11:29:11,573 [myid:] - INFO [ProcessThread(sid:0 cport:11221)::PrepRequestProcessor@156] - PrepRequestProcessor exited loop!
[junit] 2015-02-26 11:29:11,573 [myid:] - INFO [SyncThread:0:SyncRequestProcessor@169] - SyncRequestProcessor exited!
[junit] 2015-02-26 11:29:11,573 [myid:] - INFO [main:FinalRequestProcessor@477] - shutdown of request processor complete
[junit] 2015-02-26 11:29:11,574 [myid:] - INFO [main:MBeanRegistry@119] - Unregister MBean [org.apache.ZooKeeperService:name0=StandaloneServer_port11221,name1=InMemoryDataTree]
[junit] 2015-02-26 11:29:11,574 [myid:] - INFO [main:MBeanRegistry@119] - Unregister MBean [org.apache.ZooKeeperService:name0=StandaloneServer_port11221]
[junit] 2015-02-26 11:29:11,574 [myid:] - INFO [main:FourLetterWordMain@43] - connecting to 127.0.0.1 11221
[junit] 2015-02-26 11:29:11,575 [myid:] - INFO [main:JMXEnv@142] - ensureOnly:[]
[junit] 2015-02-26 11:29:11,583 [myid:] - INFO [main:ClientBase@546] - fdcount after test is: 47 at start it was 33
[junit] 2015-02-26 11:29:11,583 [myid:] - INFO [main:ClientBase@548] - sleeping for 20 secs
[junit] 2015-02-26 11:29:11,584 [myid:] - INFO [main:ZKTestCase$1@65] - SUCCEEDED testQuota
[junit] 2015-02-26 11:29:11,584 [myid:] - INFO [main:ZKTestCase$1@60] - FINISHED testQuota
[junit] Tests run: 1, Failures: 0, Errors: 0, Skipped: 0, Time elapsed: 0.59 sec
BUILD FAILED
/home/jenkins/jenkins-slave/workspace/ZooKeeper_branch35_jdk7/branch-3.5/build.xml:1422: The following error occurred while executing this line:
/home/jenkins/jenkins-slave/workspace/ZooKeeper_branch35_jdk7/branch-3.5/build.xml:1333: Tests failed!
Total time: 42 minutes 56 seconds
Build step 'Invoke Ant' marked build as failure
Archiving artifacts
Recording test results
Email was triggered for: Failure
Sending email for trigger: Failure
###################################################################################
############################## FAILED TESTS (if any) ##############################
1 tests failed.
FAILED: org.apache.zookeeper.test.AsyncHammerTest.testHammer
Error Message:
null
Stack Trace:
junit.framework.AssertionFailedError
at org.apache.zookeeper.test.AsyncHammerTest.testHammer(AsyncHammerTest.java:186)
at org.apache.zookeeper.JUnit4ZKTestRunner$LoggedInvokeMethod.evaluate(JUnit4ZKTestRunner.java:52)