You are viewing a plain text version of this content. The canonical link for it is here.
Posted to dev@hive.apache.org by Apache Hudson Server <hu...@hudson.zones.apache.org> on 2010/06/06 18:48:02 UTC
Build failed in Hudson: Hive-trunk-h0.19 #463
See <http://hudson.zones.apache.org/hudson/job/Hive-trunk-h0.19/463/>
------------------------------------------
[...truncated 14075 lines...]
[junit] OK
[junit] Loading data to table srcbucket2
[junit] POSTHOOK: Output: default@srcbucket2
[junit] OK
[junit] Loading data to table srcbucket2
[junit] POSTHOOK: Output: default@srcbucket2
[junit] OK
[junit] Loading data to table src
[junit] POSTHOOK: Output: default@src
[junit] OK
[junit] Loading data to table src1
[junit] POSTHOOK: Output: default@src1
[junit] OK
[junit] Loading data to table src_sequencefile
[junit] POSTHOOK: Output: default@src_sequencefile
[junit] OK
[junit] Loading data to table src_thrift
[junit] POSTHOOK: Output: default@src_thrift
[junit] OK
[junit] Loading data to table src_json
[junit] POSTHOOK: Output: default@src_json
[junit] OK
[junit] diff <http://hudson.zones.apache.org/hudson/job/Hive-trunk-h0.19/ws/hive/build/ql/test/logs/negative/unknown_function4.q.out> <http://hudson.zones.apache.org/hudson/job/Hive-trunk-h0.19/ws/hive/ql/src/test/results/compiler/errors/unknown_function4.q.out>
[junit] Done query: unknown_function4.q
[junit] Begin query: unknown_table1.q
[junit] Loading data to table srcpart partition (ds=2008-04-08, hr=11)
[junit] POSTHOOK: Output: default@srcpart@ds=2008-04-08/hr=11
[junit] OK
[junit] Loading data to table srcpart partition (ds=2008-04-08, hr=12)
[junit] POSTHOOK: Output: default@srcpart@ds=2008-04-08/hr=12
[junit] OK
[junit] Loading data to table srcpart partition (ds=2008-04-09, hr=11)
[junit] POSTHOOK: Output: default@srcpart@ds=2008-04-09/hr=11
[junit] OK
[junit] Loading data to table srcpart partition (ds=2008-04-09, hr=12)
[junit] POSTHOOK: Output: default@srcpart@ds=2008-04-09/hr=12
[junit] OK
[junit] POSTHOOK: Output: default@srcbucket
[junit] OK
[junit] Loading data to table srcbucket
[junit] POSTHOOK: Output: default@srcbucket
[junit] OK
[junit] Loading data to table srcbucket
[junit] POSTHOOK: Output: default@srcbucket
[junit] OK
[junit] POSTHOOK: Output: default@srcbucket2
[junit] OK
[junit] Loading data to table srcbucket2
[junit] POSTHOOK: Output: default@srcbucket2
[junit] OK
[junit] Loading data to table srcbucket2
[junit] POSTHOOK: Output: default@srcbucket2
[junit] OK
[junit] Loading data to table srcbucket2
[junit] POSTHOOK: Output: default@srcbucket2
[junit] OK
[junit] Loading data to table srcbucket2
[junit] POSTHOOK: Output: default@srcbucket2
[junit] OK
[junit] Loading data to table src
[junit] POSTHOOK: Output: default@src
[junit] OK
[junit] Loading data to table src1
[junit] POSTHOOK: Output: default@src1
[junit] OK
[junit] Loading data to table src_sequencefile
[junit] POSTHOOK: Output: default@src_sequencefile
[junit] OK
[junit] Loading data to table src_thrift
[junit] POSTHOOK: Output: default@src_thrift
[junit] OK
[junit] Loading data to table src_json
[junit] POSTHOOK: Output: default@src_json
[junit] OK
[junit] diff <http://hudson.zones.apache.org/hudson/job/Hive-trunk-h0.19/ws/hive/build/ql/test/logs/negative/unknown_table1.q.out> <http://hudson.zones.apache.org/hudson/job/Hive-trunk-h0.19/ws/hive/ql/src/test/results/compiler/errors/unknown_table1.q.out>
[junit] Done query: unknown_table1.q
[junit] Begin query: unknown_table2.q
[junit] Loading data to table srcpart partition (ds=2008-04-08, hr=11)
[junit] POSTHOOK: Output: default@srcpart@ds=2008-04-08/hr=11
[junit] OK
[junit] Loading data to table srcpart partition (ds=2008-04-08, hr=12)
[junit] POSTHOOK: Output: default@srcpart@ds=2008-04-08/hr=12
[junit] OK
[junit] Loading data to table srcpart partition (ds=2008-04-09, hr=11)
[junit] POSTHOOK: Output: default@srcpart@ds=2008-04-09/hr=11
[junit] OK
[junit] Loading data to table srcpart partition (ds=2008-04-09, hr=12)
[junit] POSTHOOK: Output: default@srcpart@ds=2008-04-09/hr=12
[junit] OK
[junit] POSTHOOK: Output: default@srcbucket
[junit] OK
[junit] Loading data to table srcbucket
[junit] POSTHOOK: Output: default@srcbucket
[junit] OK
[junit] Loading data to table srcbucket
[junit] POSTHOOK: Output: default@srcbucket
[junit] OK
[junit] POSTHOOK: Output: default@srcbucket2
[junit] OK
[junit] Loading data to table srcbucket2
[junit] POSTHOOK: Output: default@srcbucket2
[junit] OK
[junit] Loading data to table srcbucket2
[junit] POSTHOOK: Output: default@srcbucket2
[junit] OK
[junit] Loading data to table srcbucket2
[junit] POSTHOOK: Output: default@srcbucket2
[junit] OK
[junit] Loading data to table srcbucket2
[junit] POSTHOOK: Output: default@srcbucket2
[junit] OK
[junit] Loading data to table src
[junit] POSTHOOK: Output: default@src
[junit] OK
[junit] Loading data to table src1
[junit] POSTHOOK: Output: default@src1
[junit] OK
[junit] Loading data to table src_sequencefile
[junit] POSTHOOK: Output: default@src_sequencefile
[junit] OK
[junit] Loading data to table src_thrift
[junit] POSTHOOK: Output: default@src_thrift
[junit] OK
[junit] Loading data to table src_json
[junit] POSTHOOK: Output: default@src_json
[junit] OK
[junit] diff <http://hudson.zones.apache.org/hudson/job/Hive-trunk-h0.19/ws/hive/build/ql/test/logs/negative/unknown_table2.q.out> <http://hudson.zones.apache.org/hudson/job/Hive-trunk-h0.19/ws/hive/ql/src/test/results/compiler/errors/unknown_table2.q.out>
[junit] Done query: unknown_table2.q
[junit] Begin query: wrong_distinct1.q
[junit] Loading data to table srcpart partition (ds=2008-04-08, hr=11)
[junit] POSTHOOK: Output: default@srcpart@ds=2008-04-08/hr=11
[junit] OK
[junit] Loading data to table srcpart partition (ds=2008-04-08, hr=12)
[junit] POSTHOOK: Output: default@srcpart@ds=2008-04-08/hr=12
[junit] OK
[junit] Loading data to table srcpart partition (ds=2008-04-09, hr=11)
[junit] POSTHOOK: Output: default@srcpart@ds=2008-04-09/hr=11
[junit] OK
[junit] Loading data to table srcpart partition (ds=2008-04-09, hr=12)
[junit] POSTHOOK: Output: default@srcpart@ds=2008-04-09/hr=12
[junit] OK
[junit] POSTHOOK: Output: default@srcbucket
[junit] OK
[junit] Loading data to table srcbucket
[junit] POSTHOOK: Output: default@srcbucket
[junit] OK
[junit] Loading data to table srcbucket
[junit] POSTHOOK: Output: default@srcbucket
[junit] OK
[junit] POSTHOOK: Output: default@srcbucket2
[junit] OK
[junit] Loading data to table srcbucket2
[junit] POSTHOOK: Output: default@srcbucket2
[junit] OK
[junit] Loading data to table srcbucket2
[junit] POSTHOOK: Output: default@srcbucket2
[junit] OK
[junit] Loading data to table srcbucket2
[junit] POSTHOOK: Output: default@srcbucket2
[junit] OK
[junit] Loading data to table srcbucket2
[junit] POSTHOOK: Output: default@srcbucket2
[junit] OK
[junit] Loading data to table src
[junit] POSTHOOK: Output: default@src
[junit] OK
[junit] Loading data to table src1
[junit] POSTHOOK: Output: default@src1
[junit] OK
[junit] Loading data to table src_sequencefile
[junit] POSTHOOK: Output: default@src_sequencefile
[junit] OK
[junit] Loading data to table src_thrift
[junit] POSTHOOK: Output: default@src_thrift
[junit] OK
[junit] Loading data to table src_json
[junit] POSTHOOK: Output: default@src_json
[junit] OK
[junit] diff <http://hudson.zones.apache.org/hudson/job/Hive-trunk-h0.19/ws/hive/build/ql/test/logs/negative/wrong_distinct1.q.out> <http://hudson.zones.apache.org/hudson/job/Hive-trunk-h0.19/ws/hive/ql/src/test/results/compiler/errors/wrong_distinct1.q.out>
[junit] Done query: wrong_distinct1.q
[junit] Begin query: wrong_distinct2.q
[junit] Loading data to table srcpart partition (ds=2008-04-08, hr=11)
[junit] POSTHOOK: Output: default@srcpart@ds=2008-04-08/hr=11
[junit] OK
[junit] Loading data to table srcpart partition (ds=2008-04-08, hr=12)
[junit] POSTHOOK: Output: default@srcpart@ds=2008-04-08/hr=12
[junit] OK
[junit] Loading data to table srcpart partition (ds=2008-04-09, hr=11)
[junit] POSTHOOK: Output: default@srcpart@ds=2008-04-09/hr=11
[junit] OK
[junit] Loading data to table srcpart partition (ds=2008-04-09, hr=12)
[junit] POSTHOOK: Output: default@srcpart@ds=2008-04-09/hr=12
[junit] OK
[junit] POSTHOOK: Output: default@srcbucket
[junit] OK
[junit] Loading data to table srcbucket
[junit] POSTHOOK: Output: default@srcbucket
[junit] OK
[junit] Loading data to table srcbucket
[junit] POSTHOOK: Output: default@srcbucket
[junit] OK
[junit] POSTHOOK: Output: default@srcbucket2
[junit] OK
[junit] Loading data to table srcbucket2
[junit] POSTHOOK: Output: default@srcbucket2
[junit] OK
[junit] Loading data to table srcbucket2
[junit] POSTHOOK: Output: default@srcbucket2
[junit] OK
[junit] Loading data to table srcbucket2
[junit] POSTHOOK: Output: default@srcbucket2
[junit] OK
[junit] Loading data to table srcbucket2
[junit] POSTHOOK: Output: default@srcbucket2
[junit] OK
[junit] Loading data to table src
[junit] POSTHOOK: Output: default@src
[junit] OK
[junit] Loading data to table src1
[junit] POSTHOOK: Output: default@src1
[junit] OK
[junit] Loading data to table src_sequencefile
[junit] POSTHOOK: Output: default@src_sequencefile
[junit] OK
[junit] Loading data to table src_thrift
[junit] POSTHOOK: Output: default@src_thrift
[junit] OK
[junit] Loading data to table src_json
[junit] POSTHOOK: Output: default@src_json
[junit] OK
[junit] diff <http://hudson.zones.apache.org/hudson/job/Hive-trunk-h0.19/ws/hive/build/ql/test/logs/negative/wrong_distinct2.q.out> <http://hudson.zones.apache.org/hudson/job/Hive-trunk-h0.19/ws/hive/ql/src/test/results/compiler/errors/wrong_distinct2.q.out>
[junit] Done query: wrong_distinct2.q
[junit] Tests run: 31, Failures: 0, Errors: 0, Time elapsed: 65.205 sec
[junit] Running org.apache.hadoop.hive.ql.tool.TestLineageInfo
[junit] Tests run: 5, Failures: 0, Errors: 0, Time elapsed: 0.367 sec
[junit] Running org.apache.hadoop.hive.ql.udf.TestUDFDateAdd
[junit] Tests run: 2, Failures: 0, Errors: 0, Time elapsed: 0.18 sec
[junit] Running org.apache.hadoop.hive.ql.udf.TestUDFDateDiff
[junit] Tests run: 1, Failures: 0, Errors: 0, Time elapsed: 0.157 sec
[junit] Running org.apache.hadoop.hive.ql.udf.TestUDFDateSub
[junit] Tests run: 2, Failures: 0, Errors: 0, Time elapsed: 0.155 sec
BUILD FAILED
<http://hudson.zones.apache.org/hudson/job/Hive-trunk-h0.19/ws/hive/build.xml>:166: The following error occurred while executing this line:
<http://hudson.zones.apache.org/hudson/job/Hive-trunk-h0.19/ws/hive/build.xml>:103: The following error occurred while executing this line:
<http://hudson.zones.apache.org/hudson/job/Hive-trunk-h0.19/ws/hive/build-common.xml>:429: Tests failed!
Total time: 105 minutes 18 seconds
Recording test results
Build failed in Hudson: Hive-trunk-h0.19 #465
Posted by Apache Hudson Server <hu...@hudson.zones.apache.org>.
See <http://hudson.zones.apache.org/hudson/job/Hive-trunk-h0.19/465/>
------------------------------------------
[...truncated 14075 lines...]
[junit] OK
[junit] Loading data to table srcbucket2
[junit] POSTHOOK: Output: default@srcbucket2
[junit] OK
[junit] Loading data to table srcbucket2
[junit] POSTHOOK: Output: default@srcbucket2
[junit] OK
[junit] Loading data to table src
[junit] POSTHOOK: Output: default@src
[junit] OK
[junit] Loading data to table src1
[junit] POSTHOOK: Output: default@src1
[junit] OK
[junit] Loading data to table src_sequencefile
[junit] POSTHOOK: Output: default@src_sequencefile
[junit] OK
[junit] Loading data to table src_thrift
[junit] POSTHOOK: Output: default@src_thrift
[junit] OK
[junit] Loading data to table src_json
[junit] POSTHOOK: Output: default@src_json
[junit] OK
[junit] diff <http://hudson.zones.apache.org/hudson/job/Hive-trunk-h0.19/ws/hive/build/ql/test/logs/negative/unknown_function4.q.out> <http://hudson.zones.apache.org/hudson/job/Hive-trunk-h0.19/ws/hive/ql/src/test/results/compiler/errors/unknown_function4.q.out>
[junit] Done query: unknown_function4.q
[junit] Begin query: unknown_table1.q
[junit] Loading data to table srcpart partition (ds=2008-04-08, hr=11)
[junit] POSTHOOK: Output: default@srcpart@ds=2008-04-08/hr=11
[junit] OK
[junit] Loading data to table srcpart partition (ds=2008-04-08, hr=12)
[junit] POSTHOOK: Output: default@srcpart@ds=2008-04-08/hr=12
[junit] OK
[junit] Loading data to table srcpart partition (ds=2008-04-09, hr=11)
[junit] POSTHOOK: Output: default@srcpart@ds=2008-04-09/hr=11
[junit] OK
[junit] Loading data to table srcpart partition (ds=2008-04-09, hr=12)
[junit] POSTHOOK: Output: default@srcpart@ds=2008-04-09/hr=12
[junit] OK
[junit] POSTHOOK: Output: default@srcbucket
[junit] OK
[junit] Loading data to table srcbucket
[junit] POSTHOOK: Output: default@srcbucket
[junit] OK
[junit] Loading data to table srcbucket
[junit] POSTHOOK: Output: default@srcbucket
[junit] OK
[junit] POSTHOOK: Output: default@srcbucket2
[junit] OK
[junit] Loading data to table srcbucket2
[junit] POSTHOOK: Output: default@srcbucket2
[junit] OK
[junit] Loading data to table srcbucket2
[junit] POSTHOOK: Output: default@srcbucket2
[junit] OK
[junit] Loading data to table srcbucket2
[junit] POSTHOOK: Output: default@srcbucket2
[junit] OK
[junit] Loading data to table srcbucket2
[junit] POSTHOOK: Output: default@srcbucket2
[junit] OK
[junit] Loading data to table src
[junit] POSTHOOK: Output: default@src
[junit] OK
[junit] Loading data to table src1
[junit] POSTHOOK: Output: default@src1
[junit] OK
[junit] Loading data to table src_sequencefile
[junit] POSTHOOK: Output: default@src_sequencefile
[junit] OK
[junit] Loading data to table src_thrift
[junit] POSTHOOK: Output: default@src_thrift
[junit] OK
[junit] Loading data to table src_json
[junit] POSTHOOK: Output: default@src_json
[junit] OK
[junit] diff <http://hudson.zones.apache.org/hudson/job/Hive-trunk-h0.19/ws/hive/build/ql/test/logs/negative/unknown_table1.q.out> <http://hudson.zones.apache.org/hudson/job/Hive-trunk-h0.19/ws/hive/ql/src/test/results/compiler/errors/unknown_table1.q.out>
[junit] Done query: unknown_table1.q
[junit] Begin query: unknown_table2.q
[junit] Loading data to table srcpart partition (ds=2008-04-08, hr=11)
[junit] POSTHOOK: Output: default@srcpart@ds=2008-04-08/hr=11
[junit] OK
[junit] Loading data to table srcpart partition (ds=2008-04-08, hr=12)
[junit] POSTHOOK: Output: default@srcpart@ds=2008-04-08/hr=12
[junit] OK
[junit] Loading data to table srcpart partition (ds=2008-04-09, hr=11)
[junit] POSTHOOK: Output: default@srcpart@ds=2008-04-09/hr=11
[junit] OK
[junit] Loading data to table srcpart partition (ds=2008-04-09, hr=12)
[junit] POSTHOOK: Output: default@srcpart@ds=2008-04-09/hr=12
[junit] OK
[junit] POSTHOOK: Output: default@srcbucket
[junit] OK
[junit] Loading data to table srcbucket
[junit] POSTHOOK: Output: default@srcbucket
[junit] OK
[junit] Loading data to table srcbucket
[junit] POSTHOOK: Output: default@srcbucket
[junit] OK
[junit] POSTHOOK: Output: default@srcbucket2
[junit] OK
[junit] Loading data to table srcbucket2
[junit] POSTHOOK: Output: default@srcbucket2
[junit] OK
[junit] Loading data to table srcbucket2
[junit] POSTHOOK: Output: default@srcbucket2
[junit] OK
[junit] Loading data to table srcbucket2
[junit] POSTHOOK: Output: default@srcbucket2
[junit] OK
[junit] Loading data to table srcbucket2
[junit] POSTHOOK: Output: default@srcbucket2
[junit] OK
[junit] Loading data to table src
[junit] POSTHOOK: Output: default@src
[junit] OK
[junit] Loading data to table src1
[junit] POSTHOOK: Output: default@src1
[junit] OK
[junit] Loading data to table src_sequencefile
[junit] POSTHOOK: Output: default@src_sequencefile
[junit] OK
[junit] Loading data to table src_thrift
[junit] POSTHOOK: Output: default@src_thrift
[junit] OK
[junit] Loading data to table src_json
[junit] POSTHOOK: Output: default@src_json
[junit] OK
[junit] diff <http://hudson.zones.apache.org/hudson/job/Hive-trunk-h0.19/ws/hive/build/ql/test/logs/negative/unknown_table2.q.out> <http://hudson.zones.apache.org/hudson/job/Hive-trunk-h0.19/ws/hive/ql/src/test/results/compiler/errors/unknown_table2.q.out>
[junit] Done query: unknown_table2.q
[junit] Begin query: wrong_distinct1.q
[junit] Loading data to table srcpart partition (ds=2008-04-08, hr=11)
[junit] POSTHOOK: Output: default@srcpart@ds=2008-04-08/hr=11
[junit] OK
[junit] Loading data to table srcpart partition (ds=2008-04-08, hr=12)
[junit] POSTHOOK: Output: default@srcpart@ds=2008-04-08/hr=12
[junit] OK
[junit] Loading data to table srcpart partition (ds=2008-04-09, hr=11)
[junit] POSTHOOK: Output: default@srcpart@ds=2008-04-09/hr=11
[junit] OK
[junit] Loading data to table srcpart partition (ds=2008-04-09, hr=12)
[junit] POSTHOOK: Output: default@srcpart@ds=2008-04-09/hr=12
[junit] OK
[junit] POSTHOOK: Output: default@srcbucket
[junit] OK
[junit] Loading data to table srcbucket
[junit] POSTHOOK: Output: default@srcbucket
[junit] OK
[junit] Loading data to table srcbucket
[junit] POSTHOOK: Output: default@srcbucket
[junit] OK
[junit] POSTHOOK: Output: default@srcbucket2
[junit] OK
[junit] Loading data to table srcbucket2
[junit] POSTHOOK: Output: default@srcbucket2
[junit] OK
[junit] Loading data to table srcbucket2
[junit] POSTHOOK: Output: default@srcbucket2
[junit] OK
[junit] Loading data to table srcbucket2
[junit] POSTHOOK: Output: default@srcbucket2
[junit] OK
[junit] Loading data to table srcbucket2
[junit] POSTHOOK: Output: default@srcbucket2
[junit] OK
[junit] Loading data to table src
[junit] POSTHOOK: Output: default@src
[junit] OK
[junit] Loading data to table src1
[junit] POSTHOOK: Output: default@src1
[junit] OK
[junit] Loading data to table src_sequencefile
[junit] POSTHOOK: Output: default@src_sequencefile
[junit] OK
[junit] Loading data to table src_thrift
[junit] POSTHOOK: Output: default@src_thrift
[junit] OK
[junit] Loading data to table src_json
[junit] POSTHOOK: Output: default@src_json
[junit] OK
[junit] diff <http://hudson.zones.apache.org/hudson/job/Hive-trunk-h0.19/ws/hive/build/ql/test/logs/negative/wrong_distinct1.q.out> <http://hudson.zones.apache.org/hudson/job/Hive-trunk-h0.19/ws/hive/ql/src/test/results/compiler/errors/wrong_distinct1.q.out>
[junit] Done query: wrong_distinct1.q
[junit] Begin query: wrong_distinct2.q
[junit] Loading data to table srcpart partition (ds=2008-04-08, hr=11)
[junit] POSTHOOK: Output: default@srcpart@ds=2008-04-08/hr=11
[junit] OK
[junit] Loading data to table srcpart partition (ds=2008-04-08, hr=12)
[junit] POSTHOOK: Output: default@srcpart@ds=2008-04-08/hr=12
[junit] OK
[junit] Loading data to table srcpart partition (ds=2008-04-09, hr=11)
[junit] POSTHOOK: Output: default@srcpart@ds=2008-04-09/hr=11
[junit] OK
[junit] Loading data to table srcpart partition (ds=2008-04-09, hr=12)
[junit] POSTHOOK: Output: default@srcpart@ds=2008-04-09/hr=12
[junit] OK
[junit] POSTHOOK: Output: default@srcbucket
[junit] OK
[junit] Loading data to table srcbucket
[junit] POSTHOOK: Output: default@srcbucket
[junit] OK
[junit] Loading data to table srcbucket
[junit] POSTHOOK: Output: default@srcbucket
[junit] OK
[junit] POSTHOOK: Output: default@srcbucket2
[junit] OK
[junit] Loading data to table srcbucket2
[junit] POSTHOOK: Output: default@srcbucket2
[junit] OK
[junit] Loading data to table srcbucket2
[junit] POSTHOOK: Output: default@srcbucket2
[junit] OK
[junit] Loading data to table srcbucket2
[junit] POSTHOOK: Output: default@srcbucket2
[junit] OK
[junit] Loading data to table srcbucket2
[junit] POSTHOOK: Output: default@srcbucket2
[junit] OK
[junit] Loading data to table src
[junit] POSTHOOK: Output: default@src
[junit] OK
[junit] Loading data to table src1
[junit] POSTHOOK: Output: default@src1
[junit] OK
[junit] Loading data to table src_sequencefile
[junit] POSTHOOK: Output: default@src_sequencefile
[junit] OK
[junit] Loading data to table src_thrift
[junit] POSTHOOK: Output: default@src_thrift
[junit] OK
[junit] Loading data to table src_json
[junit] POSTHOOK: Output: default@src_json
[junit] OK
[junit] diff <http://hudson.zones.apache.org/hudson/job/Hive-trunk-h0.19/ws/hive/build/ql/test/logs/negative/wrong_distinct2.q.out> <http://hudson.zones.apache.org/hudson/job/Hive-trunk-h0.19/ws/hive/ql/src/test/results/compiler/errors/wrong_distinct2.q.out>
[junit] Done query: wrong_distinct2.q
[junit] Tests run: 31, Failures: 0, Errors: 0, Time elapsed: 67.217 sec
[junit] Running org.apache.hadoop.hive.ql.tool.TestLineageInfo
[junit] Tests run: 5, Failures: 0, Errors: 0, Time elapsed: 0.352 sec
[junit] Running org.apache.hadoop.hive.ql.udf.TestUDFDateAdd
[junit] Tests run: 2, Failures: 0, Errors: 0, Time elapsed: 0.16 sec
[junit] Running org.apache.hadoop.hive.ql.udf.TestUDFDateDiff
[junit] Tests run: 1, Failures: 0, Errors: 0, Time elapsed: 0.171 sec
[junit] Running org.apache.hadoop.hive.ql.udf.TestUDFDateSub
[junit] Tests run: 2, Failures: 0, Errors: 0, Time elapsed: 0.158 sec
BUILD FAILED
<http://hudson.zones.apache.org/hudson/job/Hive-trunk-h0.19/ws/hive/build.xml>:166: The following error occurred while executing this line:
<http://hudson.zones.apache.org/hudson/job/Hive-trunk-h0.19/ws/hive/build.xml>:103: The following error occurred while executing this line:
<http://hudson.zones.apache.org/hudson/job/Hive-trunk-h0.19/ws/hive/build-common.xml>:429: Tests failed!
Total time: 103 minutes 13 seconds
Recording test results
Build failed in Hudson: Hive-trunk-h0.19 #464
Posted by Apache Hudson Server <hu...@hudson.zones.apache.org>.
See <http://hudson.zones.apache.org/hudson/job/Hive-trunk-h0.19/464/>
------------------------------------------
[...truncated 14075 lines...]
[junit] OK
[junit] Loading data to table srcbucket2
[junit] POSTHOOK: Output: default@srcbucket2
[junit] OK
[junit] Loading data to table srcbucket2
[junit] POSTHOOK: Output: default@srcbucket2
[junit] OK
[junit] Loading data to table src
[junit] POSTHOOK: Output: default@src
[junit] OK
[junit] Loading data to table src1
[junit] POSTHOOK: Output: default@src1
[junit] OK
[junit] Loading data to table src_sequencefile
[junit] POSTHOOK: Output: default@src_sequencefile
[junit] OK
[junit] Loading data to table src_thrift
[junit] POSTHOOK: Output: default@src_thrift
[junit] OK
[junit] Loading data to table src_json
[junit] POSTHOOK: Output: default@src_json
[junit] OK
[junit] diff <http://hudson.zones.apache.org/hudson/job/Hive-trunk-h0.19/ws/hive/build/ql/test/logs/negative/unknown_function4.q.out> <http://hudson.zones.apache.org/hudson/job/Hive-trunk-h0.19/ws/hive/ql/src/test/results/compiler/errors/unknown_function4.q.out>
[junit] Done query: unknown_function4.q
[junit] Begin query: unknown_table1.q
[junit] Loading data to table srcpart partition (ds=2008-04-08, hr=11)
[junit] POSTHOOK: Output: default@srcpart@ds=2008-04-08/hr=11
[junit] OK
[junit] Loading data to table srcpart partition (ds=2008-04-08, hr=12)
[junit] POSTHOOK: Output: default@srcpart@ds=2008-04-08/hr=12
[junit] OK
[junit] Loading data to table srcpart partition (ds=2008-04-09, hr=11)
[junit] POSTHOOK: Output: default@srcpart@ds=2008-04-09/hr=11
[junit] OK
[junit] Loading data to table srcpart partition (ds=2008-04-09, hr=12)
[junit] POSTHOOK: Output: default@srcpart@ds=2008-04-09/hr=12
[junit] OK
[junit] POSTHOOK: Output: default@srcbucket
[junit] OK
[junit] Loading data to table srcbucket
[junit] POSTHOOK: Output: default@srcbucket
[junit] OK
[junit] Loading data to table srcbucket
[junit] POSTHOOK: Output: default@srcbucket
[junit] OK
[junit] POSTHOOK: Output: default@srcbucket2
[junit] OK
[junit] Loading data to table srcbucket2
[junit] POSTHOOK: Output: default@srcbucket2
[junit] OK
[junit] Loading data to table srcbucket2
[junit] POSTHOOK: Output: default@srcbucket2
[junit] OK
[junit] Loading data to table srcbucket2
[junit] POSTHOOK: Output: default@srcbucket2
[junit] OK
[junit] Loading data to table srcbucket2
[junit] POSTHOOK: Output: default@srcbucket2
[junit] OK
[junit] Loading data to table src
[junit] POSTHOOK: Output: default@src
[junit] OK
[junit] Loading data to table src1
[junit] POSTHOOK: Output: default@src1
[junit] OK
[junit] Loading data to table src_sequencefile
[junit] POSTHOOK: Output: default@src_sequencefile
[junit] OK
[junit] Loading data to table src_thrift
[junit] POSTHOOK: Output: default@src_thrift
[junit] OK
[junit] Loading data to table src_json
[junit] POSTHOOK: Output: default@src_json
[junit] OK
[junit] diff <http://hudson.zones.apache.org/hudson/job/Hive-trunk-h0.19/ws/hive/build/ql/test/logs/negative/unknown_table1.q.out> <http://hudson.zones.apache.org/hudson/job/Hive-trunk-h0.19/ws/hive/ql/src/test/results/compiler/errors/unknown_table1.q.out>
[junit] Done query: unknown_table1.q
[junit] Begin query: unknown_table2.q
[junit] Loading data to table srcpart partition (ds=2008-04-08, hr=11)
[junit] POSTHOOK: Output: default@srcpart@ds=2008-04-08/hr=11
[junit] OK
[junit] Loading data to table srcpart partition (ds=2008-04-08, hr=12)
[junit] POSTHOOK: Output: default@srcpart@ds=2008-04-08/hr=12
[junit] OK
[junit] Loading data to table srcpart partition (ds=2008-04-09, hr=11)
[junit] POSTHOOK: Output: default@srcpart@ds=2008-04-09/hr=11
[junit] OK
[junit] Loading data to table srcpart partition (ds=2008-04-09, hr=12)
[junit] POSTHOOK: Output: default@srcpart@ds=2008-04-09/hr=12
[junit] OK
[junit] POSTHOOK: Output: default@srcbucket
[junit] OK
[junit] Loading data to table srcbucket
[junit] POSTHOOK: Output: default@srcbucket
[junit] OK
[junit] Loading data to table srcbucket
[junit] POSTHOOK: Output: default@srcbucket
[junit] OK
[junit] POSTHOOK: Output: default@srcbucket2
[junit] OK
[junit] Loading data to table srcbucket2
[junit] POSTHOOK: Output: default@srcbucket2
[junit] OK
[junit] Loading data to table srcbucket2
[junit] POSTHOOK: Output: default@srcbucket2
[junit] OK
[junit] Loading data to table srcbucket2
[junit] POSTHOOK: Output: default@srcbucket2
[junit] OK
[junit] Loading data to table srcbucket2
[junit] POSTHOOK: Output: default@srcbucket2
[junit] OK
[junit] Loading data to table src
[junit] POSTHOOK: Output: default@src
[junit] OK
[junit] Loading data to table src1
[junit] POSTHOOK: Output: default@src1
[junit] OK
[junit] Loading data to table src_sequencefile
[junit] POSTHOOK: Output: default@src_sequencefile
[junit] OK
[junit] Loading data to table src_thrift
[junit] POSTHOOK: Output: default@src_thrift
[junit] OK
[junit] Loading data to table src_json
[junit] POSTHOOK: Output: default@src_json
[junit] OK
[junit] diff <http://hudson.zones.apache.org/hudson/job/Hive-trunk-h0.19/ws/hive/build/ql/test/logs/negative/unknown_table2.q.out> <http://hudson.zones.apache.org/hudson/job/Hive-trunk-h0.19/ws/hive/ql/src/test/results/compiler/errors/unknown_table2.q.out>
[junit] Done query: unknown_table2.q
[junit] Begin query: wrong_distinct1.q
[junit] Loading data to table srcpart partition (ds=2008-04-08, hr=11)
[junit] POSTHOOK: Output: default@srcpart@ds=2008-04-08/hr=11
[junit] OK
[junit] Loading data to table srcpart partition (ds=2008-04-08, hr=12)
[junit] POSTHOOK: Output: default@srcpart@ds=2008-04-08/hr=12
[junit] OK
[junit] Loading data to table srcpart partition (ds=2008-04-09, hr=11)
[junit] POSTHOOK: Output: default@srcpart@ds=2008-04-09/hr=11
[junit] OK
[junit] Loading data to table srcpart partition (ds=2008-04-09, hr=12)
[junit] POSTHOOK: Output: default@srcpart@ds=2008-04-09/hr=12
[junit] OK
[junit] POSTHOOK: Output: default@srcbucket
[junit] OK
[junit] Loading data to table srcbucket
[junit] POSTHOOK: Output: default@srcbucket
[junit] OK
[junit] Loading data to table srcbucket
[junit] POSTHOOK: Output: default@srcbucket
[junit] OK
[junit] POSTHOOK: Output: default@srcbucket2
[junit] OK
[junit] Loading data to table srcbucket2
[junit] POSTHOOK: Output: default@srcbucket2
[junit] OK
[junit] Loading data to table srcbucket2
[junit] POSTHOOK: Output: default@srcbucket2
[junit] OK
[junit] Loading data to table srcbucket2
[junit] POSTHOOK: Output: default@srcbucket2
[junit] OK
[junit] Loading data to table srcbucket2
[junit] POSTHOOK: Output: default@srcbucket2
[junit] OK
[junit] Loading data to table src
[junit] POSTHOOK: Output: default@src
[junit] OK
[junit] Loading data to table src1
[junit] POSTHOOK: Output: default@src1
[junit] OK
[junit] Loading data to table src_sequencefile
[junit] POSTHOOK: Output: default@src_sequencefile
[junit] OK
[junit] Loading data to table src_thrift
[junit] POSTHOOK: Output: default@src_thrift
[junit] OK
[junit] Loading data to table src_json
[junit] POSTHOOK: Output: default@src_json
[junit] OK
[junit] diff <http://hudson.zones.apache.org/hudson/job/Hive-trunk-h0.19/ws/hive/build/ql/test/logs/negative/wrong_distinct1.q.out> <http://hudson.zones.apache.org/hudson/job/Hive-trunk-h0.19/ws/hive/ql/src/test/results/compiler/errors/wrong_distinct1.q.out>
[junit] Done query: wrong_distinct1.q
[junit] Begin query: wrong_distinct2.q
[junit] Loading data to table srcpart partition (ds=2008-04-08, hr=11)
[junit] POSTHOOK: Output: default@srcpart@ds=2008-04-08/hr=11
[junit] OK
[junit] Loading data to table srcpart partition (ds=2008-04-08, hr=12)
[junit] POSTHOOK: Output: default@srcpart@ds=2008-04-08/hr=12
[junit] OK
[junit] Loading data to table srcpart partition (ds=2008-04-09, hr=11)
[junit] POSTHOOK: Output: default@srcpart@ds=2008-04-09/hr=11
[junit] OK
[junit] Loading data to table srcpart partition (ds=2008-04-09, hr=12)
[junit] POSTHOOK: Output: default@srcpart@ds=2008-04-09/hr=12
[junit] OK
[junit] POSTHOOK: Output: default@srcbucket
[junit] OK
[junit] Loading data to table srcbucket
[junit] POSTHOOK: Output: default@srcbucket
[junit] OK
[junit] Loading data to table srcbucket
[junit] POSTHOOK: Output: default@srcbucket
[junit] OK
[junit] POSTHOOK: Output: default@srcbucket2
[junit] OK
[junit] Loading data to table srcbucket2
[junit] POSTHOOK: Output: default@srcbucket2
[junit] OK
[junit] Loading data to table srcbucket2
[junit] POSTHOOK: Output: default@srcbucket2
[junit] OK
[junit] Loading data to table srcbucket2
[junit] POSTHOOK: Output: default@srcbucket2
[junit] OK
[junit] Loading data to table srcbucket2
[junit] POSTHOOK: Output: default@srcbucket2
[junit] OK
[junit] Loading data to table src
[junit] POSTHOOK: Output: default@src
[junit] OK
[junit] Loading data to table src1
[junit] POSTHOOK: Output: default@src1
[junit] OK
[junit] Loading data to table src_sequencefile
[junit] POSTHOOK: Output: default@src_sequencefile
[junit] OK
[junit] Loading data to table src_thrift
[junit] POSTHOOK: Output: default@src_thrift
[junit] OK
[junit] Loading data to table src_json
[junit] POSTHOOK: Output: default@src_json
[junit] OK
[junit] diff <http://hudson.zones.apache.org/hudson/job/Hive-trunk-h0.19/ws/hive/build/ql/test/logs/negative/wrong_distinct2.q.out> <http://hudson.zones.apache.org/hudson/job/Hive-trunk-h0.19/ws/hive/ql/src/test/results/compiler/errors/wrong_distinct2.q.out>
[junit] Done query: wrong_distinct2.q
[junit] Tests run: 31, Failures: 0, Errors: 0, Time elapsed: 63.542 sec
[junit] Running org.apache.hadoop.hive.ql.tool.TestLineageInfo
[junit] Tests run: 5, Failures: 0, Errors: 0, Time elapsed: 0.358 sec
[junit] Running org.apache.hadoop.hive.ql.udf.TestUDFDateAdd
[junit] Tests run: 2, Failures: 0, Errors: 0, Time elapsed: 0.154 sec
[junit] Running org.apache.hadoop.hive.ql.udf.TestUDFDateDiff
[junit] Tests run: 1, Failures: 0, Errors: 0, Time elapsed: 0.155 sec
[junit] Running org.apache.hadoop.hive.ql.udf.TestUDFDateSub
[junit] Tests run: 2, Failures: 0, Errors: 0, Time elapsed: 0.154 sec
BUILD FAILED
<http://hudson.zones.apache.org/hudson/job/Hive-trunk-h0.19/ws/hive/build.xml>:166: The following error occurred while executing this line:
<http://hudson.zones.apache.org/hudson/job/Hive-trunk-h0.19/ws/hive/build.xml>:103: The following error occurred while executing this line:
<http://hudson.zones.apache.org/hudson/job/Hive-trunk-h0.19/ws/hive/build-common.xml>:429: Tests failed!
Total time: 113 minutes 45 seconds
Recording test results