You are viewing a plain text version of this content. The canonical link for it is here.
Posted to notifications@maven.apache.org by Apache Jenkins Server <je...@builds.apache.org> on 2019/04/10 10:24:38 UTC
Build failed in Jenkins: Maven TLP » maven-surefire » SUREFIRE-1617 #8
See https://builds.apache.org/job/maven-box/job/maven-surefire/job/SUREFIRE-1617/8/
No changes.
All tests passed
Build log:
[...truncated 46703 lines...]
[2019-04-10T10:03:57.369Z] [INFO] Running org.apache.maven.surefire.its.jiras.Surefire377TestNgAndJUnitTogetherIT
[2019-04-10T10:04:00.368Z] [INFO] Tests run: 2, Failures: 0, Errors: 0, Skipped: 0, Time elapsed: 23.847 s - in org.apache.maven.surefire.its.jiras.Surefire377TestNgAndJUnitTogetherIT
[2019-04-10T10:04:00.368Z] [INFO] Running org.apache.maven.surefire.its.jiras.Surefire408ManualProviderSelectionIT
[2019-04-10T10:04:14.346Z] [INFO] Tests run: 1, Failures: 0, Errors: 0, Skipped: 0, Time elapsed: 13.366 s - in org.apache.maven.surefire.its.jiras.Surefire408ManualProviderSelectionIT
[2019-04-10T10:04:14.346Z] [INFO] Running org.apache.maven.surefire.its.jiras.Surefire42NotExtendingTestCaseIT
[2019-04-10T10:04:26.003Z] [INFO] Tests run: 1, Failures: 0, Errors: 0, Skipped: 0, Time elapsed: 12.398 s - in org.apache.maven.surefire.its.jiras.Surefire42NotExtendingTestCaseIT
[2019-04-10T10:04:26.003Z] [INFO] Running org.apache.maven.surefire.its.jiras.Surefire44InnerClassTestIT
[2019-04-10T10:04:46.110Z] [INFO] Tests run: 1, Failures: 0, Errors: 0, Skipped: 0, Time elapsed: 13.995 s - in org.apache.maven.surefire.its.jiras.Surefire44InnerClassTestIT
[2019-04-10T10:04:46.110Z] [INFO] Running org.apache.maven.surefire.its.jiras.Surefire500PuzzlingErrorIT
[2019-04-10T10:04:52.822Z] [INFO] Tests run: 1, Failures: 0, Errors: 0, Skipped: 0, Time elapsed: 12.903 s - in org.apache.maven.surefire.its.jiras.Surefire500PuzzlingErrorIT
[2019-04-10T10:04:52.822Z] [INFO] Running org.apache.maven.surefire.its.jiras.Surefire510TestClassPathForkModesIT
[2019-04-10T10:05:22.040Z] [INFO] Tests run: 2, Failures: 0, Errors: 0, Skipped: 0, Time elapsed: 25.961 s - in org.apache.maven.surefire.its.jiras.Surefire510TestClassPathForkModesIT
[2019-04-10T10:05:22.040Z] [INFO] Running org.apache.maven.surefire.its.jiras.Surefire569RunTestFromDependencyJarsIT
[2019-04-10T10:05:31.259Z] [INFO] Tests run: 1, Failures: 0, Errors: 0, Skipped: 0, Time elapsed: 11.893 s - in org.apache.maven.surefire.its.jiras.Surefire569RunTestFromDependencyJarsIT
[2019-04-10T10:05:31.259Z] [INFO] Running org.apache.maven.surefire.its.jiras.Surefire570MultipleReportDirectoriesIT
[2019-04-10T10:06:56.720Z] [INFO] Tests run: 2, Failures: 0, Errors: 0, Skipped: 0, Time elapsed: 65.461 s - in org.apache.maven.surefire.its.jiras.Surefire570MultipleReportDirectoriesIT
[2019-04-10T10:06:56.720Z] [INFO] Running org.apache.maven.surefire.its.jiras.Surefire613TestCountInParallelIT
[2019-04-10T10:06:56.720Z] [INFO] Tests run: 1, Failures: 0, Errors: 0, Skipped: 0, Time elapsed: 13.809 s - in org.apache.maven.surefire.its.jiras.Surefire613TestCountInParallelIT
[2019-04-10T10:06:56.720Z] [INFO] Running org.apache.maven.surefire.its.jiras.Surefire621TestCountingJunit3InParallelIT
[2019-04-10T10:08:01.582Z] [INFO] Tests run: 5, Failures: 0, Errors: 0, Skipped: 0, Time elapsed: 70.617 s - in org.apache.maven.surefire.its.jiras.Surefire621TestCountingJunit3InParallelIT
[2019-04-10T10:08:01.583Z] [INFO] Running org.apache.maven.surefire.its.jiras.Surefire628ConsoleOutputBeforeAndAfterClassIT
[2019-04-10T10:08:14.646Z] [INFO] Tests run: 1, Failures: 0, Errors: 0, Skipped: 0, Time elapsed: 13.296 s - in org.apache.maven.surefire.its.jiras.Surefire628ConsoleOutputBeforeAndAfterClassIT
[2019-04-10T10:08:14.646Z] [INFO] Running org.apache.maven.surefire.its.jiras.Surefire634UnsettableSystemPropertiesWarningIT
[2019-04-10T10:08:27.731Z] [INFO] Tests run: 1, Failures: 0, Errors: 0, Skipped: 0, Time elapsed: 12.38 s - in org.apache.maven.surefire.its.jiras.Surefire634UnsettableSystemPropertiesWarningIT
[2019-04-10T10:08:27.731Z] [INFO] Running org.apache.maven.surefire.its.jiras.Surefire649EmptyStringSystemPropertiesIT
[2019-04-10T10:08:47.201Z] [INFO] Tests run: 2, Failures: 0, Errors: 0, Skipped: 0, Time elapsed: 20.494 s - in org.apache.maven.surefire.its.jiras.Surefire649EmptyStringSystemPropertiesIT
[2019-04-10T10:08:47.201Z] [INFO] Running org.apache.maven.surefire.its.jiras.Surefire673MockitoIT
[2019-04-10T10:09:05.529Z] [INFO] Tests run: 1, Failures: 0, Errors: 0, Skipped: 0, Time elapsed: 17.316 s - in org.apache.maven.surefire.its.jiras.Surefire673MockitoIT
[2019-04-10T10:09:05.529Z] [INFO] Running org.apache.maven.surefire.its.jiras.Surefire674BuildFailingWhenErrorsIT
[2019-04-10T10:09:18.513Z] [INFO] Tests run: 1, Failures: 0, Errors: 0, Skipped: 0, Time elapsed: 12.508 s - in org.apache.maven.surefire.its.jiras.Surefire674BuildFailingWhenErrorsIT
[2019-04-10T10:09:18.513Z] [INFO] Running org.apache.maven.surefire.its.jiras.Surefire674BuildFailingWhenFailsafeErrorsIT
[2019-04-10T10:09:49.649Z] [INFO] Tests run: 1, Failures: 0, Errors: 0, Skipped: 0, Time elapsed: 17.021 s - in org.apache.maven.surefire.its.jiras.Surefire674BuildFailingWhenFailsafeErrorsIT
[2019-04-10T10:09:49.649Z] [INFO] Running org.apache.maven.surefire.its.jiras.Surefire685CommaSeparatedIncludesIT
[2019-04-10T10:09:49.649Z] [INFO] Tests run: 1, Failures: 0, Errors: 0, Skipped: 0, Time elapsed: 11.985 s - in org.apache.maven.surefire.its.jiras.Surefire685CommaSeparatedIncludesIT
[2019-04-10T10:09:49.649Z] [INFO] Running org.apache.maven.surefire.its.jiras.Surefire697NiceSummaryIT
[2019-04-10T10:09:58.652Z] [INFO] Tests run: 1, Failures: 0, Errors: 0, Skipped: 0, Time elapsed: 12.229 s - in org.apache.maven.surefire.its.jiras.Surefire697NiceSummaryIT
[2019-04-10T10:09:58.652Z] [INFO] Running org.apache.maven.surefire.its.jiras.Surefire705ParallelForkTimeoutIT
[2019-04-10T10:10:14.794Z] [INFO] Tests run: 1, Failures: 0, Errors: 0, Skipped: 0, Time elapsed: 16.255 s - in org.apache.maven.surefire.its.jiras.Surefire705ParallelForkTimeoutIT
[2019-04-10T10:10:14.794Z] [INFO] Running org.apache.maven.surefire.its.jiras.Surefire733AllOverrridesCapturedIT
[2019-04-10T10:10:28.255Z] [INFO] Tests run: 1, Failures: 0, Errors: 0, Skipped: 0, Time elapsed: 12.171 s - in org.apache.maven.surefire.its.jiras.Surefire733AllOverrridesCapturedIT
[2019-04-10T10:10:28.255Z] [INFO] Running org.apache.maven.surefire.its.jiras.Surefire735ForkFailWithRedirectConsoleOutputIT
[2019-04-10T10:10:48.917Z] [INFO] Tests run: 2, Failures: 0, Errors: 0, Skipped: 0, Time elapsed: 20.843 s - in org.apache.maven.surefire.its.jiras.Surefire735ForkFailWithRedirectConsoleOutputIT
[2019-04-10T10:10:48.917Z] [INFO] Running org.apache.maven.surefire.its.jiras.Surefire740TruncatedCommaIT
[2019-04-10T10:10:57.957Z] [INFO] Tests run: 1, Failures: 0, Errors: 0, Skipped: 0, Time elapsed: 10.706 s - in org.apache.maven.surefire.its.jiras.Surefire740TruncatedCommaIT
[2019-04-10T10:10:57.957Z] [INFO] Running org.apache.maven.surefire.its.jiras.Surefire747MethodParallelWithSuiteCountIT
[2019-04-10T10:11:50.189Z] [INFO] Tests run: 2, Failures: 0, Errors: 0, Skipped: 0, Time elapsed: 37.48 s - in org.apache.maven.surefire.its.jiras.Surefire747MethodParallelWithSuiteCountIT
[2019-04-10T10:11:50.189Z] [INFO] Running org.apache.maven.surefire.its.jiras.Surefire772BothReportsIT
[2019-04-10T10:12:01.003Z] [INFO] Tests run: 3, Failures: 0, Errors: 0, Skipped: 0, Time elapsed: 24.441 s - in org.apache.maven.surefire.its.jiras.Surefire772BothReportsIT
[2019-04-10T10:12:01.003Z] [INFO] Running org.apache.maven.surefire.its.jiras.Surefire772NoFailsafeReportsIT
[2019-04-10T10:12:48.412Z] [INFO] Tests run: 4, Failures: 0, Errors: 0, Skipped: 0, Time elapsed: 33.142 s - in org.apache.maven.surefire.its.jiras.Surefire772NoFailsafeReportsIT
[2019-04-10T10:12:48.412Z] [INFO] Running org.apache.maven.surefire.its.jiras.Surefire772NoSurefireReportsIT
[2019-04-10T10:13:08.361Z] [INFO] Tests run: 4, Failures: 0, Errors: 0, Skipped: 0, Time elapsed: 32.928 s - in org.apache.maven.surefire.its.jiras.Surefire772NoSurefireReportsIT
[2019-04-10T10:13:08.361Z] [INFO] Running org.apache.maven.surefire.its.jiras.Surefire772SpecifiedReportsIT
[2019-04-10T10:13:31.821Z] [INFO] Tests run: 3, Failures: 0, Errors: 0, Skipped: 0, Time elapsed: 23.65 s - in org.apache.maven.surefire.its.jiras.Surefire772SpecifiedReportsIT
[2019-04-10T10:13:31.821Z] [INFO] Running org.apache.maven.surefire.its.jiras.Surefire801ForkModeNoneClassLoaderIT
[2019-04-10T10:13:47.229Z] [INFO] Tests run: 1, Failures: 0, Errors: 0, Skipped: 0, Time elapsed: 9.659 s - in org.apache.maven.surefire.its.jiras.Surefire801ForkModeNoneClassLoaderIT
[2019-04-10T10:13:47.229Z] [INFO] Running org.apache.maven.surefire.its.jiras.Surefire803MultiFailsafeExecsIT
[2019-04-10T10:15:17.050Z] [INFO] Tests run: 2, Failures: 0, Errors: 0, Skipped: 0, Time elapsed: 41.797 s - in org.apache.maven.surefire.its.jiras.Surefire803MultiFailsafeExecsIT
[2019-04-10T10:15:17.050Z] [INFO] Running org.apache.maven.surefire.its.jiras.Surefire806SpecifiedTestControlsIT
[2019-04-10T10:15:17.050Z] [WARNING] Tests run: 3, Failures: 0, Errors: 0, Skipped: 2, Time elapsed: 11.4 s - in org.apache.maven.surefire.its.jiras.Surefire806SpecifiedTestControlsIT
[2019-04-10T10:15:17.050Z] [INFO] Running org.apache.maven.surefire.its.jiras.Surefire809GroupExpressionsIT
[2019-04-10T10:15:45.917Z] [INFO] Tests run: 6, Failures: 0, Errors: 0, Skipped: 0, Time elapsed: 72.431 s - in org.apache.maven.surefire.its.jiras.Surefire809GroupExpressionsIT
[2019-04-10T10:15:45.917Z] [INFO] Running org.apache.maven.surefire.its.jiras.Surefire812Log4JClassLoaderIT
[2019-04-10T10:15:59.382Z] [INFO] Tests run: 1, Failures: 0, Errors: 0, Skipped: 0, Time elapsed: 13.717 s - in org.apache.maven.surefire.its.jiras.Surefire812Log4JClassLoaderIT
[2019-04-10T10:15:59.382Z] [INFO] Running org.apache.maven.surefire.its.jiras.Surefire817SystemExitIT
[2019-04-10T10:16:15.610Z] [INFO] Tests run: 1, Failures: 0, Errors: 0, Skipped: 0, Time elapsed: 14.098 s - in org.apache.maven.surefire.its.jiras.Surefire817SystemExitIT
[2019-04-10T10:16:15.610Z] [INFO] Running org.apache.maven.surefire.its.jiras.Surefire818NpeIgnoresTestsIT
[2019-04-10T10:16:31.709Z] [INFO] Tests run: 1, Failures: 0, Errors: 0, Skipped: 0, Time elapsed: 15.56 s - in org.apache.maven.surefire.its.jiras.Surefire818NpeIgnoresTestsIT
[2019-04-10T10:16:31.709Z] [INFO] Running org.apache.maven.surefire.its.jiras.Surefire828EmptyGroupExprIT
[2019-04-10T10:17:31.255Z] [INFO] Tests run: 4, Failures: 0, Errors: 0, Skipped: 0, Time elapsed: 58.061 s - in org.apache.maven.surefire.its.jiras.Surefire828EmptyGroupExprIT
[2019-04-10T10:17:31.255Z] [INFO] Running org.apache.maven.surefire.its.jiras.Surefire832ProviderSelectionIT
[2019-04-10T10:17:40.662Z] [INFO] Tests run: 1, Failures: 0, Errors: 0, Skipped: 0, Time elapsed: 13.528 s - in org.apache.maven.surefire.its.jiras.Surefire832ProviderSelectionIT
[2019-04-10T10:17:40.662Z] [INFO] Running org.apache.maven.surefire.its.jiras.Surefire839TestWithoutCategoriesIT
[2019-04-10T10:18:08.202Z] [INFO] Tests run: 2, Failures: 0, Errors: 0, Skipped: 0, Time elapsed: 23.904 s - in org.apache.maven.surefire.its.jiras.Surefire839TestWithoutCategoriesIT
[2019-04-10T10:18:08.202Z] [INFO] Running org.apache.maven.surefire.its.jiras.Surefire847AdditionalFailureIT
[2019-04-10T10:18:17.328Z] [INFO] Tests run: 1, Failures: 0, Errors: 0, Skipped: 0, Time elapsed: 13.378 s - in org.apache.maven.surefire.its.jiras.Surefire847AdditionalFailureIT
[2019-04-10T10:18:17.328Z] [INFO] Running org.apache.maven.surefire.its.jiras.Surefire855AllowFailsafeUseArtifactFileIT
[2019-04-10T10:19:44.408Z] [INFO] Tests run: 4, Failures: 0, Errors: 0, Skipped: 0, Time elapsed: 85.243 s - in org.apache.maven.surefire.its.jiras.Surefire855AllowFailsafeUseArtifactFileIT
[2019-04-10T10:19:44.408Z] [INFO] Running org.apache.maven.surefire.its.jiras.Surefire901MIssingResultfileWhenNoTestsIT
[2019-04-10T10:19:53.406Z] [INFO] Tests run: 1, Failures: 0, Errors: 0, Skipped: 0, Time elapsed: 10.074 s - in org.apache.maven.surefire.its.jiras.Surefire901MIssingResultfileWhenNoTestsIT
[2019-04-10T10:19:53.406Z] [INFO] Running org.apache.maven.surefire.its.jiras.Surefire907PerThreadWithoutThreadCountIT
[2019-04-10T10:20:02.217Z] [INFO] Tests run: 1, Failures: 0, Errors: 0, Skipped: 0, Time elapsed: 8.514 s - in org.apache.maven.surefire.its.jiras.Surefire907PerThreadWithoutThreadCountIT
[2019-04-10T10:20:02.217Z] [INFO] Running org.apache.maven.surefire.its.jiras.Surefire920TestFailureIgnoreWithTimeoutIT
[2019-04-10T10:20:38.767Z] [INFO] Tests run: 2, Failures: 0, Errors: 0, Skipped: 0, Time elapsed: 25.144 s - in org.apache.maven.surefire.its.jiras.Surefire920TestFailureIgnoreWithTimeoutIT
[2019-04-10T10:20:38.767Z] [INFO] Running org.apache.maven.surefire.its.jiras.Surefire926FailureWith2ProvidersIT
[2019-04-10T10:20:42.623Z] [INFO] Tests run: 1, Failures: 0, Errors: 0, Skipped: 0, Time elapsed: 15.534 s - in org.apache.maven.surefire.its.jiras.Surefire926FailureWith2ProvidersIT
[2019-04-10T10:20:42.624Z] [INFO] Running org.apache.maven.surefire.its.jiras.Surefire930TestNgSuiteXmlIT
[2019-04-10T10:20:55.475Z] [INFO] Tests run: 1, Failures: 0, Errors: 0, Skipped: 0, Time elapsed: 13.217 s - in org.apache.maven.surefire.its.jiras.Surefire930TestNgSuiteXmlIT
[2019-04-10T10:20:55.475Z] [INFO] Running org.apache.maven.surefire.its.jiras.Surefire943ReportContentIT
[2019-04-10T10:21:46.208Z] [INFO] Tests run: 2, Failures: 0, Errors: 0, Skipped: 0, Time elapsed: 47.172 s - in org.apache.maven.surefire.its.jiras.Surefire943ReportContentIT
[2019-04-10T10:21:46.208Z] [INFO] Running org.apache.maven.surefire.its.jiras.Surefire946KillMainProcessInReusableForkIT
[2019-04-10T10:22:31.495Z] [INFO] Tests run: 3, Failures: 0, Errors: 0, Skipped: 0, Time elapsed: 34.343 s - in org.apache.maven.surefire.its.jiras.Surefire946KillMainProcessInReusableForkIT
[2019-04-10T10:22:31.495Z] [INFO] Running org.apache.maven.surefire.its.jiras.Surefire972BizarreNoClassDefIT
[2019-04-10T10:22:33.995Z] [INFO] Tests run: 1, Failures: 0, Errors: 0, Skipped: 0, Time elapsed: 17.411 s - in org.apache.maven.surefire.its.jiras.Surefire972BizarreNoClassDefIT
[2019-04-10T10:22:33.995Z] [INFO] Running org.apache.maven.surefire.its.jiras.Surefire975DefaultVMEncodingIT
[2019-04-10T10:22:49.461Z] [INFO] Tests run: 1, Failures: 0, Errors: 0, Skipped: 0, Time elapsed: 14.19 s - in org.apache.maven.surefire.its.jiras.Surefire975DefaultVMEncodingIT
[2019-04-10T10:22:49.461Z] [INFO] Running org.apache.maven.surefire.its.jiras.Surefire979WrongClassLoaderIT
[2019-04-10T10:23:03.023Z] [INFO] Tests run: 1, Failures: 0, Errors: 0, Skipped: 0, Time elapsed: 12.841 s - in org.apache.maven.surefire.its.jiras.Surefire979WrongClassLoaderIT
[2019-04-10T10:23:03.023Z] [INFO] Running org.apache.maven.surefire.its.jiras.Surefire985ParameterizedRunnerAndCategoriesIT
[2019-04-10T10:23:13.520Z] [INFO] Tests run: 1, Failures: 0, Errors: 0, Skipped: 0, Time elapsed: 10.92 s - in org.apache.maven.surefire.its.jiras.Surefire985ParameterizedRunnerAndCategoriesIT
[2019-04-10T10:23:13.520Z] [INFO] Running org.apache.maven.surefire.its.jiras.Surefire995CategoryInheritanceIT
[2019-04-10T10:24:10.810Z] [INFO] Tests run: 5, Failures: 0, Errors: 0, Skipped: 0, Time elapsed: 56.635 s - in org.apache.maven.surefire.its.jiras.Surefire995CategoryInheritanceIT
[2019-04-10T10:24:10.810Z] [INFO]
[2019-04-10T10:24:10.810Z] [INFO] Results:
[2019-04-10T10:24:10.810Z] [INFO]
[2019-04-10T10:24:10.810Z] [ERROR] Errors:
[2019-04-10T10:24:10.810Z] [ERROR] JUnit47ParallelIT.forcedShutdownVerifyingLogs:532 » SurefireVerifier org.apach...
[2019-04-10T10:24:10.810Z] [INFO]
[2019-04-10T10:24:10.810Z] [ERROR] Tests run: 792, Failures: 0, Errors: 1, Skipped: 172
[2019-04-10T10:24:10.810Z] [INFO]
[2019-04-10T10:24:10.810Z] [INFO]
[2019-04-10T10:24:10.810Z] [INFO] --- maven-checkstyle-plugin:3.0.0:check (checkstyle-check) @ surefire-its ---
[2019-04-10T10:24:11.962Z] [INFO]
[2019-04-10T10:24:11.962Z] [INFO] --- maven-failsafe-plugin:3.0.0-M3:verify (default) @ surefire-its ---
[2019-04-10T10:24:11.962Z] [INFO] Failsafe report directory: C:\Users\jenkins\AppData\Local\Temp\2\jenkins-maven-box-maven-surefire-SUREFIRE-1617-8\surefire-its\target\failsafe-reports
[2019-04-10T10:24:11.962Z] [INFO] ------------------------------------------------------------------------
[2019-04-10T10:24:11.962Z] [INFO] Reactor Summary for Apache Maven Surefire 3.0.0-SNAPSHOT:
[2019-04-10T10:24:11.962Z] [INFO]
[2019-04-10T10:24:11.962Z] [INFO] Apache Maven Surefire .............................. SUCCESS [ 35.436 s]
[2019-04-10T10:24:11.962Z] [INFO] SureFire Logger API ................................ SUCCESS [ 11.723 s]
[2019-04-10T10:24:11.962Z] [INFO] SureFire API ....................................... SUCCESS [ 26.434 s]
[2019-04-10T10:24:11.962Z] [INFO] SureFire Booter .................................... SUCCESS [ 26.847 s]
[2019-04-10T10:24:11.962Z] [INFO] Maven Surefire Test-Grouping Support ............... SUCCESS [ 15.621 s]
[2019-04-10T10:24:11.962Z] [INFO] SureFire Providers ................................. SUCCESS [ 2.953 s]
[2019-04-10T10:24:11.962Z] [INFO] Shared JUnit3 Provider Code ........................ SUCCESS [ 10.498 s]
[2019-04-10T10:24:11.962Z] [INFO] Shared Java 5 Provider Base ........................ SUCCESS [ 13.571 s]
[2019-04-10T10:24:11.962Z] [INFO] Shared JUnit4 Provider Code ........................ SUCCESS [ 12.125 s]
[2019-04-10T10:24:11.962Z] [INFO] Shared JUnit48 Provider Code ....................... SUCCESS [ 13.772 s]
[2019-04-10T10:24:11.962Z] [INFO] SureFire JUnit Runner .............................. SUCCESS [ 10.359 s]
[2019-04-10T10:24:11.962Z] [INFO] SureFire JUnit4 Runner ............................. SUCCESS [ 11.168 s]
[2019-04-10T10:24:11.962Z] [INFO] Maven Surefire Common .............................. SUCCESS [01:06 min]
[2019-04-10T10:24:11.962Z] [INFO] SureFire JUnitCore Runner .......................... SUCCESS [02:35 min]
[2019-04-10T10:24:11.962Z] [INFO] SureFire JUnit Platform Runner ..................... SUCCESS [ 21.597 s]
[2019-04-10T10:24:11.962Z] [INFO] SureFire TestNG Utils .............................. SUCCESS [ 11.596 s]
[2019-04-10T10:24:11.962Z] [INFO] SureFire TestNG Runner ............................. SUCCESS [ 13.596 s]
[2019-04-10T10:24:11.962Z] [INFO] ShadeFire JUnit3 Provider .......................... SUCCESS [ 3.549 s]
[2019-04-10T10:24:11.962Z] [INFO] Surefire Report Parser ............................. SUCCESS [ 14.279 s]
[2019-04-10T10:24:11.962Z] [INFO] Maven Surefire Plugin .............................. SUCCESS [ 23.786 s]
[2019-04-10T10:24:11.962Z] [INFO] Maven Failsafe Plugin .............................. SUCCESS [02:46 min]
[2019-04-10T10:24:11.962Z] [INFO] Maven Surefire Report Plugin ....................... SUCCESS [ 36.668 s]
[2019-04-10T10:24:11.962Z] [INFO] Maven Surefire Integration Tests ................... FAILURE [ 02:21 h]
[2019-04-10T10:24:11.962Z] [INFO] ------------------------------------------------------------------------
[2019-04-10T10:24:11.962Z] [INFO] BUILD FAILURE
[2019-04-10T10:24:11.962Z] [INFO] ------------------------------------------------------------------------
[2019-04-10T10:24:11.962Z] [INFO] Total time: 02:33 h
[2019-04-10T10:24:11.962Z] [INFO] Finished at: 2019-04-10T10:24:11Z
[2019-04-10T10:24:11.962Z] [INFO] ------------------------------------------------------------------------
[2019-04-10T10:24:11.962Z] [ERROR] Failed to execute goal org.apache.maven.plugins:maven-failsafe-plugin:3.0.0-M3:verify (default) on project surefire-its: There are test failures.
[2019-04-10T10:24:11.962Z] [ERROR]
[2019-04-10T10:24:11.963Z] [ERROR] Please refer to C:\Users\jenkins\AppData\Local\Temp\2\jenkins-maven-box-maven-surefire-SUREFIRE-1617-8\surefire-its\target\failsafe-reports for the individual test results.
[2019-04-10T10:24:11.963Z] [ERROR] Please refer to dump files (if any exist) [date].dump, [date]-jvmRun[N].dump and [date].dumpstream.
[2019-04-10T10:24:11.963Z] [ERROR] -> [Help 1]
[2019-04-10T10:24:11.963Z] org.apache.maven.lifecycle.LifecycleExecutionException: Failed to execute goal org.apache.maven.plugins:maven-failsafe-plugin:3.0.0-M3:verify (default) on project surefire-its: There are test failures.
[2019-04-10T10:24:11.963Z]
[2019-04-10T10:24:11.963Z] Please refer to C:\Users\jenkins\AppData\Local\Temp\2\jenkins-maven-box-maven-surefire-SUREFIRE-1617-8\surefire-its\target\failsafe-reports for the individual test results.
[2019-04-10T10:24:11.963Z] Please refer to dump files (if any exist) [date].dump, [date]-jvmRun[N].dump and [date].dumpstream.
[2019-04-10T10:24:11.963Z] at org.apache.maven.lifecycle.internal.MojoExecutor.execute (MojoExecutor.java:215)
[2019-04-10T10:24:11.963Z] at org.apache.maven.lifecycle.internal.MojoExecutor.execute (MojoExecutor.java:156)
[2019-04-10T10:24:11.963Z] at org.apache.maven.lifecycle.internal.MojoExecutor.execute (MojoExecutor.java:148)
[2019-04-10T10:24:11.963Z] at org.apache.maven.lifecycle.internal.LifecycleModuleBuilder.buildProject (LifecycleModuleBuilder.java:117)
[2019-04-10T10:24:11.963Z] at org.apache.maven.lifecycle.internal.LifecycleModuleBuilder.buildProject (LifecycleModuleBuilder.java:81)
[2019-04-10T10:24:11.963Z] at org.apache.maven.lifecycle.internal.builder.singlethreaded.SingleThreadedBuilder.build (SingleThreadedBuilder.java:56)
[2019-04-10T10:24:11.963Z] at org.apache.maven.lifecycle.internal.LifecycleStarter.execute (LifecycleStarter.java:128)
[2019-04-10T10:24:11.963Z] at org.apache.maven.DefaultMaven.doExecute (DefaultMaven.java:305)
[2019-04-10T10:24:11.963Z] at org.apache.maven.DefaultMaven.doExecute (DefaultMaven.java:192)
[2019-04-10T10:24:11.963Z] at org.apache.maven.DefaultMaven.execute (DefaultMaven.java:105)
[2019-04-10T10:24:11.963Z] at org.apache.maven.cli.MavenCli.execute (MavenCli.java:956)
[2019-04-10T10:24:11.963Z] at org.apache.maven.cli.MavenCli.doMain (MavenCli.java:288)
[2019-04-10T10:24:11.963Z] at org.apache.maven.cli.MavenCli.main (MavenCli.java:192)
[2019-04-10T10:24:11.963Z] at sun.reflect.NativeMethodAccessorImpl.invoke0 (Native Method)
[2019-04-10T10:24:11.963Z] at sun.reflect.NativeMethodAccessorImpl.invoke (NativeMethodAccessorImpl.java:62)
[2019-04-10T10:24:11.963Z] at sun.reflect.DelegatingMethodAccessorImpl.invoke (DelegatingMethodAccessorImpl.java:43)
[2019-04-10T10:24:11.963Z] at java.lang.reflect.Method.invoke (Method.java:498)
[2019-04-10T10:24:11.963Z] at org.codehaus.plexus.classworlds.launcher.Launcher.launchEnhanced (Launcher.java:289)
[2019-04-10T10:24:11.963Z] at org.codehaus.plexus.classworlds.launcher.Launcher.launch (Launcher.java:229)
[2019-04-10T10:24:11.963Z] at org.codehaus.plexus.classworlds.launcher.Launcher.mainWithExitCode (Launcher.java:415)
[2019-04-10T10:24:11.963Z] at org.codehaus.plexus.classworlds.launcher.Launcher.main (Launcher.java:356)
[2019-04-10T10:24:11.963Z] Caused by: org.apache.maven.plugin.MojoFailureException: There are test failures.
[2019-04-10T10:24:11.963Z]
[2019-04-10T10:24:11.963Z] Please refer to C:\Users\jenkins\AppData\Local\Temp\2\jenkins-maven-box-maven-surefire-SUREFIRE-1617-8\surefire-its\target\failsafe-reports for the individual test results.
[2019-04-10T10:24:11.963Z] Please refer to dump files (if any exist) [date].dump, [date]-jvmRun[N].dump and [date].dumpstream.
[2019-04-10T10:24:11.963Z] at org.apache.maven.plugin.surefire.SurefireHelper.throwException (SurefireHelper.java:271)
[2019-04-10T10:24:11.963Z] at org.apache.maven.plugin.surefire.SurefireHelper.reportExecution (SurefireHelper.java:159)
[2019-04-10T10:24:11.963Z] at org.apache.maven.plugin.failsafe.VerifyMojo.execute (VerifyMojo.java:192)
[2019-04-10T10:24:11.963Z] at org.apache.maven.plugin.DefaultBuildPluginManager.executeMojo (DefaultBuildPluginManager.java:137)
[2019-04-10T10:24:11.963Z] at org.apache.maven.lifecycle.internal.MojoExecutor.execute (MojoExecutor.java:210)
[2019-04-10T10:24:11.963Z] at org.apache.maven.lifecycle.internal.MojoExecutor.execute (MojoExecutor.java:156)
[2019-04-10T10:24:11.963Z] at org.apache.maven.lifecycle.internal.MojoExecutor.execute (MojoExecutor.java:148)
[2019-04-10T10:24:11.963Z] at org.apache.maven.lifecycle.internal.LifecycleModuleBuilder.buildProject (LifecycleModuleBuilder.java:117)
[2019-04-10T10:24:11.963Z] at org.apache.maven.lifecycle.internal.LifecycleModuleBuilder.buildProject (LifecycleModuleBuilder.java:81)
[2019-04-10T10:24:11.963Z] at org.apache.maven.lifecycle.internal.builder.singlethreaded.SingleThreadedBuilder.build (SingleThreadedBuilder.java:56)
[2019-04-10T10:24:11.963Z] at org.apache.maven.lifecycle.internal.LifecycleStarter.execute (LifecycleStarter.java:128)
[2019-04-10T10:24:11.963Z] at org.apache.maven.DefaultMaven.doExecute (DefaultMaven.java:305)
[2019-04-10T10:24:11.963Z] at org.apache.maven.DefaultMaven.doExecute (DefaultMaven.java:192)
[2019-04-10T10:24:11.963Z] at org.apache.maven.DefaultMaven.execute (DefaultMaven.java:105)
[2019-04-10T10:24:11.963Z] at org.apache.maven.cli.MavenCli.execute (MavenCli.java:956)
[2019-04-10T10:24:11.963Z] at org.apache.maven.cli.MavenCli.doMain (MavenCli.java:288)
[2019-04-10T10:24:11.963Z] at org.apache.maven.cli.MavenCli.main (MavenCli.java:192)
[2019-04-10T10:24:11.963Z] at sun.reflect.NativeMethodAccessorImpl.invoke0 (Native Method)
[2019-04-10T10:24:11.963Z] at sun.reflect.NativeMethodAccessorImpl.invoke (NativeMethodAccessorImpl.java:62)
[2019-04-10T10:24:11.963Z] at sun.reflect.DelegatingMethodAccessorImpl.invoke (DelegatingMethodAccessorImpl.java:43)
[2019-04-10T10:24:11.963Z] at java.lang.reflect.Method.invoke (Method.java:498)
[2019-04-10T10:24:11.963Z] at org.codehaus.plexus.classworlds.launcher.Launcher.launchEnhanced (Launcher.java:289)
[2019-04-10T10:24:11.963Z] at org.codehaus.plexus.classworlds.launcher.Launcher.launch (Launcher.java:229)
[2019-04-10T10:24:11.963Z] at org.codehaus.plexus.classworlds.launcher.Launcher.mainWithExitCode (Launcher.java:415)
[2019-04-10T10:24:11.963Z] at org.codehaus.plexus.classworlds.launcher.Launcher.main (Launcher.java:356)
[2019-04-10T10:24:11.963Z] [ERROR]
[2019-04-10T10:24:11.963Z] [ERROR] Re-run Maven using the -X switch to enable full debug logging.
[2019-04-10T10:24:11.963Z] [ERROR]
[2019-04-10T10:24:11.963Z] [ERROR] For more information about the errors and possible solutions, please read the following articles:
[2019-04-10T10:24:11.963Z] [ERROR] [Help 1] http://cwiki.apache.org/confluence/display/MAVEN/MojoFailureException
[2019-04-10T10:24:11.963Z] [ERROR]
[2019-04-10T10:24:11.963Z] [ERROR] After correcting the problems, you can resume the build with the command
[2019-04-10T10:24:11.964Z] [ERROR] mvn <goals> -rf :surefire-its
[Pipeline] }
[Pipeline] // withEnv
[Pipeline] }
[Pipeline] // stage
[Pipeline] fileExists
[Pipeline] zip
[2019-04-10T10:24:12.485Z] Writing zip file of C:\Users\jenkins\AppData\Local\Temp\2\jenkins-maven-box-maven-surefire-SUREFIRE-1617-8\maven-failsafe-plugin\target\it to C:\Users\jenkins\AppData\Local\Temp\2\jenkins-maven-box-maven-surefire-SUREFIRE-1617-8\maven-failsafe-plugin--windows-jdk7-maven3.6.x.zip
[2019-04-10T10:24:12.586Z] Zipped 78 entries.
[2019-04-10T10:24:12.586Z] Archiving C:\Users\jenkins\AppData\Local\Temp\2\jenkins-maven-box-maven-surefire-SUREFIRE-1617-8\maven-failsafe-plugin--windows-jdk7-maven3.6.x.zip
[2019-04-10T10:24:12.597Z] [Fast Archiver] No artifacts from Maven TLP » maven-surefire » SUREFIRE-1617 #7 to compare, so performing full copy of artifacts
[Pipeline] fileExists
[Pipeline] zip
[2019-04-10T10:24:12.765Z] Writing zip file of C:\Users\jenkins\AppData\Local\Temp\2\jenkins-maven-box-maven-surefire-SUREFIRE-1617-8\surefire-its\target to C:\Users\jenkins\AppData\Local\Temp\2\jenkins-maven-box-maven-surefire-SUREFIRE-1617-8\surefire-its--windows-jdk7-maven3.6.x.zip
[2019-04-10T10:24:31.393Z] Zipped 15886 entries.
[2019-04-10T10:24:31.393Z] Archiving C:\Users\jenkins\AppData\Local\Temp\2\jenkins-maven-box-maven-surefire-SUREFIRE-1617-8\surefire-its--windows-jdk7-maven3.6.x.zip
[2019-04-10T10:24:31.394Z] [Fast Archiver] No artifacts from Maven TLP » maven-surefire » SUREFIRE-1617 #7 to compare, so performing full copy of artifacts
[Pipeline] archiveArtifacts
[2019-04-10T10:24:36.007Z] Archiving artifacts
[2019-04-10T10:24:36.034Z] [Fast Archiver] No artifacts from Maven TLP » maven-surefire » SUREFIRE-1617 #7 to compare, so performing full copy of artifacts
[Pipeline] cleanWs
[2019-04-10T10:24:38.158Z] [WS-CLEANUP] Deleting project workspace...
[2019-04-10T10:24:38.159Z] [WS-CLEANUP] Deferred wipeout is used...
[2019-04-10T10:24:38.337Z] [WS-CLEANUP] done
[Pipeline] }
[Pipeline] // ws
[Pipeline] }
[Pipeline] // timestamps
[Pipeline] }
[Pipeline] // node
[Pipeline] }
[Pipeline] // parallel
[Pipeline] echo
Build result: FAILURE
[Pipeline] jiraIssueSelector
[Pipeline] emailext
Build succeeded in Jenkins: Maven TLP » maven-surefire » SUREFIRE-1617 #9
Posted by Apache Jenkins Server <je...@builds.apache.org>.
See https://builds.apache.org/job/maven-box/job/maven-surefire/job/SUREFIRE-1617/9/
No changes.
All tests passed