You are viewing a plain text version of this content. The canonical link for it is here.
Posted to builds@beam.apache.org by Apache Jenkins Server <je...@builds.apache.org> on 2022/01/16 12:02:28 UTC
Build failed in Jenkins: beam_PostCommit_XVR_Samza #719
See <https://ci-beam.apache.org/job/beam_PostCommit_XVR_Samza/719/display/redirect>
Changes:
------------------------------------------
Started by timer
Running as SYSTEM
[EnvInject] - Loading node environment variables.
Building remotely on apache-beam-jenkins-8 (beam) in workspace <https://ci-beam.apache.org/job/beam_PostCommit_XVR_Samza/ws/>
The recommended git tool is: NONE
No credentials specified
Wiping out workspace first.
Cloning the remote Git repository
Cloning repository https://github.com/apache/beam.git
> git init <https://ci-beam.apache.org/job/beam_PostCommit_XVR_Samza/ws/src> # timeout=10
Fetching upstream changes from https://github.com/apache/beam.git
> git --version # timeout=10
> git --version # 'git version 2.7.4'
> git fetch --tags --progress https://github.com/apache/beam.git +refs/heads/*:refs/remotes/origin/* # timeout=10
> git config remote.origin.url https://github.com/apache/beam.git # timeout=10
> git config --add remote.origin.fetch +refs/heads/*:refs/remotes/origin/* # timeout=10
> git config remote.origin.url https://github.com/apache/beam.git # timeout=10
Fetching upstream changes from https://github.com/apache/beam.git
> git fetch --tags --progress https://github.com/apache/beam.git +refs/heads/*:refs/remotes/origin/* +refs/pull/${ghprbPullId}/*:refs/remotes/origin/pr/${ghprbPullId}/* # timeout=10
> git rev-parse origin/master^{commit} # timeout=10
Checking out Revision 38b7e47b49173e5836ab628c159e379aab3f2ad9 (origin/master)
> git config core.sparsecheckout # timeout=10
> git checkout -f 38b7e47b49173e5836ab628c159e379aab3f2ad9 # timeout=10
Commit message: "[BEAM-13664] Fix Primitives hashing benchmark (#16523)"
> git rev-list --no-walk 38b7e47b49173e5836ab628c159e379aab3f2ad9 # timeout=10
No emails were triggered.
[EnvInject] - Executing scripts and injecting environment variables after the SCM step.
[EnvInject] - Injecting as environment variables the properties content
SPARK_LOCAL_IP=127.0.0.1
SETUPTOOLS_USE_DISTUTILS=stdlib
[EnvInject] - Variables injected successfully.
[beam_PostCommit_XVR_Samza] $ /bin/bash -xe /tmp/jenkins6107316764352830767.sh
+ echo '*** RUN CROSS-LANGUAGE SAMZA USING PYTHON 3.6 ***'
*** RUN CROSS-LANGUAGE SAMZA USING PYTHON 3.6 ***
[Gradle] - Launching build.
[src] $ <https://ci-beam.apache.org/job/beam_PostCommit_XVR_Samza/ws/src/gradlew> --continue --max-workers=12 -Dorg.gradle.jvmargs=-Xms2g -Dorg.gradle.jvmargs=-Xmx4g -Dorg.gradle.vfs.watch=false -Pdocker-pull-licenses -PpythonVersion=3.6 :runners:samza:job-server:validatesCrossLanguageRunner
Starting a Gradle Daemon, 2 busy Daemons could not be reused, use --status for details
Configuration on demand is an incubating feature.
> Task :buildSrc:compileJava NO-SOURCE
> Task :buildSrc:compileGroovy FROM-CACHE
> Task :buildSrc:pluginDescriptors
> Task :buildSrc:processResources
> Task :buildSrc:classes
> Task :buildSrc:jar
> Task :buildSrc:assemble
> Task :buildSrc:spotlessGroovy FROM-CACHE
> Task :buildSrc:spotlessGroovyCheck UP-TO-DATE
> Task :buildSrc:spotlessGroovyGradle FROM-CACHE
> Task :buildSrc:spotlessGroovyGradleCheck UP-TO-DATE
> Task :buildSrc:spotlessCheck UP-TO-DATE
> Task :buildSrc:pluginUnderTestMetadata
> Task :buildSrc:compileTestJava NO-SOURCE
> Task :buildSrc:compileTestGroovy NO-SOURCE
> Task :buildSrc:processTestResources NO-SOURCE
> Task :buildSrc:testClasses UP-TO-DATE
> Task :buildSrc:test NO-SOURCE
> Task :buildSrc:validatePlugins FROM-CACHE
> Task :buildSrc:check UP-TO-DATE
> Task :buildSrc:build
> Configure project :sdks:go:test
System Go installation: /usr/bin/go is go version go1.16.13 linux/amd64; Preparing to use /home/jenkins/go/bin/go1.16.12
go1.16.12: already downloaded in /home/jenkins/sdk/go1.16.12
GOCMD=/home/jenkins/go/bin/go1.16.12
FAILURE: Build failed with an exception.
* What went wrong:
Could not determine the dependencies of task ':runners:samza:job-server:shadowJar'.
> Could not resolve all dependencies for configuration ':runners:samza:job-server:runtimeClasspath'.
> Could not resolve net.minidev:json-smart:[1.3.1,2.3].
Required by:
project :runners:samza:job-server > project :runners:samza > org.apache.samza:samza-yarn_2.11:1.5.0 > org.apache.hadoop:hadoop-common:2.10.1 > org.apache.hadoop:hadoop-auth:2.10.1 > com.nimbusds:nimbus-jose-jwt:7.9
> Failed to list versions for net.minidev:json-smart.
> Unable to load Maven meta-data from https://jcenter.bintray.com/net/minidev/json-smart/maven-metadata.xml.
> Could not HEAD 'https://jcenter.bintray.com/net/minidev/json-smart/maven-metadata.xml'. Received status code 502 from server: Bad Gateway
* Try:
> Run with --stacktrace option to get the stack trace.
> Run with --info or --debug option to get more log output.
> Run with --scan to get full insights.
* Get more help at https://help.gradle.org
Deprecated Gradle features were used in this build, making it incompatible with Gradle 8.0.
You can use '--warning-mode all' to show the individual deprecation warnings and determine if they come from your own scripts or plugins.
See https://docs.gradle.org/7.3.2/userguide/command_line_interface.html#sec:command_line_warnings
BUILD FAILED in 56s
10 actionable tasks: 4 executed, 4 from cache, 2 up-to-date
Publishing build scan...
https://scans.gradle.com/s/ggy54lvr6wkxq
Build step 'Invoke Gradle script' changed build result to FAILURE
Build step 'Invoke Gradle script' marked build as failure
---------------------------------------------------------------------
To unsubscribe, e-mail: builds-unsubscribe@beam.apache.org
For additional commands, e-mail: builds-help@beam.apache.org
Jenkins build is back to normal : beam_PostCommit_XVR_Samza #721
Posted by Apache Jenkins Server <je...@builds.apache.org>.
See <https://ci-beam.apache.org/job/beam_PostCommit_XVR_Samza/721/display/redirect>
---------------------------------------------------------------------
To unsubscribe, e-mail: builds-unsubscribe@beam.apache.org
For additional commands, e-mail: builds-help@beam.apache.org
beam_PostCommit_XVR_Samza - Build # 720 - Aborted!
Posted by Apache Jenkins Server <je...@builds.apache.org>.
beam_PostCommit_XVR_Samza - Build # 720 - Aborted:
Check console output at https://ci-beam.apache.org/job/beam_PostCommit_XVR_Samza/720/ to view the results.