You are viewing a plain text version of this content. The canonical link for it is here.
Posted to builds@cassandra.apache.org by Apache Jenkins Server <je...@builds.apache.org> on 2025/04/14 17:18:52 UTC

Build complete: Cassandra-trunk #2113 [UNSTABLE] f7462446a450eb40daeb93c61dd1a419f3dee6b4

-------------------------------------------------------------------------------
  Build Cassandra-trunk #2113 Still Unstable
  URL: https://ci-cassandra.apache.org/job/Cassandra-trunk/2113/
  -------------------------------------------------------------------------------
  Changes:
  [Berenguer Blasi] CASSANDRA-19633 Replaced node is stuck in a loop calculating ranges


  -------------------------------------------------------------------------------
  Failed Tests:
  12 tests failed.
FAILED:  dtest-latest.bootstrap_test.TestBootstrap.Tests / dtest-latest jdk11 20/64 / test_cleanup
FAILED:  dtest.cqlsh_tests.test_cqlsh_copy.TestCqlshCopy.Tests / dtest jdk17 7/64 / test_bulk_round_trip_with_single_core
FAILED:  org.apache.cassandra.simulator.test.ShortPaxosSimulationTest.Tests / simulator-dtest jdk11 / simulationTest-_jdk11_x86_64
FAILED:  org.apache.cassandra.transport.AuthMessageSizeLimitTest.Tests / test-compression jdk11 14/16 / sendTooBigAuthMultiFrameMessage-compression_jdk11_x86_64
FAILED:  org.apache.cassandra.transport.DriverBurnTest.Tests / test-burn jdk17 2/2 / measureLargeV4WithCompression-_jdk17_x86_64
FAILED:  dtest-novnode.repair_tests.repair_test.TestRepair.Tests / dtest-novnode jdk11 2/64 / test_multiple_concurrent_repairs
FAILED:  org.apache.cassandra.simulator.test.HarrySimulatorTest.Tests / simulator-dtest jdk11 / test-cassandra.testtag_IS_UNDEFINED
FAILED:  dtest-latest.largecolumn_test.TestLargeColumn.Tests / dtest-latest jdk11 34/64 / test_cleanup
FAILED:  dtest-latest.largecolumn_test.TestLargeColumn.Tests / dtest-latest jdk17 34/64 / test_cleanup
FAILED:  org.apache.cassandra.distributed.upgrade.ClusterMetadataUpgradeHarryTest.Tests / jvm-dtest-upgrade jdk11 6/6 / simpleUpgradeTest-cassandra.testtag_IS_UNDEFINED
FAILED:  org.apache.cassandra.fuzz.sai.MultiNodeSAITest.Tests / jvm-dtest jdk11 4/12 / indexOnlySaiTest-cassandra.testtag_IS_UNDEFINED
FAILED:  org.apache.cassandra.fuzz.sai.MultiNodeSAITest.Tests / jvm-dtest jdk17 4/12 / mixedFilteringSaiTest-cassandra.testtag_IS_UNDEFINED

  -------------------------------------------------------------------------------
  For complete test report and logs see https://nightlies.apache.org/cassandra/Cassandra-trunk/2113/