You are viewing a plain text version of this content. The canonical link for it is here.
Posted to dev@calcite.apache.org by Apache Jenkins Server <je...@builds.apache.org> on 2025/04/22 06:48:39 UTC

Build failed in Jenkins: Calcite » Calcite-snapshots #1327

See <https://ci-builds.apache.org/job/Calcite/job/Calcite-snapshots/1327/display/redirect?page=changes>

Changes:

[Alessandro Solimando] [CALCITE-5985] FilterTableFunctionTransposeRule should not use "Logical" RelNodes


------------------------------------------
[...truncated 95.73 KiB...]
  public static BinaryExpression addAssignChecked(Expression left,
                                 ^
<https://ci-builds.apache.org/job/Calcite/job/Calcite-snapshots/ws/linq4j/src/main/java/org/apache/calcite/linq4j/tree/Expressions.java>:126: warning: no @return
  public static BinaryExpression addAssignChecked(Expression left,
                                 ^
<https://ci-builds.apache.org/job/Calcite/job/Calcite-snapshots/ws/linq4j/src/main/java/org/apache/calcite/linq4j/tree/Expressions.java>:135: warning: no @param for left
  public static BinaryExpression addAssignChecked(Expression left,
                                 ^
<https://ci-builds.apache.org/job/Calcite/job/Calcite-snapshots/ws/linq4j/src/main/java/org/apache/calcite/linq4j/tree/Expressions.java>:135: warning: no @param for right
  public static BinaryExpression addAssignChecked(Expression left,
                                 ^
<https://ci-builds.apache.org/job/Calcite/job/Calcite-snapshots/ws/linq4j/src/main/java/org/apache/calcite/linq4j/tree/Expressions.java>:135: warning: no @param for method
  public static BinaryExpression addAssignChecked(Expression left,
                                 ^
<https://ci-builds.apache.org/job/Calcite/job/Calcite-snapshots/ws/linq4j/src/main/java/org/apache/calcite/linq4j/tree/Expressions.java>:135: warning: no @return
  public static BinaryExpression addAssignChecked(Expression left,
                                 ^
<https://ci-builds.apache.org/job/Calcite/job/Calcite-snapshots/ws/linq4j/src/main/java/org/apache/calcite/linq4j/tree/Expressions.java>:144: warning: no @param for left
  public static BinaryExpression addAssignChecked(Expression left,
                                 ^
<https://ci-builds.apache.org/job/Calcite/job/Calcite-snapshots/ws/linq4j/src/main/java/org/apache/calcite/linq4j/tree/Expressions.java>:144: warning: no @param for right
  public static BinaryExpression addAssignChecked(Expression left,
                                 ^
<https://ci-builds.apache.org/job/Calcite/job/Calcite-snapshots/ws/linq4j/src/main/java/org/apache/calcite/linq4j/tree/Expressions.java>:144: warning: no @param for method
  public static BinaryExpression addAssignChecked(Expression left,
                                 ^
<https://ci-builds.apache.org/job/Calcite/job/Calcite-snapshots/ws/linq4j/src/main/java/org/apache/calcite/linq4j/tree/Expressions.java>:144: warning: no @param for lambdaExpression
  public static BinaryExpression addAssignChecked(Expression left,
                                 ^
<https://ci-builds.apache.org/job/Calcite/job/Calcite-snapshots/ws/linq4j/src/main/java/org/apache/calcite/linq4j/tree/Expressions.java>:144: warning: no @return
  public static BinaryExpression addAssignChecked(Expression left,
                                 ^
<https://ci-builds.apache.org/job/Calcite/job/Calcite-snapshots/ws/linq4j/src/main/java/org/apache/calcite/linq4j/tree/Expressions.java>:153: warning: no @param for left
  public static BinaryExpression addChecked(Expression left, Expression right) {
                                 ^
<https://ci-builds.apache.org/job/Calcite/job/Calcite-snapshots/ws/linq4j/src/main/java/org/apache/calcite/linq4j/tree/Expressions.java>:153: warning: no @param for right
  public static BinaryExpression addChecked(Expression left, Expression right) {
                                 ^
<https://ci-builds.apache.org/job/Calcite/job/Calcite-snapshots/ws/linq4j/src/main/java/org/apache/calcite/linq4j/tree/Expressions.java>:153: warning: no @return
  public static BinaryExpression addChecked(Expression left, Expression right) {
                                 ^
<https://ci-builds.apache.org/job/Calcite/job/Calcite-snapshots/ws/linq4j/src/main/java/org/apache/calcite/linq4j/tree/Expressions.java>:162: warning: no @param for left
  public static BinaryExpression addChecked(Expression left, Expression right,
                                 ^
<https://ci-builds.apache.org/job/Calcite/job/Calcite-snapshots/ws/linq4j/src/main/java/org/apache/calcite/linq4j/tree/Expressions.java>:162: warning: no @param for right
  public static BinaryExpression addChecked(Expression left, Expression right,
                                 ^
<https://ci-builds.apache.org/job/Calcite/job/Calcite-snapshots/ws/linq4j/src/main/java/org/apache/calcite/linq4j/tree/Expressions.java>:162: warning: no @param for method
  public static BinaryExpression addChecked(Expression left, Expression right,
                                 ^
<https://ci-builds.apache.org/job/Calcite/job/Calcite-snapshots/ws/linq4j/src/main/java/org/apache/calcite/linq4j/tree/Expressions.java>:162: warning: no @return
  public static BinaryExpression addChecked(Expression left, Expression right,
                                 ^
<https://ci-builds.apache.org/job/Calcite/job/Calcite-snapshots/ws/linq4j/src/main/java/org/apache/calcite/linq4j/tree/Expressions.java>:171: warning: no @param for left
  public static BinaryExpression and(Expression left, Expression right) {
                                 ^
<https://ci-builds.apache.org/job/Calcite/job/Calcite-snapshots/ws/linq4j/src/main/java/org/apache/calcite/linq4j/tree/Expressions.java>:171: warning: no @param for right
  public static BinaryExpression and(Expression left, Expression right) {
                                 ^
<https://ci-builds.apache.org/job/Calcite/job/Calcite-snapshots/ws/linq4j/src/main/java/org/apache/calcite/linq4j/tree/Expressions.java>:171: warning: no @return
  public static BinaryExpression and(Expression left, Expression right) {
                                 ^
<https://ci-builds.apache.org/job/Calcite/job/Calcite-snapshots/ws/linq4j/src/main/java/org/apache/calcite/linq4j/tree/Expressions.java>:179: warning: no @param for left
  public static BinaryExpression and(Expression left, Expression right,
                                 ^
<https://ci-builds.apache.org/job/Calcite/job/Calcite-snapshots/ws/linq4j/src/main/java/org/apache/calcite/linq4j/tree/Expressions.java>:179: warning: no @param for right
  public static BinaryExpression and(Expression left, Expression right,
                                 ^
<https://ci-builds.apache.org/job/Calcite/job/Calcite-snapshots/ws/linq4j/src/main/java/org/apache/calcite/linq4j/tree/Expressions.java>:179: warning: no @param for method
  public static BinaryExpression and(Expression left, Expression right,
                                 ^
<https://ci-builds.apache.org/job/Calcite/job/Calcite-snapshots/ws/linq4j/src/main/java/org/apache/calcite/linq4j/tree/Expressions.java>:179: warning: no @return
  public static BinaryExpression and(Expression left, Expression right,
                                 ^
<https://ci-builds.apache.org/job/Calcite/job/Calcite-snapshots/ws/linq4j/src/main/java/org/apache/calcite/linq4j/tree/Expressions.java>:189: warning: no @param for left
  public static BinaryExpression andAlso(Expression left, Expression right) {
                                 ^
<https://ci-builds.apache.org/job/Calcite/job/Calcite-snapshots/ws/linq4j/src/main/java/org/apache/calcite/linq4j/tree/Expressions.java>:189: warning: no @param for right
  public static BinaryExpression andAlso(Expression left, Expression right) {
                                 ^
<https://ci-builds.apache.org/job/Calcite/job/Calcite-snapshots/ws/linq4j/src/main/java/org/apache/calcite/linq4j/tree/Expressions.java>:189: warning: no @return
  public static BinaryExpression andAlso(Expression left, Expression right) {
                                 ^
<https://ci-builds.apache.org/job/Calcite/job/Calcite-snapshots/ws/linq4j/src/main/java/org/apache/calcite/linq4j/tree/Expressions.java>:199: warning: no @param for left
  public static BinaryExpression andAlso(Expression left, Expression right,
                                 ^
<https://ci-builds.apache.org/job/Calcite/job/Calcite-snapshots/ws/linq4j/src/main/java/org/apache/calcite/linq4j/tree/Expressions.java>:199: warning: no @param for right
  public static BinaryExpression andAlso(Expression left, Expression right,
                                 ^
<https://ci-builds.apache.org/job/Calcite/job/Calcite-snapshots/ws/linq4j/src/main/java/org/apache/calcite/linq4j/tree/Expressions.java>:199: warning: no @param for method
  public static BinaryExpression andAlso(Expression left, Expression right,
                                 ^
<https://ci-builds.apache.org/job/Calcite/job/Calcite-snapshots/ws/linq4j/src/main/java/org/apache/calcite/linq4j/tree/Expressions.java>:199: warning: no @return
  public static BinaryExpression andAlso(Expression left, Expression right,
                                 ^
<https://ci-builds.apache.org/job/Calcite/job/Calcite-snapshots/ws/linq4j/src/main/java/org/apache/calcite/linq4j/tree/Expressions.java>:208: warning: no @param for left
  public static BinaryExpression andAssign(Expression left, Expression right) {
                                 ^
<https://ci-builds.apache.org/job/Calcite/job/Calcite-snapshots/ws/linq4j/src/main/java/org/apache/calcite/linq4j/tree/Expressions.java>:208: warning: no @param for right
  public static BinaryExpression andAssign(Expression left, Expression right) {
                                 ^
<https://ci-builds.apache.org/job/Calcite/job/Calcite-snapshots/ws/linq4j/src/main/java/org/apache/calcite/linq4j/tree/Expressions.java>:208: warning: no @return
  public static BinaryExpression andAssign(Expression left, Expression right) {
                                 ^
<https://ci-builds.apache.org/job/Calcite/job/Calcite-snapshots/ws/linq4j/src/main/java/org/apache/calcite/linq4j/tree/Expressions.java>:216: warning: no @param for left
  public static BinaryExpression andAssign(Expression left, Expression right,
                                 ^
<https://ci-builds.apache.org/job/Calcite/job/Calcite-snapshots/ws/linq4j/src/main/java/org/apache/calcite/linq4j/tree/Expressions.java>:216: warning: no @param for right
  public static BinaryExpression andAssign(Expression left, Expression right,
                                 ^
<https://ci-builds.apache.org/job/Calcite/job/Calcite-snapshots/ws/linq4j/src/main/java/org/apache/calcite/linq4j/tree/Expressions.java>:216: warning: no @param for method
  public static BinaryExpression andAssign(Expression left, Expression right,
                                 ^
<https://ci-builds.apache.org/job/Calcite/job/Calcite-snapshots/ws/linq4j/src/main/java/org/apache/calcite/linq4j/tree/Expressions.java>:216: warning: no @return
  public static BinaryExpression andAssign(Expression left, Expression right,
                                 ^
<https://ci-builds.apache.org/job/Calcite/job/Calcite-snapshots/ws/linq4j/src/main/java/org/apache/calcite/linq4j/tree/Expressions.java>:225: warning: no @param for left
  public static BinaryExpression andAssign(Expression left, Expression right,
                                 ^
<https://ci-builds.apache.org/job/Calcite/job/Calcite-snapshots/ws/linq4j/src/main/java/org/apache/calcite/linq4j/tree/Expressions.java>:225: warning: no @param for right
  public static BinaryExpression andAssign(Expression left, Expression right,
                                 ^
<https://ci-builds.apache.org/job/Calcite/job/Calcite-snapshots/ws/linq4j/src/main/java/org/apache/calcite/linq4j/tree/Expressions.java>:225: warning: no @param for method
  public static BinaryExpression andAssign(Expression left, Expression right,
                                 ^
<https://ci-builds.apache.org/job/Calcite/job/Calcite-snapshots/ws/linq4j/src/main/java/org/apache/calcite/linq4j/tree/Expressions.java>:225: warning: no @param for lambdaExpression
  public static BinaryExpression andAssign(Expression left, Expression right,
                                 ^
<https://ci-builds.apache.org/job/Calcite/job/Calcite-snapshots/ws/linq4j/src/main/java/org/apache/calcite/linq4j/tree/Expressions.java>:225: warning: no @return
  public static BinaryExpression andAssign(Expression left, Expression right,
                                 ^
<https://ci-builds.apache.org/job/Calcite/job/Calcite-snapshots/ws/linq4j/src/main/java/org/apache/calcite/linq4j/tree/Expressions.java>:234: warning: no @param for array
  public static IndexExpression arrayIndex(Expression array,
                                ^
<https://ci-builds.apache.org/job/Calcite/job/Calcite-snapshots/ws/linq4j/src/main/java/org/apache/calcite/linq4j/tree/Expressions.java>:234: warning: no @param for indexExpression
  public static IndexExpression arrayIndex(Expression array,
                                ^
<https://ci-builds.apache.org/job/Calcite/job/Calcite-snapshots/ws/linq4j/src/main/java/org/apache/calcite/linq4j/tree/Expressions.java>:234: warning: no @return
  public static IndexExpression arrayIndex(Expression array,
                                ^
100 warnings

> Task :linq4j:javadocJar
> Task :server:generatePomFileForServerPublication
> Task :splunk:generatePomFileForSplunkPublication
> Task :example:csv:generatePomFileForCsvPublication
> Task :example:function:generatePomFileForFunctionPublication

> Task :linq4j:test
          0.1sec,    1 completed,   0 failed,   0 skipped, org.apache.calcite.linq4j.tree.TypeTest
          0.1sec,    2 completed,   0 failed,   0 skipped, org.apache.calcite.linq4j.MemoryEnumerableTest
          0.1sec,    4 completed,   0 failed,   0 skipped, org.apache.calcite.linq4j.function.FunctionTest
          0.1sec,    6 completed,   0 failed,   0 skipped, org.apache.calcite.linq4j.test.BlockBuilderTest
          0.2sec,    9 completed,   0 failed,   0 skipped, org.apache.calcite.linq4j.test.PrimitiveTest
          0.2sec,    2 completed,   0 failed,   0 skipped, org.apache.calcite.linq4j.test.LookupImplTest
          0.2sec,    4 completed,   0 failed,   0 skipped, org.apache.calcite.linq4j.test.CorrelateJoinTest
          0.2sec,   11 completed,   0 failed,   0 skipped, org.apache.calcite.linq4j.test.InlinerTest
          0.2sec,   16 completed,   0 failed,   0 skipped, org.apache.calcite.linq4j.test.DeterministicTest
          0.3sec,   84 completed,   0 failed,   0 skipped, org.apache.calcite.linq4j.test.OptimizerTest
WARNING   0.5sec,   50 completed,   0 failed,   1 skipped, org.apache.calcite.linq4j.test.ExpressionTest

Linq4jTest > testSkip() STANDARD_OUT
    Employee(name: Fred, deptno:10)

JoinPreserveOrderTest > innerJoinPreservesOrderOfLeftInput(Field, Field) > [17] on='name', asc=true, nullsFirst=false}, on='deptno', asc=true, nullsFirst=true} STANDARD_OUT
    Employee(name: Bill, deptno:30)

JoinPreserveOrderTest > leftNestedLoopJoinPreservesOrderOfLeftInput(Field, Field) STANDARD_OUT
    Employee(name: Eric, deptno:10)

JoinPreserveOrderTest > antiCorrelateJoinPreservesOrderOfLeftInput(Field, Field) STANDARD_OUT
    Employee(name: Janet, deptno:10)

JoinPreserveOrderTest > correlateBatchJoin(Field, Field) STANDARD_OUT
    Department(name: Sales, deptno:10, employees: [Employee(name: Fred, deptno:10), Employee(name: Eric, deptno:10), Employee(name: Janet, deptno:10)])

JoinPreserveOrderTest > antiDefaultJoinPreservesOrderOfLeftInput(Field, Field) STANDARD_OUT
    Department(name: HR, deptno:20, employees: [])

JoinPreserveOrderTest > rightJoinPreservesOrderOfLeftInput(Field, Field) > [17] on='name', asc=false, nullsFirst=false}, on='deptno', asc=true, nullsFirst=true} STANDARD_OUT
    Department(name: Marketing, deptno:30, employees: [Employee(name: Bill, deptno:30)])

JoinPreserveOrderTest > leftCorrelateJoinPreservesOrderOfLeftInput(Field, Field) STANDARD_OUT
    Fred:null
    Eric:null
    Janet:Sales

JoinPreserveOrderTest > antiCorrelateJoinPreservesOrderOfLeftInput(Field, Field) > [20] on='name', asc=true, nullsFirst=false}, on='deptno', asc=false, nullsFirst=false} STANDARD_OUT
    Bill:null
          0.5sec,   72 completed,   0 failed,   0 skipped, org.apache.calcite.linq4j.test.JoinPreserveOrderTest > fullJoinPreservesOrderOfLeftInput(Field, Field)
          0.8sec,  119 completed,   0 failed,   0 skipped, org.apache.calcite.linq4j.test.Linq4jTest
          0.8sec,   72 completed,   0 failed,   0 skipped, org.apache.calcite.linq4j.test.JoinPreserveOrderTest > rightJoinPreservesOrderOfLeftInput(Field, Field)
          0.7sec,   72 completed,   0 failed,   0 skipped, org.apache.calcite.linq4j.test.JoinPreserveOrderTest > rightNestedLoopJoinPreservesOrderOfLeftInput(Field, Field)
          0.7sec,   72 completed,   0 failed,   0 skipped, org.apache.calcite.linq4j.test.JoinPreserveOrderTest > fullNestedLoopJoinPreservesOrderOfLeftInput(Field, Field)
          0.8sec,  144 completed,   0 failed,   0 skipped, org.apache.calcite.linq4j.test.JoinPreserveOrderTest > leftCorrelateJoinPreservesOrderOfLeftInput(Field, Field)
          1.1sec,  144 completed,   0 failed,   0 skipped, org.apache.calcite.linq4j.test.JoinPreserveOrderTest > antiDefaultJoinPreservesOrderOfLeftInput(Field, Field)
          0.9sec,  144 completed,   0 failed,   0 skipped, org.apache.calcite.linq4j.test.JoinPreserveOrderTest > leftJoinPreservesOrderOfLeftInput(Field, Field)
          0.9sec,  144 completed,   0 failed,   0 skipped, org.apache.calcite.linq4j.test.JoinPreserveOrderTest > leftNestedLoopJoinPreservesOrderOfLeftInput(Field, Field)
          1.0sec,  144 completed,   0 failed,   0 skipped, org.apache.calcite.linq4j.test.JoinPreserveOrderTest > semiCorrelateJoinPreservesOrderOfLeftInput(Field, Field)
          1.1sec,  144 completed,   0 failed,   0 skipped, org.apache.calcite.linq4j.test.JoinPreserveOrderTest > innerNestedLoopJoinPreservesOrderOfLeftInput(Field, Field)
          0.8sec,  144 completed,   0 failed,   0 skipped, org.apache.calcite.linq4j.test.JoinPreserveOrderTest > innerCorrelateJoinPreservesOrderOfLeftInput(Field, Field)
          0.8sec,  144 completed,   0 failed,   0 skipped, org.apache.calcite.linq4j.test.JoinPreserveOrderTest > correlateBatchJoin(Field, Field)
          0.8sec,  144 completed,   0 failed,   0 skipped, org.apache.calcite.linq4j.test.JoinPreserveOrderTest > innerJoinPreservesOrderOfLeftInput(Field, Field)
          0.8sec,  144 completed,   0 failed,   0 skipped, org.apache.calcite.linq4j.test.JoinPreserveOrderTest > semiDefaultJoinPreservesOrderOfLeftInput(Field, Field)
          0.8sec,  144 completed,   0 failed,   0 skipped, org.apache.calcite.linq4j.test.JoinPreserveOrderTest > antiCorrelateJoinPreservesOrderOfLeftInput(Field, Field)
          1.1sec, 1872 completed,   0 failed,   0 skipped, org.apache.calcite.linq4j.test.JoinPreserveOrderTest
          2.3sec, org.apache.calcite.linq4j.test.LimitSortTest > test()
          2.3sec,    1 completed,   0 failed,   0 skipped, org.apache.calcite.linq4j.test.LimitSortTest
WARNING   3.7sec, 2181 completed,   0 failed,   1 skipped, Gradle Test Run :linq4j:test

> Task :linq4j:check
> Task :linq4j:build
> Task :linq4j:generateMetadataFileForLinq4jPublication SKIPPED
> Task :linq4j:generatePomFileForLinq4jPublication
> Task :linq4j:initializeNexusStagingRepository SKIPPED
> Task :testkit:generatePomFileForTestkitPublication
> Task :linq4j:publishLinq4jPublicationToNexusRepository FAILED

FAILURE: Build failed with an exception.

* What went wrong:
Execution failed for task ':linq4j:publishLinq4jPublicationToNexusRepository'.
> Failed to publish publication 'linq4j' to repository 'nexus'
   > Could not PUT 'https://repository.apache.org/content/repositories/snapshots/org/apache/calcite/calcite-linq4j/1.40.0-SNAPSHOT/maven-metadata.xml'. Received status code 401 from server: Unauthorized

* Try:
> Run with --stacktrace option to get the stack trace.
> Run with --info or --debug option to get more log output.
> Get more help at https://help.gradle.org.

Deprecated Gradle features were used in this build, making it incompatible with Gradle 9.0.

You can use '--warning-mode all' to show the individual deprecation warnings and determine if they come from your own scripts or plugins.

For more on this, please refer to https://docs.gradle.org/8.7/userguide/command_line_interface.html#sec:command_line_warnings in the Gradle documentation.

BUILD FAILED in 2m 31s
234 actionable tasks: 234 executed

Publishing build scan...
https://develocity.apache.org/s/6iea5hksyjwda


See the profiling report at: file://<https://ci-builds.apache.org/job/Calcite/job/Calcite-snapshots/ws/build/reports/profile/profile-2025-04-22-06-46-07.html>
A fine-grained performance profile is available: use the --scan option.
Build step 'Invoke Gradle script' changed build result to FAILURE
Build step 'Invoke Gradle script' marked build as failure
Recording test results
[Checks API] No suitable checks publisher found.

Build failed in Jenkins: Calcite » Calcite-snapshots #1329

Posted by Apache Jenkins Server <je...@builds.apache.org>.
See <https://ci-builds.apache.org/job/Calcite/job/Calcite-snapshots/1329/display/redirect?page=changes>

Changes:

[mbudiu] [CALCITE-6974] Default typesystem has incorrect limits for DECIMAL for Presto/MySQL/Phoenix


------------------------------------------
[...truncated 93.90 KiB...]
<https://ci-builds.apache.org/job/Calcite/job/Calcite-snapshots/ws/linq4j/src/main/java/org/apache/calcite/linq4j/tree/Expressions.java>:144: warning: no @param for left
  public static BinaryExpression addAssignChecked(Expression left,
                                 ^
<https://ci-builds.apache.org/job/Calcite/job/Calcite-snapshots/ws/linq4j/src/main/java/org/apache/calcite/linq4j/tree/Expressions.java>:144: warning: no @param for right
  public static BinaryExpression addAssignChecked(Expression left,
                                 ^
<https://ci-builds.apache.org/job/Calcite/job/Calcite-snapshots/ws/linq4j/src/main/java/org/apache/calcite/linq4j/tree/Expressions.java>:144: warning: no @param for method
  public static BinaryExpression addAssignChecked(Expression left,
                                 ^
<https://ci-builds.apache.org/job/Calcite/job/Calcite-snapshots/ws/linq4j/src/main/java/org/apache/calcite/linq4j/tree/Expressions.java>:144: warning: no @param for lambdaExpression
  public static BinaryExpression addAssignChecked(Expression left,
                                 ^
<https://ci-builds.apache.org/job/Calcite/job/Calcite-snapshots/ws/linq4j/src/main/java/org/apache/calcite/linq4j/tree/Expressions.java>:144: warning: no @return
  public static BinaryExpression addAssignChecked(Expression left,
                                 ^
<https://ci-builds.apache.org/job/Calcite/job/Calcite-snapshots/ws/linq4j/src/main/java/org/apache/calcite/linq4j/tree/Expressions.java>:153: warning: no @param for left
  public static BinaryExpression addChecked(Expression left, Expression right) {
                                 ^
<https://ci-builds.apache.org/job/Calcite/job/Calcite-snapshots/ws/linq4j/src/main/java/org/apache/calcite/linq4j/tree/Expressions.java>:153: warning: no @param for right
  public static BinaryExpression addChecked(Expression left, Expression right) {
                                 ^
<https://ci-builds.apache.org/job/Calcite/job/Calcite-snapshots/ws/linq4j/src/main/java/org/apache/calcite/linq4j/tree/Expressions.java>:153: warning: no @return
  public static BinaryExpression addChecked(Expression left, Expression right) {
                                 ^
<https://ci-builds.apache.org/job/Calcite/job/Calcite-snapshots/ws/linq4j/src/main/java/org/apache/calcite/linq4j/tree/Expressions.java>:162: warning: no @param for left
  public static BinaryExpression addChecked(Expression left, Expression right,
                                 ^
<https://ci-builds.apache.org/job/Calcite/job/Calcite-snapshots/ws/linq4j/src/main/java/org/apache/calcite/linq4j/tree/Expressions.java>:162: warning: no @param for right
  public static BinaryExpression addChecked(Expression left, Expression right,
                                 ^
<https://ci-builds.apache.org/job/Calcite/job/Calcite-snapshots/ws/linq4j/src/main/java/org/apache/calcite/linq4j/tree/Expressions.java>:162: warning: no @param for method
  public static BinaryExpression addChecked(Expression left, Expression right,
                                 ^
<https://ci-builds.apache.org/job/Calcite/job/Calcite-snapshots/ws/linq4j/src/main/java/org/apache/calcite/linq4j/tree/Expressions.java>:162: warning: no @return
  public static BinaryExpression addChecked(Expression left, Expression right,
                                 ^
<https://ci-builds.apache.org/job/Calcite/job/Calcite-snapshots/ws/linq4j/src/main/java/org/apache/calcite/linq4j/tree/Expressions.java>:171: warning: no @param for left
  public static BinaryExpression and(Expression left, Expression right) {
                                 ^
<https://ci-builds.apache.org/job/Calcite/job/Calcite-snapshots/ws/linq4j/src/main/java/org/apache/calcite/linq4j/tree/Expressions.java>:171: warning: no @param for right
  public static BinaryExpression and(Expression left, Expression right) {
                                 ^
<https://ci-builds.apache.org/job/Calcite/job/Calcite-snapshots/ws/linq4j/src/main/java/org/apache/calcite/linq4j/tree/Expressions.java>:171: warning: no @return
  public static BinaryExpression and(Expression left, Expression right) {
                                 ^
<https://ci-builds.apache.org/job/Calcite/job/Calcite-snapshots/ws/linq4j/src/main/java/org/apache/calcite/linq4j/tree/Expressions.java>:179: warning: no @param for left
  public static BinaryExpression and(Expression left, Expression right,
                                 ^
<https://ci-builds.apache.org/job/Calcite/job/Calcite-snapshots/ws/linq4j/src/main/java/org/apache/calcite/linq4j/tree/Expressions.java>:179: warning: no @param for right
  public static BinaryExpression and(Expression left, Expression right,
                                 ^
<https://ci-builds.apache.org/job/Calcite/job/Calcite-snapshots/ws/linq4j/src/main/java/org/apache/calcite/linq4j/tree/Expressions.java>:179: warning: no @param for method
  public static BinaryExpression and(Expression left, Expression right,
                                 ^
<https://ci-builds.apache.org/job/Calcite/job/Calcite-snapshots/ws/linq4j/src/main/java/org/apache/calcite/linq4j/tree/Expressions.java>:179: warning: no @return
  public static BinaryExpression and(Expression left, Expression right,
                                 ^
<https://ci-builds.apache.org/job/Calcite/job/Calcite-snapshots/ws/linq4j/src/main/java/org/apache/calcite/linq4j/tree/Expressions.java>:189: warning: no @param for left
  public static BinaryExpression andAlso(Expression left, Expression right) {
                                 ^
<https://ci-builds.apache.org/job/Calcite/job/Calcite-snapshots/ws/linq4j/src/main/java/org/apache/calcite/linq4j/tree/Expressions.java>:189: warning: no @param for right
  public static BinaryExpression andAlso(Expression left, Expression right) {
                                 ^
<https://ci-builds.apache.org/job/Calcite/job/Calcite-snapshots/ws/linq4j/src/main/java/org/apache/calcite/linq4j/tree/Expressions.java>:189: warning: no @return
  public static BinaryExpression andAlso(Expression left, Expression right) {
                                 ^
<https://ci-builds.apache.org/job/Calcite/job/Calcite-snapshots/ws/linq4j/src/main/java/org/apache/calcite/linq4j/tree/Expressions.java>:199: warning: no @param for left
  public static BinaryExpression andAlso(Expression left, Expression right,
                                 ^
<https://ci-builds.apache.org/job/Calcite/job/Calcite-snapshots/ws/linq4j/src/main/java/org/apache/calcite/linq4j/tree/Expressions.java>:199: warning: no @param for right
  public static BinaryExpression andAlso(Expression left, Expression right,
                                 ^
<https://ci-builds.apache.org/job/Calcite/job/Calcite-snapshots/ws/linq4j/src/main/java/org/apache/calcite/linq4j/tree/Expressions.java>:199: warning: no @param for method
  public static BinaryExpression andAlso(Expression left, Expression right,
                                 ^
<https://ci-builds.apache.org/job/Calcite/job/Calcite-snapshots/ws/linq4j/src/main/java/org/apache/calcite/linq4j/tree/Expressions.java>:199: warning: no @return
  public static BinaryExpression andAlso(Expression left, Expression right,
                                 ^
<https://ci-builds.apache.org/job/Calcite/job/Calcite-snapshots/ws/linq4j/src/main/java/org/apache/calcite/linq4j/tree/Expressions.java>:208: warning: no @param for left
  public static BinaryExpression andAssign(Expression left, Expression right) {
                                 ^
<https://ci-builds.apache.org/job/Calcite/job/Calcite-snapshots/ws/linq4j/src/main/java/org/apache/calcite/linq4j/tree/Expressions.java>:208: warning: no @param for right
  public static BinaryExpression andAssign(Expression left, Expression right) {
                                 ^
<https://ci-builds.apache.org/job/Calcite/job/Calcite-snapshots/ws/linq4j/src/main/java/org/apache/calcite/linq4j/tree/Expressions.java>:208: warning: no @return
  public static BinaryExpression andAssign(Expression left, Expression right) {
                                 ^
<https://ci-builds.apache.org/job/Calcite/job/Calcite-snapshots/ws/linq4j/src/main/java/org/apache/calcite/linq4j/tree/Expressions.java>:216: warning: no @param for left
  public static BinaryExpression andAssign(Expression left, Expression right,
                                 ^
<https://ci-builds.apache.org/job/Calcite/job/Calcite-snapshots/ws/linq4j/src/main/java/org/apache/calcite/linq4j/tree/Expressions.java>:216: warning: no @param for right
  public static BinaryExpression andAssign(Expression left, Expression right,
                                 ^
<https://ci-builds.apache.org/job/Calcite/job/Calcite-snapshots/ws/linq4j/src/main/java/org/apache/calcite/linq4j/tree/Expressions.java>:216: warning: no @param for method
  public static BinaryExpression andAssign(Expression left, Expression right,
                                 ^
<https://ci-builds.apache.org/job/Calcite/job/Calcite-snapshots/ws/linq4j/src/main/java/org/apache/calcite/linq4j/tree/Expressions.java>:216: warning: no @return
  public static BinaryExpression andAssign(Expression left, Expression right,
                                 ^
<https://ci-builds.apache.org/job/Calcite/job/Calcite-snapshots/ws/linq4j/src/main/java/org/apache/calcite/linq4j/tree/Expressions.java>:225: warning: no @param for left
  public static BinaryExpression andAssign(Expression left, Expression right,
                                 ^
<https://ci-builds.apache.org/job/Calcite/job/Calcite-snapshots/ws/linq4j/src/main/java/org/apache/calcite/linq4j/tree/Expressions.java>:225: warning: no @param for right
  public static BinaryExpression andAssign(Expression left, Expression right,
                                 ^
<https://ci-builds.apache.org/job/Calcite/job/Calcite-snapshots/ws/linq4j/src/main/java/org/apache/calcite/linq4j/tree/Expressions.java>:225: warning: no @param for method
  public static BinaryExpression andAssign(Expression left, Expression right,
                                 ^
<https://ci-builds.apache.org/job/Calcite/job/Calcite-snapshots/ws/linq4j/src/main/java/org/apache/calcite/linq4j/tree/Expressions.java>:225: warning: no @param for lambdaExpression
  public static BinaryExpression andAssign(Expression left, Expression right,
                                 ^
<https://ci-builds.apache.org/job/Calcite/job/Calcite-snapshots/ws/linq4j/src/main/java/org/apache/calcite/linq4j/tree/Expressions.java>:225: warning: no @return
  public static BinaryExpression andAssign(Expression left, Expression right,
                                 ^
<https://ci-builds.apache.org/job/Calcite/job/Calcite-snapshots/ws/linq4j/src/main/java/org/apache/calcite/linq4j/tree/Expressions.java>:234: warning: no @param for array
  public static IndexExpression arrayIndex(Expression array,
                                ^
<https://ci-builds.apache.org/job/Calcite/job/Calcite-snapshots/ws/linq4j/src/main/java/org/apache/calcite/linq4j/tree/Expressions.java>:234: warning: no @param for indexExpression
  public static IndexExpression arrayIndex(Expression array,
                                ^
<https://ci-builds.apache.org/job/Calcite/job/Calcite-snapshots/ws/linq4j/src/main/java/org/apache/calcite/linq4j/tree/Expressions.java>:234: warning: no @return
  public static IndexExpression arrayIndex(Expression array,
                                ^

> Task :cassandra:generatePomFileForCassandraPublication
> Task :druid:generatePomFileForDruidPublication
> Task :elasticsearch:generatePomFileForElasticsearchPublication
> Task :file:generatePomFileForFilePublication
> Task :geode:generatePomFileForGeodePublication
> Task :innodb:generatePomFileForInnodbPublication
> Task :kafka:generatePomFileForKafkaPublication
> Task :mongodb:generatePomFileForMongodbPublication
> Task :pig:generatePomFileForPigPublication
> Task :piglet:generatePomFileForPigletPublication
> Task :plus:generatePomFileForPlusPublication
> Task :redis:generatePomFileForRedisPublication
> Task :server:generatePomFileForServerPublication
> Task :spark:generatePomFileForSparkPublication
> Task :splunk:generatePomFileForSplunkPublication
> Task :example:csv:generatePomFileForCsvPublication
> Task :example:function:generatePomFileForFunctionPublication

> Task :linq4j:javadoc
100 warnings

> Task :linq4j:javadocJar
> Task :core:autostyleJavaCheck
> Task :testkit:generatePomFileForTestkitPublication

> Task :linq4j:test
          0.1sec,    1 completed,   0 failed,   0 skipped, org.apache.calcite.linq4j.tree.TypeTest
          0.1sec,    2 completed,   0 failed,   0 skipped, org.apache.calcite.linq4j.MemoryEnumerableTest
          0.1sec,    9 completed,   0 failed,   0 skipped, org.apache.calcite.linq4j.test.PrimitiveTest
          0.1sec,    4 completed,   0 failed,   0 skipped, org.apache.calcite.linq4j.function.FunctionTest
          0.1sec,    2 completed,   0 failed,   0 skipped, org.apache.calcite.linq4j.test.LookupImplTest
          0.1sec,    4 completed,   0 failed,   0 skipped, org.apache.calcite.linq4j.test.CorrelateJoinTest
          0.2sec,    6 completed,   0 failed,   0 skipped, org.apache.calcite.linq4j.test.BlockBuilderTest
          0.2sec,   11 completed,   0 failed,   0 skipped, org.apache.calcite.linq4j.test.InlinerTest
          0.2sec,   16 completed,   0 failed,   0 skipped, org.apache.calcite.linq4j.test.DeterministicTest
          0.3sec,   84 completed,   0 failed,   0 skipped, org.apache.calcite.linq4j.test.OptimizerTest
WARNING   0.4sec,   50 completed,   0 failed,   1 skipped, org.apache.calcite.linq4j.test.ExpressionTest

JoinPreserveOrderTest > leftJoinPreservesOrderOfLeftInput(Field, Field) STANDARD_OUT
    Employee(name: Fred, deptno:10)

JoinPreserveOrderTest > rightNestedLoopJoinPreservesOrderOfLeftInput(Field, Field) > [40] on='deptno', asc=false, nullsFirst=false}, on='name', asc=false, nullsFirst=false} STANDARD_OUT
    Employee(name: Bill, deptno:30)

Linq4jTest > testJoinCartesianProduct() STANDARD_OUT
    Employee(name: Eric, deptno:10)

JoinPreserveOrderTest > correlateBatchJoin(Field, Field) STANDARD_OUT
    Employee(name: Janet, deptno:10)

JoinPreserveOrderTest > leftJoinPreservesOrderOfLeftInput(Field, Field) > [74] on='deptno', asc=false, nullsFirst=true}, on='name', asc=false, nullsFirst=true} STANDARD_OUT
    Department(name: Sales, deptno:10, employees: [Employee(name: Fred, deptno:10), Employee(name: Eric, deptno:10), Employee(name: Janet, deptno:10)])

JoinPreserveOrderTest > semiDefaultJoinPreservesOrderOfLeftInput(Field, Field) > [29] on='name', asc=false, nullsFirst=true}, on='deptno', asc=true, nullsFirst=true} STANDARD_OUT
    Department(name: HR, deptno:20, employees: [])

JoinPreserveOrderTest > rightNestedLoopJoinPreservesOrderOfLeftInput(Field, Field) STANDARD_OUT
    Department(name: Marketing, deptno:30, employees: [Employee(name: Bill, deptno:30)])
    Fred:null
    Eric:null

JoinPreserveOrderTest > fullNestedLoopJoinPreservesOrderOfLeftInput(Field, Field) STANDARD_OUT
    Janet:Sales

JoinPreserveOrderTest > innerJoinPreservesOrderOfLeftInput(Field, Field) > [71] on='deptno', asc=true, nullsFirst=false}, on='did', asc=true, nullsFirst=false} STANDARD_OUT
    Bill:null
          0.7sec,  119 completed,   0 failed,   0 skipped, org.apache.calcite.linq4j.test.Linq4jTest
          0.5sec,   72 completed,   0 failed,   0 skipped, org.apache.calcite.linq4j.test.JoinPreserveOrderTest > rightNestedLoopJoinPreservesOrderOfLeftInput(Field, Field)
          0.6sec,   72 completed,   0 failed,   0 skipped, org.apache.calcite.linq4j.test.JoinPreserveOrderTest > rightJoinPreservesOrderOfLeftInput(Field, Field)
          0.5sec,   72 completed,   0 failed,   0 skipped, org.apache.calcite.linq4j.test.JoinPreserveOrderTest > fullNestedLoopJoinPreservesOrderOfLeftInput(Field, Field)
          0.7sec,   72 completed,   0 failed,   0 skipped, org.apache.calcite.linq4j.test.JoinPreserveOrderTest > fullJoinPreservesOrderOfLeftInput(Field, Field)
          0.7sec,  144 completed,   0 failed,   0 skipped, org.apache.calcite.linq4j.test.JoinPreserveOrderTest > innerCorrelateJoinPreservesOrderOfLeftInput(Field, Field)
          0.6sec,  144 completed,   0 failed,   0 skipped, org.apache.calcite.linq4j.test.JoinPreserveOrderTest > semiDefaultJoinPreservesOrderOfLeftInput(Field, Field)
          0.8sec,  144 completed,   0 failed,   0 skipped, org.apache.calcite.linq4j.test.JoinPreserveOrderTest > semiCorrelateJoinPreservesOrderOfLeftInput(Field, Field)
          0.7sec,  144 completed,   0 failed,   0 skipped, org.apache.calcite.linq4j.test.JoinPreserveOrderTest > correlateBatchJoin(Field, Field)
          0.8sec,  144 completed,   0 failed,   0 skipped, org.apache.calcite.linq4j.test.JoinPreserveOrderTest > leftCorrelateJoinPreservesOrderOfLeftInput(Field, Field)
          0.9sec,  144 completed,   0 failed,   0 skipped, org.apache.calcite.linq4j.test.JoinPreserveOrderTest > leftJoinPreservesOrderOfLeftInput(Field, Field)
          1.0sec,  144 completed,   0 failed,   0 skipped, org.apache.calcite.linq4j.test.JoinPreserveOrderTest > innerNestedLoopJoinPreservesOrderOfLeftInput(Field, Field)
          1.0sec,  144 completed,   0 failed,   0 skipped, org.apache.calcite.linq4j.test.JoinPreserveOrderTest > antiDefaultJoinPreservesOrderOfLeftInput(Field, Field)
          0.8sec,  144 completed,   0 failed,   0 skipped, org.apache.calcite.linq4j.test.JoinPreserveOrderTest > leftNestedLoopJoinPreservesOrderOfLeftInput(Field, Field)
          0.6sec,  144 completed,   0 failed,   0 skipped, org.apache.calcite.linq4j.test.JoinPreserveOrderTest > innerJoinPreservesOrderOfLeftInput(Field, Field)
          0.6sec,  144 completed,   0 failed,   0 skipped, org.apache.calcite.linq4j.test.JoinPreserveOrderTest > antiCorrelateJoinPreservesOrderOfLeftInput(Field, Field)
          1.0sec, 1872 completed,   0 failed,   0 skipped, org.apache.calcite.linq4j.test.JoinPreserveOrderTest
          2.0sec, org.apache.calcite.linq4j.test.LimitSortTest > test()
          2.0sec,    1 completed,   0 failed,   0 skipped, org.apache.calcite.linq4j.test.LimitSortTest
WARNING   3.6sec, 2181 completed,   0 failed,   1 skipped, Gradle Test Run :linq4j:test

> Task :linq4j:check
> Task :linq4j:build
> Task :linq4j:generateMetadataFileForLinq4jPublication SKIPPED
> Task :linq4j:generatePomFileForLinq4jPublication
> Task :linq4j:initializeNexusStagingRepository SKIPPED
> Task :linq4j:publishLinq4jPublicationToNexusRepository FAILED

FAILURE: Build failed with an exception.

* What went wrong:
Execution failed for task ':linq4j:publishLinq4jPublicationToNexusRepository'.
> Failed to publish publication 'linq4j' to repository 'nexus'
   > Could not PUT 'https://repository.apache.org/content/repositories/snapshots/org/apache/calcite/calcite-linq4j/1.40.0-SNAPSHOT/maven-metadata.xml'. Received status code 401 from server: Unauthorized

* Try:
> Run with --stacktrace option to get the stack trace.
> Run with --info or --debug option to get more log output.
> Get more help at https://help.gradle.org.

Deprecated Gradle features were used in this build, making it incompatible with Gradle 9.0.

You can use '--warning-mode all' to show the individual deprecation warnings and determine if they come from your own scripts or plugins.

For more on this, please refer to https://docs.gradle.org/8.7/userguide/command_line_interface.html#sec:command_line_warnings in the Gradle documentation.

BUILD FAILED in 2m 33s
234 actionable tasks: 234 executed

Publishing build scan...
https://develocity.apache.org/s/635za2qg6ykb6


See the profiling report at: file://<https://ci-builds.apache.org/job/Calcite/job/Calcite-snapshots/ws/build/reports/profile/profile-2025-04-24-04-59-56.html>
A fine-grained performance profile is available: use the --scan option.
Build step 'Invoke Gradle script' changed build result to FAILURE
Build step 'Invoke Gradle script' marked build as failure
Recording test results
[Checks API] No suitable checks publisher found.

Build failed in Jenkins: Calcite » Calcite-snapshots #1328

Posted by Apache Jenkins Server <je...@builds.apache.org>.
See <https://ci-builds.apache.org/job/Calcite/job/Calcite-snapshots/1328/display/redirect?page=changes>

Changes:

[mbudiu] [CALCITE-6980] RelJson cannot serialize binary literals


------------------------------------------
[...truncated 93.26 KiB...]
                                 ^
<https://ci-builds.apache.org/job/Calcite/job/Calcite-snapshots/ws/linq4j/src/main/java/org/apache/calcite/linq4j/tree/Expressions.java>:144: warning: no @param for left
  public static BinaryExpression addAssignChecked(Expression left,
                                 ^
<https://ci-builds.apache.org/job/Calcite/job/Calcite-snapshots/ws/linq4j/src/main/java/org/apache/calcite/linq4j/tree/Expressions.java>:144: warning: no @param for right
  public static BinaryExpression addAssignChecked(Expression left,
                                 ^
<https://ci-builds.apache.org/job/Calcite/job/Calcite-snapshots/ws/linq4j/src/main/java/org/apache/calcite/linq4j/tree/Expressions.java>:144: warning: no @param for method
  public static BinaryExpression addAssignChecked(Expression left,
                                 ^
<https://ci-builds.apache.org/job/Calcite/job/Calcite-snapshots/ws/linq4j/src/main/java/org/apache/calcite/linq4j/tree/Expressions.java>:144: warning: no @param for lambdaExpression
  public static BinaryExpression addAssignChecked(Expression left,
                                 ^
<https://ci-builds.apache.org/job/Calcite/job/Calcite-snapshots/ws/linq4j/src/main/java/org/apache/calcite/linq4j/tree/Expressions.java>:144: warning: no @return
  public static BinaryExpression addAssignChecked(Expression left,
                                 ^
<https://ci-builds.apache.org/job/Calcite/job/Calcite-snapshots/ws/linq4j/src/main/java/org/apache/calcite/linq4j/tree/Expressions.java>:153: warning: no @param for left
  public static BinaryExpression addChecked(Expression left, Expression right) {
                                 ^
<https://ci-builds.apache.org/job/Calcite/job/Calcite-snapshots/ws/linq4j/src/main/java/org/apache/calcite/linq4j/tree/Expressions.java>:153: warning: no @param for right
  public static BinaryExpression addChecked(Expression left, Expression right) {
                                 ^
<https://ci-builds.apache.org/job/Calcite/job/Calcite-snapshots/ws/linq4j/src/main/java/org/apache/calcite/linq4j/tree/Expressions.java>:153: warning: no @return
  public static BinaryExpression addChecked(Expression left, Expression right) {
                                 ^
<https://ci-builds.apache.org/job/Calcite/job/Calcite-snapshots/ws/linq4j/src/main/java/org/apache/calcite/linq4j/tree/Expressions.java>:162: warning: no @param for left
  public static BinaryExpression addChecked(Expression left, Expression right,
                                 ^
<https://ci-builds.apache.org/job/Calcite/job/Calcite-snapshots/ws/linq4j/src/main/java/org/apache/calcite/linq4j/tree/Expressions.java>:162: warning: no @param for right
  public static BinaryExpression addChecked(Expression left, Expression right,
                                 ^
<https://ci-builds.apache.org/job/Calcite/job/Calcite-snapshots/ws/linq4j/src/main/java/org/apache/calcite/linq4j/tree/Expressions.java>:162: warning: no @param for method
  public static BinaryExpression addChecked(Expression left, Expression right,
                                 ^
<https://ci-builds.apache.org/job/Calcite/job/Calcite-snapshots/ws/linq4j/src/main/java/org/apache/calcite/linq4j/tree/Expressions.java>:162: warning: no @return
  public static BinaryExpression addChecked(Expression left, Expression right,
                                 ^
<https://ci-builds.apache.org/job/Calcite/job/Calcite-snapshots/ws/linq4j/src/main/java/org/apache/calcite/linq4j/tree/Expressions.java>:171: warning: no @param for left
  public static BinaryExpression and(Expression left, Expression right) {
                                 ^
<https://ci-builds.apache.org/job/Calcite/job/Calcite-snapshots/ws/linq4j/src/main/java/org/apache/calcite/linq4j/tree/Expressions.java>:171: warning: no @param for right
  public static BinaryExpression and(Expression left, Expression right) {
                                 ^
<https://ci-builds.apache.org/job/Calcite/job/Calcite-snapshots/ws/linq4j/src/main/java/org/apache/calcite/linq4j/tree/Expressions.java>:171: warning: no @return
  public static BinaryExpression and(Expression left, Expression right) {
                                 ^
<https://ci-builds.apache.org/job/Calcite/job/Calcite-snapshots/ws/linq4j/src/main/java/org/apache/calcite/linq4j/tree/Expressions.java>:179: warning: no @param for left
  public static BinaryExpression and(Expression left, Expression right,
                                 ^
<https://ci-builds.apache.org/job/Calcite/job/Calcite-snapshots/ws/linq4j/src/main/java/org/apache/calcite/linq4j/tree/Expressions.java>:179: warning: no @param for right
  public static BinaryExpression and(Expression left, Expression right,
                                 ^
<https://ci-builds.apache.org/job/Calcite/job/Calcite-snapshots/ws/linq4j/src/main/java/org/apache/calcite/linq4j/tree/Expressions.java>:179: warning: no @param for method
  public static BinaryExpression and(Expression left, Expression right,
                                 ^
<https://ci-builds.apache.org/job/Calcite/job/Calcite-snapshots/ws/linq4j/src/main/java/org/apache/calcite/linq4j/tree/Expressions.java>:179: warning: no @return
  public static BinaryExpression and(Expression left, Expression right,
                                 ^
<https://ci-builds.apache.org/job/Calcite/job/Calcite-snapshots/ws/linq4j/src/main/java/org/apache/calcite/linq4j/tree/Expressions.java>:189: warning: no @param for left
  public static BinaryExpression andAlso(Expression left, Expression right) {
                                 ^
<https://ci-builds.apache.org/job/Calcite/job/Calcite-snapshots/ws/linq4j/src/main/java/org/apache/calcite/linq4j/tree/Expressions.java>:189: warning: no @param for right
  public static BinaryExpression andAlso(Expression left, Expression right) {
                                 ^
<https://ci-builds.apache.org/job/Calcite/job/Calcite-snapshots/ws/linq4j/src/main/java/org/apache/calcite/linq4j/tree/Expressions.java>:189: warning: no @return
  public static BinaryExpression andAlso(Expression left, Expression right) {
                                 ^
<https://ci-builds.apache.org/job/Calcite/job/Calcite-snapshots/ws/linq4j/src/main/java/org/apache/calcite/linq4j/tree/Expressions.java>:199: warning: no @param for left
  public static BinaryExpression andAlso(Expression left, Expression right,
                                 ^
<https://ci-builds.apache.org/job/Calcite/job/Calcite-snapshots/ws/linq4j/src/main/java/org/apache/calcite/linq4j/tree/Expressions.java>:199: warning: no @param for right
  public static BinaryExpression andAlso(Expression left, Expression right,
                                 ^
<https://ci-builds.apache.org/job/Calcite/job/Calcite-snapshots/ws/linq4j/src/main/java/org/apache/calcite/linq4j/tree/Expressions.java>:199: warning: no @param for method
  public static BinaryExpression andAlso(Expression left, Expression right,
                                 ^
<https://ci-builds.apache.org/job/Calcite/job/Calcite-snapshots/ws/linq4j/src/main/java/org/apache/calcite/linq4j/tree/Expressions.java>:199: warning: no @return
  public static BinaryExpression andAlso(Expression left, Expression right,
                                 ^
<https://ci-builds.apache.org/job/Calcite/job/Calcite-snapshots/ws/linq4j/src/main/java/org/apache/calcite/linq4j/tree/Expressions.java>:208: warning: no @param for left
  public static BinaryExpression andAssign(Expression left, Expression right) {
                                 ^
<https://ci-builds.apache.org/job/Calcite/job/Calcite-snapshots/ws/linq4j/src/main/java/org/apache/calcite/linq4j/tree/Expressions.java>:208: warning: no @param for right
  public static BinaryExpression andAssign(Expression left, Expression right) {
                                 ^
<https://ci-builds.apache.org/job/Calcite/job/Calcite-snapshots/ws/linq4j/src/main/java/org/apache/calcite/linq4j/tree/Expressions.java>:208: warning: no @return
  public static BinaryExpression andAssign(Expression left, Expression right) {
                                 ^
<https://ci-builds.apache.org/job/Calcite/job/Calcite-snapshots/ws/linq4j/src/main/java/org/apache/calcite/linq4j/tree/Expressions.java>:216: warning: no @param for left
  public static BinaryExpression andAssign(Expression left, Expression right,
                                 ^
<https://ci-builds.apache.org/job/Calcite/job/Calcite-snapshots/ws/linq4j/src/main/java/org/apache/calcite/linq4j/tree/Expressions.java>:216: warning: no @param for right
  public static BinaryExpression andAssign(Expression left, Expression right,
                                 ^
<https://ci-builds.apache.org/job/Calcite/job/Calcite-snapshots/ws/linq4j/src/main/java/org/apache/calcite/linq4j/tree/Expressions.java>:216: warning: no @param for method
  public static BinaryExpression andAssign(Expression left, Expression right,
                                 ^
<https://ci-builds.apache.org/job/Calcite/job/Calcite-snapshots/ws/linq4j/src/main/java/org/apache/calcite/linq4j/tree/Expressions.java>:216: warning: no @return
  public static BinaryExpression andAssign(Expression left, Expression right,
                                 ^
<https://ci-builds.apache.org/job/Calcite/job/Calcite-snapshots/ws/linq4j/src/main/java/org/apache/calcite/linq4j/tree/Expressions.java>:225: warning: no @param for left
  public static BinaryExpression andAssign(Expression left, Expression right,
                                 ^
<https://ci-builds.apache.org/job/Calcite/job/Calcite-snapshots/ws/linq4j/src/main/java/org/apache/calcite/linq4j/tree/Expressions.java>:225: warning: no @param for right
  public static BinaryExpression andAssign(Expression left, Expression right,
                                 ^
<https://ci-builds.apache.org/job/Calcite/job/Calcite-snapshots/ws/linq4j/src/main/java/org/apache/calcite/linq4j/tree/Expressions.java>:225: warning: no @param for method
  public static BinaryExpression andAssign(Expression left, Expression right,
                                 ^
<https://ci-builds.apache.org/job/Calcite/job/Calcite-snapshots/ws/linq4j/src/main/java/org/apache/calcite/linq4j/tree/Expressions.java>:225: warning: no @param for lambdaExpression
  public static BinaryExpression andAssign(Expression left, Expression right,
                                 ^
<https://ci-builds.apache.org/job/Calcite/job/Calcite-snapshots/ws/linq4j/src/main/java/org/apache/calcite/linq4j/tree/Expressions.java>:225: warning: no @return
  public static BinaryExpression andAssign(Expression left, Expression right,
                                 ^
<https://ci-builds.apache.org/job/Calcite/job/Calcite-snapshots/ws/linq4j/src/main/java/org/apache/calcite/linq4j/tree/Expressions.java>:234: warning: no @param for array
  public static IndexExpression arrayIndex(Expression array,
                                ^
<https://ci-builds.apache.org/job/Calcite/job/Calcite-snapshots/ws/linq4j/src/main/java/org/apache/calcite/linq4j/tree/Expressions.java>:234: warning: no @param for indexExpression
  public static IndexExpression arrayIndex(Expression array,
                                ^
<https://ci-builds.apache.org/job/Calcite/job/Calcite-snapshots/ws/linq4j/src/main/java/org/apache/calcite/linq4j/tree/Expressions.java>:234: warning: no @return
  public static IndexExpression arrayIndex(Expression array,
                                ^

> Task :arrow:generatePomFileForArrowPublication
> Task :babel:generatePomFileForBabelPublication
> Task :cassandra:generatePomFileForCassandraPublication
> Task :druid:generatePomFileForDruidPublication
> Task :elasticsearch:generatePomFileForElasticsearchPublication
> Task :file:generatePomFileForFilePublication
> Task :geode:generatePomFileForGeodePublication
> Task :innodb:generatePomFileForInnodbPublication
> Task :kafka:generatePomFileForKafkaPublication
> Task :mongodb:generatePomFileForMongodbPublication
> Task :pig:generatePomFileForPigPublication
> Task :piglet:generatePomFileForPigletPublication
> Task :plus:generatePomFileForPlusPublication
> Task :redis:generatePomFileForRedisPublication
> Task :server:generatePomFileForServerPublication
> Task :spark:generatePomFileForSparkPublication
> Task :splunk:generatePomFileForSplunkPublication
> Task :example:csv:generatePomFileForCsvPublication
> Task :example:function:generatePomFileForFunctionPublication

> Task :linq4j:javadoc
100 warnings

> Task :linq4j:javadocJar

> Task :linq4j:test
          0.1sec,    2 completed,   0 failed,   0 skipped, org.apache.calcite.linq4j.MemoryEnumerableTest
          0.1sec,    1 completed,   0 failed,   0 skipped, org.apache.calcite.linq4j.tree.TypeTest
          0.1sec,    4 completed,   0 failed,   0 skipped, org.apache.calcite.linq4j.function.FunctionTest
          0.1sec,    9 completed,   0 failed,   0 skipped, org.apache.calcite.linq4j.test.PrimitiveTest
          0.1sec,    6 completed,   0 failed,   0 skipped, org.apache.calcite.linq4j.test.BlockBuilderTest
          0.1sec,    2 completed,   0 failed,   0 skipped, org.apache.calcite.linq4j.test.LookupImplTest
          0.2sec,   11 completed,   0 failed,   0 skipped, org.apache.calcite.linq4j.test.InlinerTest
          0.2sec,    4 completed,   0 failed,   0 skipped, org.apache.calcite.linq4j.test.CorrelateJoinTest
          0.2sec,   16 completed,   0 failed,   0 skipped, org.apache.calcite.linq4j.test.DeterministicTest
          0.3sec,   84 completed,   0 failed,   0 skipped, org.apache.calcite.linq4j.test.OptimizerTest

> Task :testkit:generatePomFileForTestkitPublication
> Task :core:autostyleJavaCheck

> Task :linq4j:test

JoinPreserveOrderTest > leftCorrelateJoinPreservesOrderOfLeftInput(Field, Field) > [60] on='deptno', asc=true, nullsFirst=true}, on='did', asc=false, nullsFirst=false} STANDARD_OUT
    Employee(name: Fred, deptno:10)

JoinPreserveOrderTest > rightNestedLoopJoinPreservesOrderOfLeftInput(Field, Field) > [56] on='eid', asc=true, nullsFirst=false}, on='deptno', asc=false, nullsFirst=false} STANDARD_OUT
    Employee(name: Bill, deptno:30)
    Employee(name: Eric, deptno:10)

JoinPreserveOrderTest > antiCorrelateJoinPreservesOrderOfLeftInput(Field, Field) > [32] on='name', asc=false, nullsFirst=true}, on='deptno', asc=false, nullsFirst=false} STANDARD_OUT
    Employee(name: Janet, deptno:10)

JoinPreserveOrderTest > rightJoinPreservesOrderOfLeftInput(Field, Field) STANDARD_OUT
    Department(name: Sales, deptno:10, employees: [Employee(name: Fred, deptno:10), Employee(name: Eric, deptno:10), Employee(name: Janet, deptno:10)])

JoinPreserveOrderTest > leftNestedLoopJoinPreservesOrderOfLeftInput(Field, Field) > [54] on='deptno', asc=true, nullsFirst=true}, on='deptno', asc=false, nullsFirst=true} STANDARD_OUT
    Department(name: HR, deptno:20, employees: [])
    Department(name: Marketing, deptno:30, employees: [Employee(name: Bill, deptno:30)])
WARNING   0.5sec,   50 completed,   0 failed,   1 skipped, org.apache.calcite.linq4j.test.ExpressionTest

JoinPreserveOrderTest > innerJoinPreservesOrderOfLeftInput(Field, Field) > [3] on='name', asc=true, nullsFirst=true}, on='name', asc=true, nullsFirst=false} STANDARD_OUT
    Fred:null
    Eric:null
    Janet:Sales
    Bill:null
          0.6sec,  119 completed,   0 failed,   0 skipped, org.apache.calcite.linq4j.test.Linq4jTest
          0.5sec,   72 completed,   0 failed,   0 skipped, org.apache.calcite.linq4j.test.JoinPreserveOrderTest > rightJoinPreservesOrderOfLeftInput(Field, Field)
          0.5sec,   72 completed,   0 failed,   0 skipped, org.apache.calcite.linq4j.test.JoinPreserveOrderTest > rightNestedLoopJoinPreservesOrderOfLeftInput(Field, Field)
          0.6sec,   72 completed,   0 failed,   0 skipped, org.apache.calcite.linq4j.test.JoinPreserveOrderTest > fullJoinPreservesOrderOfLeftInput(Field, Field)
          0.5sec,   72 completed,   0 failed,   0 skipped, org.apache.calcite.linq4j.test.JoinPreserveOrderTest > fullNestedLoopJoinPreservesOrderOfLeftInput(Field, Field)
          0.6sec,  144 completed,   0 failed,   0 skipped, org.apache.calcite.linq4j.test.JoinPreserveOrderTest > correlateBatchJoin(Field, Field)
          0.9sec,  144 completed,   0 failed,   0 skipped, org.apache.calcite.linq4j.test.JoinPreserveOrderTest > innerNestedLoopJoinPreservesOrderOfLeftInput(Field, Field)
          0.8sec,  144 completed,   0 failed,   0 skipped, org.apache.calcite.linq4j.test.JoinPreserveOrderTest > antiDefaultJoinPreservesOrderOfLeftInput(Field, Field)
          0.8sec,  144 completed,   0 failed,   0 skipped, org.apache.calcite.linq4j.test.JoinPreserveOrderTest > leftJoinPreservesOrderOfLeftInput(Field, Field)
          0.6sec,  144 completed,   0 failed,   0 skipped, org.apache.calcite.linq4j.test.JoinPreserveOrderTest > antiCorrelateJoinPreservesOrderOfLeftInput(Field, Field)
          0.7sec,  144 completed,   0 failed,   0 skipped, org.apache.calcite.linq4j.test.JoinPreserveOrderTest > innerJoinPreservesOrderOfLeftInput(Field, Field)
          0.8sec,  144 completed,   0 failed,   0 skipped, org.apache.calcite.linq4j.test.JoinPreserveOrderTest > leftNestedLoopJoinPreservesOrderOfLeftInput(Field, Field)
          0.8sec,  144 completed,   0 failed,   0 skipped, org.apache.calcite.linq4j.test.JoinPreserveOrderTest > semiCorrelateJoinPreservesOrderOfLeftInput(Field, Field)
          0.7sec,  144 completed,   0 failed,   0 skipped, org.apache.calcite.linq4j.test.JoinPreserveOrderTest > innerCorrelateJoinPreservesOrderOfLeftInput(Field, Field)
          0.7sec,  144 completed,   0 failed,   0 skipped, org.apache.calcite.linq4j.test.JoinPreserveOrderTest > semiDefaultJoinPreservesOrderOfLeftInput(Field, Field)
          0.8sec,  144 completed,   0 failed,   0 skipped, org.apache.calcite.linq4j.test.JoinPreserveOrderTest > leftCorrelateJoinPreservesOrderOfLeftInput(Field, Field)
          1.0sec, 1872 completed,   0 failed,   0 skipped, org.apache.calcite.linq4j.test.JoinPreserveOrderTest
          2.2sec, org.apache.calcite.linq4j.test.LimitSortTest > test()
          2.3sec,    1 completed,   0 failed,   0 skipped, org.apache.calcite.linq4j.test.LimitSortTest
WARNING   3.9sec, 2181 completed,   0 failed,   1 skipped, Gradle Test Run :linq4j:test

> Task :linq4j:check
> Task :linq4j:build
> Task :linq4j:generateMetadataFileForLinq4jPublication SKIPPED
> Task :linq4j:generatePomFileForLinq4jPublication
> Task :linq4j:initializeNexusStagingRepository SKIPPED
> Task :linq4j:publishLinq4jPublicationToNexusRepository FAILED

FAILURE: Build failed with an exception.

* What went wrong:
Execution failed for task ':linq4j:publishLinq4jPublicationToNexusRepository'.
> Failed to publish publication 'linq4j' to repository 'nexus'
   > Could not PUT 'https://repository.apache.org/content/repositories/snapshots/org/apache/calcite/calcite-linq4j/1.40.0-SNAPSHOT/maven-metadata.xml'. Received status code 401 from server: Unauthorized

* Try:
> Run with --stacktrace option to get the stack trace.
> Run with --info or --debug option to get more log output.
> Get more help at https://help.gradle.org.

Deprecated Gradle features were used in this build, making it incompatible with Gradle 9.0.

You can use '--warning-mode all' to show the individual deprecation warnings and determine if they come from your own scripts or plugins.

For more on this, please refer to https://docs.gradle.org/8.7/userguide/command_line_interface.html#sec:command_line_warnings in the Gradle documentation.

BUILD FAILED in 3m 7s
234 actionable tasks: 234 executed

Publishing build scan...
https://develocity.apache.org/s/nni6nqrxqgyoi


See the profiling report at: file://<https://ci-builds.apache.org/job/Calcite/job/Calcite-snapshots/ws/build/reports/profile/profile-2025-04-24-04-56-33.html>
A fine-grained performance profile is available: use the --scan option.
Build step 'Invoke Gradle script' changed build result to FAILURE
Build step 'Invoke Gradle script' marked build as failure
Recording test results
[Checks API] No suitable checks publisher found.