You are viewing a plain text version of this content. The canonical link for it is here.
Posted to dev@pig.apache.org by Apache Jenkins Server <je...@builds.apache.org> on 2015/05/13 16:32:53 UTC

Build failed in Jenkins: Pig-trunk-commit #2126

See <https://builds.apache.org/job/Pig-trunk-commit/2126/changes>

Changes:

[daijy] PIG-4481: e2e tests ComputeSpec_1, ComputeSpec_2 and StreamingPerformance_3 produce different result on Windows

[daijy] PIG-4496: Fix CBZip2InputStream to close underlying stream

------------------------------------------
[...truncated 4399 lines...]
    [junit] Tests run: 3, Failures: 0, Errors: 0, Skipped: 0, Time elapsed: 35.104 sec
    [junit] Running org.apache.pig.test.TestNewPlanListener
    [junit] Tests run: 4, Failures: 0, Errors: 0, Skipped: 0, Time elapsed: 0.369 sec
    [junit] Running org.apache.pig.test.TestNewPlanLogToPhyTranslationVisitor
    [junit] Tests run: 27, Failures: 0, Errors: 0, Skipped: 0, Time elapsed: 5.104 sec
    [junit] Running org.apache.pig.test.TestNewPlanLogicalOptimizer
    [junit] Tests run: 1, Failures: 0, Errors: 0, Skipped: 0, Time elapsed: 1.452 sec
    [junit] Running org.apache.pig.test.TestNewPlanOperatorPlan
    [junit] Tests run: 47, Failures: 0, Errors: 0, Skipped: 0, Time elapsed: 4.292 sec
    [junit] Running org.apache.pig.test.TestNewPlanPruneMapKeys
    [junit] Tests run: 8, Failures: 0, Errors: 0, Skipped: 0, Time elapsed: 2.979 sec
    [junit] Running org.apache.pig.test.TestNewPlanPushDownForeachFlatten
    [junit] Tests run: 45, Failures: 0, Errors: 0, Skipped: 0, Time elapsed: 7.387 sec
    [junit] Running org.apache.pig.test.TestNewPlanPushUpFilter
    [junit] Tests run: 46, Failures: 0, Errors: 0, Skipped: 0, Time elapsed: 7.409 sec
    [junit] Running org.apache.pig.test.TestNewPlanRule
    [junit] Tests run: 4, Failures: 0, Errors: 0, Skipped: 0, Time elapsed: 0.333 sec
    [junit] Running org.apache.pig.test.TestNotEqualTo
    [junit] Tests run: 28, Failures: 0, Errors: 0, Skipped: 0, Time elapsed: 0.446 sec
    [junit] Running org.apache.pig.test.TestNull
    [junit] Tests run: 2, Failures: 0, Errors: 0, Skipped: 0, Time elapsed: 0.444 sec
    [junit] Running org.apache.pig.test.TestNullConstant
    [junit] Tests run: 8, Failures: 0, Errors: 0, Skipped: 0, Time elapsed: 22.897 sec
    [junit] Running org.apache.pig.test.TestNumberOfReducers
    [junit] Tests run: 10, Failures: 0, Errors: 0, Skipped: 0, Time elapsed: 510.526 sec
    [junit] Running org.apache.pig.test.TestOptimizeLimit
    [junit] Tests run: 12, Failures: 0, Errors: 0, Skipped: 0, Time elapsed: 3.458 sec
    [junit] Running org.apache.pig.test.TestOrderBy3
    [junit] Tests run: 4, Failures: 0, Errors: 0, Skipped: 0, Time elapsed: 13.424 sec
    [junit] Running org.apache.pig.test.TestPOBinCond
    [junit] Tests run: 10, Failures: 0, Errors: 0, Skipped: 0, Time elapsed: 0.461 sec
    [junit] Running org.apache.pig.test.TestPOCast
    [junit] Tests run: 14, Failures: 0, Errors: 0, Skipped: 0, Time elapsed: 0.897 sec
    [junit] Running org.apache.pig.test.TestPODistinct
    [junit] Tests run: 6, Failures: 0, Errors: 0, Skipped: 0, Time elapsed: 0.391 sec
    [junit] Running org.apache.pig.test.TestPOGenerate
    [junit] Tests run: 3, Failures: 0, Errors: 0, Skipped: 0, Time elapsed: 0.37 sec
    [junit] Running org.apache.pig.test.TestPOMapLookUp
    [junit] Tests run: 1, Failures: 0, Errors: 0, Skipped: 0, Time elapsed: 0.366 sec
    [junit] Running org.apache.pig.test.TestPONegative
    [junit] Tests run: 9, Failures: 0, Errors: 0, Skipped: 0, Time elapsed: 5.861 sec
    [junit] Running org.apache.pig.test.TestPOPartialAgg
    [junit] Tests run: 16, Failures: 0, Errors: 0, Skipped: 0, Time elapsed: 4.048 sec
    [junit] Running org.apache.pig.test.TestPOPartialAggPlan
    [junit] Tests run: 1, Failures: 0, Errors: 0, Skipped: 1, Time elapsed: 0.245 sec
    [junit] Running org.apache.pig.test.TestPORegexp
    [junit] Tests run: 2, Failures: 0, Errors: 0, Skipped: 0, Time elapsed: 0.378 sec
    [junit] Running org.apache.pig.test.TestPOSort
    [junit] Tests run: 14, Failures: 0, Errors: 0, Skipped: 0, Time elapsed: 0.456 sec
    [junit] Running org.apache.pig.test.TestPOSplit
    [junit] Tests run: 1, Failures: 0, Errors: 0, Skipped: 0, Time elapsed: 0.366 sec
    [junit] Running org.apache.pig.test.TestPOUserFunc
    [junit] Tests run: 6, Failures: 0, Errors: 0, Skipped: 0, Time elapsed: 0.458 sec
    [junit] Running org.apache.pig.test.TestPackage
    [junit] Tests run: 1, Failures: 0, Errors: 0, Skipped: 0, Time elapsed: 7.619 sec
    [junit] Running org.apache.pig.test.TestParamSubPreproc
    [junit] Tests run: 36, Failures: 0, Errors: 0, Skipped: 0, Time elapsed: 4.409 sec
    [junit] Running org.apache.pig.test.TestParser
    [junit] Tests run: 4, Failures: 0, Errors: 0, Skipped: 0, Time elapsed: 5.204 sec
    [junit] Running org.apache.pig.test.TestPhyOp
    [junit] Tests run: 1, Failures: 0, Errors: 0, Skipped: 0, Time elapsed: 0.44 sec
    [junit] Running org.apache.pig.test.TestPhyPatternMatch
    [junit] Tests run: 4, Failures: 0, Errors: 0, Skipped: 0, Time elapsed: 0.358 sec
    [junit] Running org.apache.pig.test.TestPigContext
    [junit] Tests run: 6, Failures: 0, Errors: 0, Skipped: 0, Time elapsed: 59.819 sec
    [junit] Running org.apache.pig.test.TestPigContextClassCache
    [junit] Tests run: 1, Failures: 0, Errors: 0, Skipped: 0, Time elapsed: 0.35 sec
    [junit] Running org.apache.pig.test.TestPigException
    [junit] Tests run: 2, Failures: 0, Errors: 0, Skipped: 0, Time elapsed: 0.247 sec
    [junit] Running org.apache.pig.test.TestPigProgressReporting
    [junit] Tests run: 1, Failures: 0, Errors: 0, Skipped: 0, Time elapsed: 60.503 sec
    [junit] Running org.apache.pig.test.TestPigRunner
    [junit] Tests run: 30, Failures: 0, Errors: 0, Skipped: 1, Time elapsed: 205.871 sec
    [junit] Running org.apache.pig.test.TestPigScriptParser
    [junit] Tests run: 4, Failures: 0, Errors: 0, Skipped: 0, Time elapsed: 4.346 sec
    [junit] Running org.apache.pig.test.TestPigServer
    [junit] Tests run: 31, Failures: 0, Errors: 0, Skipped: 0, Time elapsed: 58.582 sec
    [junit] Running org.apache.pig.test.TestPigServerLocal
    [junit] Tests run: 7, Failures: 0, Errors: 0, Skipped: 0, Time elapsed: 34.188 sec
    [junit] Running org.apache.pig.test.TestPigServerWithMacros
    [junit] Tests run: 2, Failures: 0, Errors: 0, Skipped: 0, Time elapsed: 8.522 sec
    [junit] Running org.apache.pig.test.TestPigServerWithMacrosRemote
    [junit] Tests run: 1, Failures: 0, Errors: 0, Skipped: 0, Time elapsed: 30.849 sec
    [junit] Running org.apache.pig.test.TestPigSplit
    [junit] Tests run: 3, Failures: 0, Errors: 0, Skipped: 0, Time elapsed: 68.999 sec
    [junit] Running org.apache.pig.test.TestPigStats
    [junit] Tests run: 1, Failures: 0, Errors: 0, Skipped: 1, Time elapsed: 0.222 sec
    [junit] Running org.apache.pig.test.TestPigStorage
    [junit] Tests run: 20, Failures: 0, Errors: 0, Skipped: 0, Time elapsed: 68.388 sec
    [junit] Running org.apache.pig.test.TestPigStreaming
    [junit] Tests run: 13, Failures: 0, Errors: 0, Skipped: 0, Time elapsed: 0.375 sec
    [junit] Running org.apache.pig.test.TestPigTupleRawComparator
    [junit] Tests run: 16, Failures: 0, Errors: 0, Skipped: 0, Time elapsed: 1.594 sec
    [junit] Running org.apache.pig.test.TestPinOptions
    [junit] Tests run: 3, Failures: 0, Errors: 0, Skipped: 0, Time elapsed: 2.834 sec
    [junit] Running org.apache.pig.test.TestPlanGeneration
    [junit] Tests run: 10, Failures: 0, Errors: 0, Skipped: 0, Time elapsed: 2.858 sec
    [junit] Running org.apache.pig.test.TestPoissonSampleLoader
    [junit] Tests run: 1, Failures: 0, Errors: 0, Skipped: 0, Time elapsed: 5.698 sec
    [junit] Running org.apache.pig.test.TestPredeployedJar
    [junit] Tests run: 2, Failures: 0, Errors: 0, Skipped: 0, Time elapsed: 39.072 sec
    [junit] Running org.apache.pig.test.TestProject
    [junit] Tests run: 12, Failures: 0, Errors: 0, Skipped: 0, Time elapsed: 13.203 sec
    [junit] Running org.apache.pig.test.TestProjectRange
    [junit] Tests run: 23, Failures: 0, Errors: 0, Skipped: 0, Time elapsed: 119.673 sec
    [junit] Running org.apache.pig.test.TestProjectStarExpander
    [junit] Tests run: 2, Failures: 0, Errors: 0, Skipped: 0, Time elapsed: 8.334 sec
    [junit] Running org.apache.pig.test.TestProjectStarRangeInUdf
    [junit] Tests run: 15, Failures: 0, Errors: 0, Skipped: 0, Time elapsed: 10.049 sec
    [junit] Running org.apache.pig.test.TestPruneColumn
    [junit] Tests run: 71, Failures: 0, Errors: 0, Skipped: 0, Time elapsed: 165.962 sec
    [junit] Running org.apache.pig.test.TestRank1
    [junit] Tests run: 9, Failures: 0, Errors: 0, Skipped: 0, Time elapsed: 26.986 sec
    [junit] Running org.apache.pig.test.TestRank2
    [junit] Tests run: 4, Failures: 0, Errors: 0, Skipped: 0, Time elapsed: 15.209 sec
    [junit] Running org.apache.pig.test.TestRank3
    [junit] Tests run: 4, Failures: 0, Errors: 0, Skipped: 0, Time elapsed: 20.021 sec
    [junit] Running org.apache.pig.test.TestReadToEndLoader
    [junit] Tests run: 1, Failures: 0, Errors: 0, Skipped: 0, Time elapsed: 1.173 sec
    [junit] Running org.apache.pig.test.TestRegexp
    [junit] Tests run: 2, Failures: 0, Errors: 0, Skipped: 0, Time elapsed: 0.35 sec
    [junit] Running org.apache.pig.test.TestRegisteredJarVisibility
    [junit] Tests run: 4, Failures: 0, Errors: 0, Skipped: 0, Time elapsed: 29.597 sec
    [junit] Running org.apache.pig.test.TestRelationToExprProject
    [junit] Tests run: 5, Failures: 0, Errors: 0, Skipped: 0, Time elapsed: 15.722 sec
    [junit] Running org.apache.pig.test.TestResourceSchema
    [junit] Tests run: 9, Failures: 0, Errors: 0, Skipped: 0, Time elapsed: 0.718 sec
    [junit] Running org.apache.pig.test.TestRollupDimensions
    [junit] Tests run: 1, Failures: 0, Errors: 0, Skipped: 0, Time elapsed: 0.362 sec
    [junit] Running org.apache.pig.test.TestSample
    [junit] Tests run: 7, Failures: 0, Errors: 0, Skipped: 0, Time elapsed: 46.385 sec
    [junit] Running org.apache.pig.test.TestSampleOptimizer
    [junit] Tests run: 5, Failures: 0, Errors: 0, Skipped: 0, Time elapsed: 102.619 sec
    [junit] Running org.apache.pig.test.TestScalarAliases
    [junit] Tests run: 2, Failures: 0, Errors: 0, Skipped: 1, Time elapsed: 33.306 sec
    [junit] Running org.apache.pig.test.TestScalarAliasesLocal
    [junit] Tests run: 12, Failures: 0, Errors: 0, Skipped: 0, Time elapsed: 72.096 sec
    [junit] Running org.apache.pig.test.TestSchema
    [junit] Tests run: 31, Failures: 0, Errors: 0, Skipped: 0, Time elapsed: 71.196 sec
    [junit] Running org.apache.pig.test.TestSchemaUtil
    [junit] Tests run: 2, Failures: 0, Errors: 0, Skipped: 0, Time elapsed: 0.341 sec
    [junit] Running org.apache.pig.test.TestScriptLanguage
    [junit] Tests run: 19, Failures: 0, Errors: 0, Skipped: 1, Time elapsed: 297.591 sec
    [junit] Running org.apache.pig.test.TestScriptLanguageJavaScript
    [junit] Tests run: 2, Failures: 0, Errors: 0, Skipped: 0, Time elapsed: 120.608 sec
    [junit] Running org.apache.pig.test.TestScriptUDF
    [junit] Tests run: 6, Failures: 0, Errors: 0, Skipped: 0, Time elapsed: 247.285 sec
    [junit] Running org.apache.pig.test.TestScriptingLanguagePython
    [junit] Tests run: 1, Failures: 0, Errors: 0, Skipped: 0, Time elapsed: 34.163 sec
    [junit] Running org.apache.pig.test.TestSecondarySort
    [junit] Tests run: 1, Failures: 0, Errors: 0, Skipped: 1, Time elapsed: 0.245 sec
    [junit] Running org.apache.pig.test.TestShortcuts
    [junit] Tests run: 19, Failures: 0, Errors: 0, Skipped: 0, Time elapsed: 10.726 sec
    [junit] Running org.apache.pig.test.TestSkewedJoin
    [junit] Tests run: 14, Failures: 0, Errors: 0, Skipped: 0, Time elapsed: 167.183 sec
    [junit] Running org.apache.pig.test.TestSplit
    [junit] Tests run: 4, Failures: 0, Errors: 0, Skipped: 0, Time elapsed: 12.885 sec
    [junit] Running org.apache.pig.test.TestSplitCombine
    [junit] Tests run: 11, Failures: 0, Errors: 0, Skipped: 0, Time elapsed: 1.378 sec
    [junit] Running org.apache.pig.test.TestSplitIndex
    [junit] Tests run: 2, Failures: 0, Errors: 0, Skipped: 0, Time elapsed: 7.955 sec
    [junit] Running org.apache.pig.test.TestSplitStore
    [junit] Tests run: 9, Failures: 0, Errors: 0, Skipped: 0, Time elapsed: 94.582 sec
    [junit] Running org.apache.pig.test.TestStore
    [junit] Tests run: 18, Failures: 0, Errors: 0, Skipped: 0, Time elapsed: 146.85 sec
    [junit] Running org.apache.pig.test.TestStoreBase
    [junit] Tests run: 1, Failures: 0, Errors: 0, Skipped: 1, Time elapsed: 0.24 sec
    [junit] Running org.apache.pig.test.TestStoreInstances
    [junit] Tests run: 1, Failures: 0, Errors: 0, Skipped: 0, Time elapsed: 54.441 sec
    [junit] Running org.apache.pig.test.TestStoreLocal
    [junit] Tests run: 6, Failures: 0, Errors: 0, Skipped: 0, Time elapsed: 30.97 sec
    [junit] Running org.apache.pig.test.TestStoreOld
    [junit] Tests run: 3, Failures: 0, Errors: 0, Skipped: 0, Time elapsed: 49.241 sec
    [junit] Running org.apache.pig.test.TestStreaming
    [junit] Tests run: 15, Failures: 0, Errors: 0, Skipped: 0, Time elapsed: 327.652 sec
    [junit] Running org.apache.pig.test.TestStreamingLocal
    [junit] Tests run: 7, Failures: 0, Errors: 0, Skipped: 0, Time elapsed: 31.512 sec
    [junit] Running org.apache.pig.test.TestStringUDFs
    [junit] Tests run: 17, Failures: 0, Errors: 0, Skipped: 0, Time elapsed: 0.298 sec
    [junit] Running org.apache.pig.test.TestSubtract
    [junit] Tests run: 1, Failures: 0, Errors: 0, Skipped: 0, Time elapsed: 0.428 sec
    [junit] Running org.apache.pig.test.TestTextDataParser
    [junit] Tests run: 15, Failures: 0, Errors: 0, Skipped: 0, Time elapsed: 0.857 sec
    [junit] Running org.apache.pig.test.TestTmpFileCompression
    [junit] Tests run: 8, Failures: 0, Errors: 0, Skipped: 0, Time elapsed: 311.592 sec
    [junit] Running org.apache.pig.test.TestToolsPigServer
    [junit] Tests run: 2, Failures: 0, Errors: 0, Skipped: 0, Time elapsed: 68.122 sec
    [junit] Running org.apache.pig.test.TestTuple
    [junit] Tests run: 12, Failures: 0, Errors: 0, Skipped: 0, Time elapsed: 0.612 sec
    [junit] Running org.apache.pig.test.TestTypeCheckingValidatorNewLP
    [junit] Tests run: 141, Failures: 0, Errors: 0, Skipped: 0, Time elapsed: 23.32 sec
    [junit] Running org.apache.pig.test.TestTypedMap
    [junit] Tests run: 8, Failures: 0, Errors: 0, Skipped: 0, Time elapsed: 24.6 sec
    [junit] Running org.apache.pig.test.TestUDF
    [junit] Tests run: 10, Failures: 0, Errors: 0, Skipped: 0, Time elapsed: 82.473 sec
    [junit] Running org.apache.pig.test.TestUDFContext
    [junit] Tests run: 2, Failures: 0, Errors: 0, Skipped: 0, Time elapsed: 6.206 sec
    [junit] Running org.apache.pig.test.TestUDFGroovy
    [junit] Tests run: 7, Failures: 0, Errors: 0, Skipped: 0, Time elapsed: 16.11 sec
    [junit] Running org.apache.pig.test.TestUDFWithoutParameter
    [junit] Tests run: 1, Failures: 0, Errors: 0, Skipped: 0, Time elapsed: 5.793 sec
    [junit] Running org.apache.pig.test.TestUTF8
    [junit] Tests run: 4, Failures: 0, Errors: 0, Skipped: 0, Time elapsed: 8.292 sec
    [junit] Running org.apache.pig.test.TestUnion
    [junit] Tests run: 7, Failures: 0, Errors: 0, Skipped: 0, Time elapsed: 19.455 sec
    [junit] Running org.apache.pig.test.TestUnionOnSchema
    [junit] Tests run: 22, Failures: 0, Errors: 1, Skipped: 0, Time elapsed: 52.835 sec
    [junit] Test org.apache.pig.test.TestUnionOnSchema FAILED
    [junit] Running org.apache.pig.test.pigunit.TestPigTest
    [junit] Tests run: 22, Failures: 0, Errors: 0, Skipped: 1, Time elapsed: 52.827 sec
    [junit] Running org.apache.pig.test.pigunit.pig.TestGruntParser
    [junit] Tests run: 5, Failures: 0, Errors: 0, Skipped: 0, Time elapsed: 1.785 sec
    [junit] Running org.apache.pig.tez.TestGroupConstParallelTez
    [junit] Tests run: 3, Failures: 0, Errors: 0, Skipped: 0, Time elapsed: 53.92 sec
    [junit] Running org.apache.pig.tez.TestJobSubmissionTez
    [junit] Tests run: 7, Failures: 0, Errors: 0, Skipped: 2, Time elapsed: 24.663 sec
    [junit] Running org.apache.pig.tez.TestLoaderStorerShipCacheFilesTez
    [junit] Tests run: 4, Failures: 0, Errors: 0, Skipped: 0, Time elapsed: 2.84 sec
    [junit] Running org.apache.pig.tez.TestPOPartialAggPlanTez
    [junit] Tests run: 5, Failures: 0, Errors: 0, Skipped: 0, Time elapsed: 3.082 sec
    [junit] Running org.apache.pig.tez.TestPigStatsTez
    [junit] Tests run: 5, Failures: 0, Errors: 0, Skipped: 0, Time elapsed: 8.545 sec
    [junit] Running org.apache.pig.tez.TestSecondarySortTez
    [junit] Tests run: 18, Failures: 0, Errors: 0, Skipped: 0, Time elapsed: 121.402 sec
    [junit] Running org.apache.pig.tez.TestTezAutoParallelism
    [junit] Tests run: 8, Failures: 0, Errors: 1, Skipped: 0, Time elapsed: 218.959 sec
    [junit] Test org.apache.pig.tez.TestTezAutoParallelism FAILED
    [junit] Running org.apache.pig.tez.TestTezCompiler
    [junit] Tests run: 43, Failures: 2, Errors: 9, Skipped: 0, Time elapsed: 11.859 sec
    [junit] Test org.apache.pig.tez.TestTezCompiler FAILED
    [junit] Running org.apache.pig.tez.TestTezGraceParallelism
    [junit] Tests run: 4, Failures: 0, Errors: 0, Skipped: 0, Time elapsed: 31.716 sec
    [junit] Running org.apache.pig.tez.TestTezJobControlCompiler
    [junit] Tests run: 8, Failures: 0, Errors: 3, Skipped: 0, Time elapsed: 4.83 sec
    [junit] Test org.apache.pig.tez.TestTezJobControlCompiler FAILED
    [junit] Running org.apache.pig.tez.TestTezLauncher
    [junit] Tests run: 2, Failures: 0, Errors: 0, Skipped: 0, Time elapsed: 55.616 sec
    [junit] Running org.apache.pig.tools.grunt.TestGruntParser
    [junit] Tests run: 1, Failures: 0, Errors: 0, Skipped: 0, Time elapsed: 1.323 sec
   [delete] Deleting directory /tmp/pig_junit_tmp1482452458

BUILD FAILED
<https://builds.apache.org/job/Pig-trunk-commit/ws/trunk/build.xml>:985: Tests failed!

Total time: 630 minutes 30 seconds
Build step 'Execute shell' marked build as failure
Recording test results
Publishing Javadoc
Recording fingerprints

Build failed in Jenkins: Pig-trunk-commit #2127

Posted by Apache Jenkins Server <je...@builds.apache.org>.
See <https://builds.apache.org/job/Pig-trunk-commit/2127/changes>

Changes:

[daijy] PIG-4523: Tez engine should use tez config rather than mr config whenever possible

[daijy] PIG-4452: Embedded SQL using "SQL" instead of "sql" fails with string index out of range: -1 error

[daijy] PIG-4543: TestEvalPipelineLocal.testRankWithEmptyReduce fail on Hadoop 1

[daijy] PIG-4544: Upgrade Hbase to 0.98.12

------------------------------------------
[...truncated 4407 lines...]
    [junit] Tests run: 3, Failures: 0, Errors: 0, Skipped: 0, Time elapsed: 37.216 sec
    [junit] Running org.apache.pig.test.TestNewPlanListener
    [junit] Tests run: 4, Failures: 0, Errors: 0, Skipped: 0, Time elapsed: 0.364 sec
    [junit] Running org.apache.pig.test.TestNewPlanLogToPhyTranslationVisitor
    [junit] Tests run: 27, Failures: 0, Errors: 0, Skipped: 0, Time elapsed: 5.224 sec
    [junit] Running org.apache.pig.test.TestNewPlanLogicalOptimizer
    [junit] Tests run: 1, Failures: 0, Errors: 0, Skipped: 0, Time elapsed: 1.444 sec
    [junit] Running org.apache.pig.test.TestNewPlanOperatorPlan
    [junit] Tests run: 47, Failures: 0, Errors: 0, Skipped: 0, Time elapsed: 4.282 sec
    [junit] Running org.apache.pig.test.TestNewPlanPruneMapKeys
    [junit] Tests run: 8, Failures: 0, Errors: 0, Skipped: 0, Time elapsed: 3.01 sec
    [junit] Running org.apache.pig.test.TestNewPlanPushDownForeachFlatten
    [junit] Tests run: 45, Failures: 0, Errors: 0, Skipped: 0, Time elapsed: 7.469 sec
    [junit] Running org.apache.pig.test.TestNewPlanPushUpFilter
    [junit] Tests run: 46, Failures: 0, Errors: 0, Skipped: 0, Time elapsed: 7.617 sec
    [junit] Running org.apache.pig.test.TestNewPlanRule
    [junit] Tests run: 4, Failures: 0, Errors: 0, Skipped: 0, Time elapsed: 0.331 sec
    [junit] Running org.apache.pig.test.TestNotEqualTo
    [junit] Tests run: 28, Failures: 0, Errors: 0, Skipped: 0, Time elapsed: 0.46 sec
    [junit] Running org.apache.pig.test.TestNull
    [junit] Tests run: 2, Failures: 0, Errors: 0, Skipped: 0, Time elapsed: 0.442 sec
    [junit] Running org.apache.pig.test.TestNullConstant
    [junit] Tests run: 8, Failures: 0, Errors: 0, Skipped: 0, Time elapsed: 25.812 sec
    [junit] Running org.apache.pig.test.TestNumberOfReducers
    [junit] Tests run: 10, Failures: 0, Errors: 0, Skipped: 0, Time elapsed: 515.417 sec
    [junit] Running org.apache.pig.test.TestOptimizeLimit
    [junit] Tests run: 12, Failures: 0, Errors: 0, Skipped: 0, Time elapsed: 3.485 sec
    [junit] Running org.apache.pig.test.TestOrderBy3
    [junit] Tests run: 4, Failures: 0, Errors: 0, Skipped: 0, Time elapsed: 14.467 sec
    [junit] Running org.apache.pig.test.TestPOBinCond
    [junit] Tests run: 10, Failures: 0, Errors: 0, Skipped: 0, Time elapsed: 0.458 sec
    [junit] Running org.apache.pig.test.TestPOCast
    [junit] Tests run: 14, Failures: 0, Errors: 0, Skipped: 0, Time elapsed: 0.879 sec
    [junit] Running org.apache.pig.test.TestPODistinct
    [junit] Tests run: 6, Failures: 0, Errors: 0, Skipped: 0, Time elapsed: 0.391 sec
    [junit] Running org.apache.pig.test.TestPOGenerate
    [junit] Tests run: 3, Failures: 0, Errors: 0, Skipped: 0, Time elapsed: 0.373 sec
    [junit] Running org.apache.pig.test.TestPOMapLookUp
    [junit] Tests run: 1, Failures: 0, Errors: 0, Skipped: 0, Time elapsed: 0.359 sec
    [junit] Running org.apache.pig.test.TestPONegative
    [junit] Tests run: 9, Failures: 0, Errors: 0, Skipped: 0, Time elapsed: 5.776 sec
    [junit] Running org.apache.pig.test.TestPOPartialAgg
    [junit] Tests run: 16, Failures: 0, Errors: 0, Skipped: 0, Time elapsed: 4.076 sec
    [junit] Running org.apache.pig.test.TestPOPartialAggPlan
    [junit] Tests run: 1, Failures: 0, Errors: 0, Skipped: 1, Time elapsed: 0.24 sec
    [junit] Running org.apache.pig.test.TestPORegexp
    [junit] Tests run: 2, Failures: 0, Errors: 0, Skipped: 0, Time elapsed: 0.377 sec
    [junit] Running org.apache.pig.test.TestPOSort
    [junit] Tests run: 14, Failures: 0, Errors: 0, Skipped: 0, Time elapsed: 0.451 sec
    [junit] Running org.apache.pig.test.TestPOSplit
    [junit] Tests run: 1, Failures: 0, Errors: 0, Skipped: 0, Time elapsed: 0.36 sec
    [junit] Running org.apache.pig.test.TestPOUserFunc
    [junit] Tests run: 6, Failures: 0, Errors: 0, Skipped: 0, Time elapsed: 0.445 sec
    [junit] Running org.apache.pig.test.TestPackage
    [junit] Tests run: 1, Failures: 0, Errors: 0, Skipped: 0, Time elapsed: 7.783 sec
    [junit] Running org.apache.pig.test.TestParamSubPreproc
    [junit] Tests run: 36, Failures: 0, Errors: 0, Skipped: 0, Time elapsed: 4.42 sec
    [junit] Running org.apache.pig.test.TestParser
    [junit] Tests run: 4, Failures: 0, Errors: 0, Skipped: 0, Time elapsed: 5.189 sec
    [junit] Running org.apache.pig.test.TestPhyOp
    [junit] Tests run: 1, Failures: 0, Errors: 0, Skipped: 0, Time elapsed: 0.44 sec
    [junit] Running org.apache.pig.test.TestPhyPatternMatch
    [junit] Tests run: 4, Failures: 0, Errors: 0, Skipped: 0, Time elapsed: 0.36 sec
    [junit] Running org.apache.pig.test.TestPigContext
    [junit] Tests run: 6, Failures: 0, Errors: 0, Skipped: 0, Time elapsed: 58.951 sec
    [junit] Running org.apache.pig.test.TestPigContextClassCache
    [junit] Tests run: 1, Failures: 0, Errors: 0, Skipped: 0, Time elapsed: 0.339 sec
    [junit] Running org.apache.pig.test.TestPigException
    [junit] Tests run: 2, Failures: 0, Errors: 0, Skipped: 0, Time elapsed: 0.252 sec
    [junit] Running org.apache.pig.test.TestPigProgressReporting
    [junit] Tests run: 1, Failures: 0, Errors: 0, Skipped: 0, Time elapsed: 45.516 sec
    [junit] Running org.apache.pig.test.TestPigRunner
    [junit] Tests run: 30, Failures: 0, Errors: 0, Skipped: 1, Time elapsed: 203.896 sec
    [junit] Running org.apache.pig.test.TestPigScriptParser
    [junit] Tests run: 4, Failures: 0, Errors: 0, Skipped: 0, Time elapsed: 4.381 sec
    [junit] Running org.apache.pig.test.TestPigServer
    [junit] Tests run: 31, Failures: 0, Errors: 0, Skipped: 0, Time elapsed: 74.725 sec
    [junit] Running org.apache.pig.test.TestPigServerLocal
    [junit] Tests run: 7, Failures: 0, Errors: 0, Skipped: 0, Time elapsed: 34.111 sec
    [junit] Running org.apache.pig.test.TestPigServerWithMacros
    [junit] Tests run: 2, Failures: 0, Errors: 0, Skipped: 0, Time elapsed: 8.602 sec
    [junit] Running org.apache.pig.test.TestPigServerWithMacrosRemote
    [junit] Tests run: 1, Failures: 0, Errors: 0, Skipped: 0, Time elapsed: 30.847 sec
    [junit] Running org.apache.pig.test.TestPigSplit
    [junit] Tests run: 3, Failures: 0, Errors: 0, Skipped: 0, Time elapsed: 64.62 sec
    [junit] Running org.apache.pig.test.TestPigStats
    [junit] Tests run: 1, Failures: 0, Errors: 0, Skipped: 1, Time elapsed: 0.217 sec
    [junit] Running org.apache.pig.test.TestPigStorage
    [junit] Tests run: 20, Failures: 0, Errors: 0, Skipped: 0, Time elapsed: 67.386 sec
    [junit] Running org.apache.pig.test.TestPigStreaming
    [junit] Tests run: 13, Failures: 0, Errors: 0, Skipped: 0, Time elapsed: 0.36 sec
    [junit] Running org.apache.pig.test.TestPigTupleRawComparator
    [junit] Tests run: 16, Failures: 0, Errors: 0, Skipped: 0, Time elapsed: 1.656 sec
    [junit] Running org.apache.pig.test.TestPinOptions
    [junit] Tests run: 3, Failures: 0, Errors: 0, Skipped: 0, Time elapsed: 2.954 sec
    [junit] Running org.apache.pig.test.TestPlanGeneration
    [junit] Tests run: 10, Failures: 0, Errors: 0, Skipped: 0, Time elapsed: 2.879 sec
    [junit] Running org.apache.pig.test.TestPoissonSampleLoader
    [junit] Tests run: 1, Failures: 0, Errors: 0, Skipped: 0, Time elapsed: 5.673 sec
    [junit] Running org.apache.pig.test.TestPredeployedJar
    [junit] Tests run: 2, Failures: 0, Errors: 0, Skipped: 0, Time elapsed: 39.258 sec
    [junit] Running org.apache.pig.test.TestProject
    [junit] Tests run: 12, Failures: 0, Errors: 0, Skipped: 0, Time elapsed: 13.222 sec
    [junit] Running org.apache.pig.test.TestProjectRange
    [junit] Tests run: 23, Failures: 0, Errors: 0, Skipped: 0, Time elapsed: 122.221 sec
    [junit] Running org.apache.pig.test.TestProjectStarExpander
    [junit] Tests run: 2, Failures: 0, Errors: 0, Skipped: 0, Time elapsed: 8.262 sec
    [junit] Running org.apache.pig.test.TestProjectStarRangeInUdf
    [junit] Tests run: 15, Failures: 0, Errors: 0, Skipped: 0, Time elapsed: 10.087 sec
    [junit] Running org.apache.pig.test.TestPruneColumn
    [junit] Tests run: 71, Failures: 0, Errors: 0, Skipped: 0, Time elapsed: 166.044 sec
    [junit] Running org.apache.pig.test.TestRank1
    [junit] Tests run: 9, Failures: 0, Errors: 0, Skipped: 0, Time elapsed: 26.799 sec
    [junit] Running org.apache.pig.test.TestRank2
    [junit] Tests run: 4, Failures: 0, Errors: 0, Skipped: 0, Time elapsed: 15.206 sec
    [junit] Running org.apache.pig.test.TestRank3
    [junit] Tests run: 4, Failures: 0, Errors: 0, Skipped: 0, Time elapsed: 21.015 sec
    [junit] Running org.apache.pig.test.TestReadToEndLoader
    [junit] Tests run: 1, Failures: 0, Errors: 0, Skipped: 0, Time elapsed: 1.182 sec
    [junit] Running org.apache.pig.test.TestRegexp
    [junit] Tests run: 2, Failures: 0, Errors: 0, Skipped: 0, Time elapsed: 0.349 sec
    [junit] Running org.apache.pig.test.TestRegisteredJarVisibility
    [junit] Tests run: 4, Failures: 0, Errors: 0, Skipped: 0, Time elapsed: 29.796 sec
    [junit] Running org.apache.pig.test.TestRelationToExprProject
    [junit] Tests run: 5, Failures: 0, Errors: 0, Skipped: 0, Time elapsed: 15.844 sec
    [junit] Running org.apache.pig.test.TestResourceSchema
    [junit] Tests run: 9, Failures: 0, Errors: 0, Skipped: 0, Time elapsed: 0.718 sec
    [junit] Running org.apache.pig.test.TestRollupDimensions
    [junit] Tests run: 1, Failures: 0, Errors: 0, Skipped: 0, Time elapsed: 0.364 sec
    [junit] Running org.apache.pig.test.TestSample
    [junit] Tests run: 7, Failures: 0, Errors: 0, Skipped: 0, Time elapsed: 45.353 sec
    [junit] Running org.apache.pig.test.TestSampleOptimizer
    [junit] Tests run: 5, Failures: 0, Errors: 0, Skipped: 0, Time elapsed: 103.299 sec
    [junit] Running org.apache.pig.test.TestScalarAliases
    [junit] Tests run: 2, Failures: 0, Errors: 0, Skipped: 1, Time elapsed: 33.332 sec
    [junit] Running org.apache.pig.test.TestScalarAliasesLocal
    [junit] Tests run: 12, Failures: 0, Errors: 0, Skipped: 0, Time elapsed: 72.343 sec
    [junit] Running org.apache.pig.test.TestSchema
    [junit] Tests run: 31, Failures: 0, Errors: 0, Skipped: 0, Time elapsed: 52.294 sec
    [junit] Running org.apache.pig.test.TestSchemaUtil
    [junit] Tests run: 2, Failures: 0, Errors: 0, Skipped: 0, Time elapsed: 0.331 sec
    [junit] Running org.apache.pig.test.TestScriptLanguage
    [junit] Tests run: 19, Failures: 0, Errors: 0, Skipped: 1, Time elapsed: 303.367 sec
    [junit] Running org.apache.pig.test.TestScriptLanguageJavaScript
    [junit] Tests run: 2, Failures: 0, Errors: 0, Skipped: 0, Time elapsed: 121.419 sec
    [junit] Running org.apache.pig.test.TestScriptUDF
    [junit] Tests run: 6, Failures: 0, Errors: 0, Skipped: 0, Time elapsed: 228.219 sec
    [junit] Running org.apache.pig.test.TestScriptingLanguagePython
    [junit] Tests run: 1, Failures: 0, Errors: 0, Skipped: 0, Time elapsed: 34.645 sec
    [junit] Running org.apache.pig.test.TestSecondarySort
    [junit] Tests run: 1, Failures: 0, Errors: 0, Skipped: 1, Time elapsed: 0.247 sec
    [junit] Running org.apache.pig.test.TestShortcuts
    [junit] Tests run: 19, Failures: 0, Errors: 0, Skipped: 0, Time elapsed: 9.937 sec
    [junit] Running org.apache.pig.test.TestSkewedJoin
    [junit] Tests run: 14, Failures: 0, Errors: 0, Skipped: 0, Time elapsed: 181.268 sec
    [junit] Running org.apache.pig.test.TestSplit
    [junit] Tests run: 4, Failures: 0, Errors: 0, Skipped: 0, Time elapsed: 12.887 sec
    [junit] Running org.apache.pig.test.TestSplitCombine
    [junit] Tests run: 11, Failures: 0, Errors: 0, Skipped: 0, Time elapsed: 1.389 sec
    [junit] Running org.apache.pig.test.TestSplitIndex
    [junit] Tests run: 2, Failures: 0, Errors: 0, Skipped: 0, Time elapsed: 8.015 sec
    [junit] Running org.apache.pig.test.TestSplitStore
    [junit] Tests run: 9, Failures: 0, Errors: 0, Skipped: 0, Time elapsed: 94.618 sec
    [junit] Running org.apache.pig.test.TestStore
    [junit] Tests run: 18, Failures: 0, Errors: 0, Skipped: 0, Time elapsed: 146.818 sec
    [junit] Running org.apache.pig.test.TestStoreBase
    [junit] Tests run: 1, Failures: 0, Errors: 0, Skipped: 1, Time elapsed: 0.239 sec
    [junit] Running org.apache.pig.test.TestStoreInstances
    [junit] Tests run: 1, Failures: 0, Errors: 0, Skipped: 0, Time elapsed: 53.437 sec
    [junit] Running org.apache.pig.test.TestStoreLocal
    [junit] Tests run: 6, Failures: 0, Errors: 0, Skipped: 0, Time elapsed: 30.949 sec
    [junit] Running org.apache.pig.test.TestStoreOld
    [junit] Tests run: 3, Failures: 0, Errors: 0, Skipped: 0, Time elapsed: 48.205 sec
    [junit] Running org.apache.pig.test.TestStreaming
    [junit] Tests run: 15, Failures: 0, Errors: 0, Skipped: 0, Time elapsed: 328.822 sec
    [junit] Running org.apache.pig.test.TestStreamingLocal
    [junit] Tests run: 7, Failures: 0, Errors: 0, Skipped: 0, Time elapsed: 31.521 sec
    [junit] Running org.apache.pig.test.TestStringUDFs
    [junit] Tests run: 17, Failures: 0, Errors: 0, Skipped: 0, Time elapsed: 0.297 sec
    [junit] Running org.apache.pig.test.TestSubtract
    [junit] Tests run: 1, Failures: 0, Errors: 0, Skipped: 0, Time elapsed: 0.429 sec
    [junit] Running org.apache.pig.test.TestTextDataParser
    [junit] Tests run: 15, Failures: 0, Errors: 0, Skipped: 0, Time elapsed: 0.851 sec
    [junit] Running org.apache.pig.test.TestTmpFileCompression
    [junit] Tests run: 8, Failures: 0, Errors: 0, Skipped: 0, Time elapsed: 300.868 sec
    [junit] Running org.apache.pig.test.TestToolsPigServer
    [junit] Tests run: 2, Failures: 0, Errors: 0, Skipped: 0, Time elapsed: 83.232 sec
    [junit] Running org.apache.pig.test.TestTuple
    [junit] Tests run: 12, Failures: 0, Errors: 0, Skipped: 0, Time elapsed: 0.611 sec
    [junit] Running org.apache.pig.test.TestTypeCheckingValidatorNewLP
    [junit] Tests run: 141, Failures: 0, Errors: 0, Skipped: 0, Time elapsed: 23.344 sec
    [junit] Running org.apache.pig.test.TestTypedMap
    [junit] Tests run: 8, Failures: 0, Errors: 0, Skipped: 0, Time elapsed: 24.557 sec
    [junit] Running org.apache.pig.test.TestUDF
    [junit] Tests run: 10, Failures: 0, Errors: 0, Skipped: 0, Time elapsed: 82.28 sec
    [junit] Running org.apache.pig.test.TestUDFContext
    [junit] Tests run: 2, Failures: 0, Errors: 0, Skipped: 0, Time elapsed: 6.23 sec
    [junit] Running org.apache.pig.test.TestUDFGroovy
    [junit] Tests run: 7, Failures: 0, Errors: 0, Skipped: 0, Time elapsed: 22.104 sec
    [junit] Running org.apache.pig.test.TestUDFWithoutParameter
    [junit] Tests run: 1, Failures: 0, Errors: 0, Skipped: 0, Time elapsed: 5.763 sec
    [junit] Running org.apache.pig.test.TestUTF8
    [junit] Tests run: 4, Failures: 0, Errors: 0, Skipped: 0, Time elapsed: 8.353 sec
    [junit] Running org.apache.pig.test.TestUnion
    [junit] Tests run: 7, Failures: 0, Errors: 0, Skipped: 0, Time elapsed: 19.334 sec
    [junit] Running org.apache.pig.test.TestUnionOnSchema
    [junit] Tests run: 22, Failures: 0, Errors: 1, Skipped: 0, Time elapsed: 52.835 sec
    [junit] Test org.apache.pig.test.TestUnionOnSchema FAILED
    [junit] Running org.apache.pig.test.pigunit.TestPigTest
    [junit] Tests run: 22, Failures: 0, Errors: 0, Skipped: 1, Time elapsed: 52.994 sec
    [junit] Running org.apache.pig.test.pigunit.pig.TestGruntParser
    [junit] Tests run: 5, Failures: 0, Errors: 0, Skipped: 0, Time elapsed: 2.091 sec
    [junit] Running org.apache.pig.tez.TestGroupConstParallelTez
    [junit] Tests run: 3, Failures: 0, Errors: 0, Skipped: 0, Time elapsed: 53.071 sec
    [junit] Running org.apache.pig.tez.TestJobSubmissionTez
    [junit] Tests run: 7, Failures: 0, Errors: 0, Skipped: 2, Time elapsed: 24.99 sec
    [junit] Running org.apache.pig.tez.TestLoaderStorerShipCacheFilesTez
    [junit] Tests run: 4, Failures: 0, Errors: 0, Skipped: 0, Time elapsed: 2.859 sec
    [junit] Running org.apache.pig.tez.TestPOPartialAggPlanTez
    [junit] Tests run: 5, Failures: 0, Errors: 0, Skipped: 0, Time elapsed: 2.958 sec
    [junit] Running org.apache.pig.tez.TestPigStatsTez
    [junit] Tests run: 5, Failures: 0, Errors: 0, Skipped: 0, Time elapsed: 8.597 sec
    [junit] Running org.apache.pig.tez.TestSecondarySortTez
    [junit] Tests run: 18, Failures: 0, Errors: 0, Skipped: 0, Time elapsed: 118.432 sec
    [junit] Running org.apache.pig.tez.TestTezAutoParallelism
    [junit] Tests run: 8, Failures: 0, Errors: 1, Skipped: 0, Time elapsed: 218.991 sec
    [junit] Test org.apache.pig.tez.TestTezAutoParallelism FAILED
    [junit] Running org.apache.pig.tez.TestTezCompiler
    [junit] Tests run: 43, Failures: 2, Errors: 9, Skipped: 0, Time elapsed: 11.83 sec
    [junit] Test org.apache.pig.tez.TestTezCompiler FAILED
    [junit] Running org.apache.pig.tez.TestTezGraceParallelism
    [junit] Tests run: 4, Failures: 0, Errors: 0, Skipped: 0, Time elapsed: 32.702 sec
    [junit] Running org.apache.pig.tez.TestTezJobControlCompiler
    [junit] Tests run: 8, Failures: 0, Errors: 3, Skipped: 0, Time elapsed: 4.85 sec
    [junit] Test org.apache.pig.tez.TestTezJobControlCompiler FAILED
    [junit] Running org.apache.pig.tez.TestTezLauncher
    [junit] Tests run: 2, Failures: 0, Errors: 0, Skipped: 0, Time elapsed: 55.535 sec
    [junit] Running org.apache.pig.tools.grunt.TestGruntParser
    [junit] Tests run: 1, Failures: 0, Errors: 0, Skipped: 0, Time elapsed: 1.335 sec
   [delete] Deleting directory /tmp/pig_junit_tmp1219359227

BUILD FAILED
<https://builds.apache.org/job/Pig-trunk-commit/ws/trunk/build.xml>:985: Tests failed!

Total time: 642 minutes 9 seconds
Build step 'Execute shell' marked build as failure
Recording test results
Publishing Javadoc
Recording fingerprints