You are viewing a plain text version of this content. The canonical link for it is here.
Posted to issues@tez.apache.org by Apache Jenkins Server <je...@builds.apache.org> on 2016/02/06 05:10:18 UTC
Failed: TEZ-3029 PreCommit Build #1452
Jira: https://issues.apache.org/jira/browse/TEZ-3029
Build: https://builds.apache.org/job/PreCommit-TEZ-Build/1452/
###################################################################################
########################## LAST 60 LINES OF THE CONSOLE ###########################
[...truncated 3662 lines...]
[ERROR] After correcting the problems, you can resume the build with the command
[ERROR] mvn <goals> -rf :tez-tests
[INFO] Build failures were ignored.
{color:red}-1 overall{color}. Here are the results of testing the latest attachment
http://issues.apache.org/jira/secure/attachment/12786625/TEZ-3029.1.txt
against master revision f352cfb.
{color:green}+1 @author{color}. The patch does not contain any @author tags.
{color:green}+1 tests included{color}. The patch appears to include 15 new or modified test files.
{color:red}-1 javac{color}. The applied patch generated 20 javac compiler warnings (more than the master's current 17 warnings).
{color:red}-1 javadoc{color}. The javadoc tool appears to have generated 2 warning messages.
See https://builds.apache.org/job/PreCommit-TEZ-Build/1452//artifact/patchprocess/diffJavadocWarnings.txt for details.
{color:green}+1 findbugs{color}. The patch does not introduce any new Findbugs (version 3.0.1) warnings.
{color:green}+1 release audit{color}. The applied patch does not increase the total number of release audit warnings.
{color:red}-1 core tests{color}. The patch failed these unit tests in :
org.apache.tez.test.TestFaultTolerance
Test results: https://builds.apache.org/job/PreCommit-TEZ-Build/1452//testReport/
Javac warnings: https://builds.apache.org/job/PreCommit-TEZ-Build/1452//artifact/patchprocess/diffJavacWarnings.txt
Console output: https://builds.apache.org/job/PreCommit-TEZ-Build/1452//console
This message is automatically generated.
======================================================================
======================================================================
Adding comment to Jira.
======================================================================
======================================================================
Comment added.
82ceac24c50f87289fc7dc01b3d41abdbeacf4ec logged out
======================================================================
======================================================================
Finished build.
======================================================================
======================================================================
Build step 'Execute shell' marked build as failure
Archiving artifacts
Compressed 3.21 MB of artifacts by 19.5% relative to #1441
[description-setter] Could not determine description.
Recording test results
Email was triggered for: Failure - Any
Sending email for trigger: Failure - Any
###################################################################################
############################## FAILED TESTS (if any) ##############################
7 tests failed.
FAILED: org.apache.tez.test.TestFaultTolerance.testRandomFailingInputs
Error Message:
expected:<SUCCEEDED> but was:<ERROR>
Stack Trace:
java.lang.AssertionError: expected:<SUCCEEDED> but was:<ERROR>
at org.junit.Assert.fail(Assert.java:88)
at org.junit.Assert.failNotEquals(Assert.java:743)
at org.junit.Assert.assertEquals(Assert.java:118)
at org.junit.Assert.assertEquals(Assert.java:144)
at org.apache.tez.test.TestFaultTolerance.runDAGAndVerify(TestFaultTolerance.java:141)
at org.apache.tez.test.TestFaultTolerance.runDAGAndVerify(TestFaultTolerance.java:124)
at org.apache.tez.test.TestFaultTolerance.runDAGAndVerify(TestFaultTolerance.java:120)
at org.apache.tez.test.TestFaultTolerance.testRandomFailingInputs(TestFaultTolerance.java:763)
FAILED: org.apache.tez.test.TestFaultTolerance.testBasicInputFailureWithExit
Error Message:
TezSession has already shutdown. No cluster diagnostics found.
Stack Trace:
org.apache.tez.dag.api.SessionNotRunning: TezSession has already shutdown. No cluster diagnostics found.
at org.apache.tez.client.TezClient.waitTillReady(TezClient.java:784)
at org.apache.tez.test.TestFaultTolerance.runDAGAndVerify(TestFaultTolerance.java:129)
at org.apache.tez.test.TestFaultTolerance.runDAGAndVerify(TestFaultTolerance.java:124)
at org.apache.tez.test.TestFaultTolerance.runDAGAndVerify(TestFaultTolerance.java:120)
at org.apache.tez.test.TestFaultTolerance.testBasicInputFailureWithExit(TestFaultTolerance.java:261)
FAILED: org.apache.tez.test.TestFaultTolerance.testInputFailureRerunCanSendOutputToTwoDownstreamVertices
Error Message:
TezSession has already shutdown. No cluster diagnostics found.
Stack Trace:
org.apache.tez.dag.api.SessionNotRunning: TezSession has already shutdown. No cluster diagnostics found.
at org.apache.tez.client.TezClient.waitTillReady(TezClient.java:784)
at org.apache.tez.test.TestFaultTolerance.runDAGAndVerify(TestFaultTolerance.java:129)
at org.apache.tez.test.TestFaultTolerance.runDAGAndVerify(TestFaultTolerance.java:124)
at org.apache.tez.test.TestFaultTolerance.runDAGAndVerify(TestFaultTolerance.java:120)
at org.apache.tez.test.TestFaultTolerance.testInputFailureRerunCanSendOutputToTwoDownstreamVertices(TestFaultTolerance.java:703)
FAILED: org.apache.tez.test.TestFaultTolerance.testMultipleInputFailureWithoutExit
Error Message:
TezSession has already shutdown. No cluster diagnostics found.
Stack Trace:
org.apache.tez.dag.api.SessionNotRunning: TezSession has already shutdown. No cluster diagnostics found.
at org.apache.tez.client.TezClient.waitTillReady(TezClient.java:784)
at org.apache.tez.test.TestFaultTolerance.runDAGAndVerify(TestFaultTolerance.java:129)
at org.apache.tez.test.TestFaultTolerance.runDAGAndVerify(TestFaultTolerance.java:124)
at org.apache.tez.test.TestFaultTolerance.runDAGAndVerify(TestFaultTolerance.java:120)
at org.apache.tez.test.TestFaultTolerance.testMultipleInputFailureWithoutExit(TestFaultTolerance.java:328)
FAILED: org.apache.tez.test.TestFaultTolerance.testCascadingInputFailureWithExitSuccess
Error Message:
TezSession has already shutdown. No cluster diagnostics found.
Stack Trace:
org.apache.tez.dag.api.SessionNotRunning: TezSession has already shutdown. No cluster diagnostics found.
at org.apache.tez.client.TezClient.waitTillReady(TezClient.java:784)
at org.apache.tez.test.TestFaultTolerance.runDAGAndVerify(TestFaultTolerance.java:129)
at org.apache.tez.test.TestFaultTolerance.runDAGAndVerify(TestFaultTolerance.java:124)
at org.apache.tez.test.TestFaultTolerance.runDAGAndVerify(TestFaultTolerance.java:120)
at org.apache.tez.test.TestFaultTolerance.testCascadingInputFailureWithExitSuccess(TestFaultTolerance.java:576)
FAILED: org.apache.tez.test.TestFaultTolerance.testBasicSuccessBroadcast
Error Message:
TezSession has already shutdown. No cluster diagnostics found.
Stack Trace:
org.apache.tez.dag.api.SessionNotRunning: TezSession has already shutdown. No cluster diagnostics found.
at org.apache.tez.client.TezClient.waitTillReady(TezClient.java:784)
at org.apache.tez.test.TestFaultTolerance.runDAGAndVerify(TestFaultTolerance.java:129)
at org.apache.tez.test.TestFaultTolerance.runDAGAndVerify(TestFaultTolerance.java:124)
at org.apache.tez.test.TestFaultTolerance.runDAGAndVerify(TestFaultTolerance.java:120)
at org.apache.tez.test.TestFaultTolerance.testBasicSuccessBroadcast(TestFaultTolerance.java:173)
FAILED: org.apache.tez.test.TestFaultTolerance.testTwoLevelsFailingDAGSuccess
Error Message:
TezSession has already shutdown. No cluster diagnostics found.
Stack Trace:
org.apache.tez.dag.api.SessionNotRunning: TezSession has already shutdown. No cluster diagnostics found.
at org.apache.tez.client.TezClient.waitTillReady(TezClient.java:784)
at org.apache.tez.test.TestFaultTolerance.runDAGAndVerify(TestFaultTolerance.java:129)
at org.apache.tez.test.TestFaultTolerance.runDAGAndVerify(TestFaultTolerance.java:124)
at org.apache.tez.test.TestFaultTolerance.runDAGAndVerify(TestFaultTolerance.java:120)
at org.apache.tez.test.TestFaultTolerance.testTwoLevelsFailingDAGSuccess(TestFaultTolerance.java:364)
Failed: TEZ-3102 PreCommit Build #1453
Posted by Apache Jenkins Server <je...@builds.apache.org>.
Jira: https://issues.apache.org/jira/browse/TEZ-3102
Build: https://builds.apache.org/job/PreCommit-TEZ-Build/1453/
###################################################################################
########################## LAST 60 LINES OF THE CONSOLE ###########################
[...truncated 3676 lines...]
[ERROR] [Help 1] http://cwiki.apache.org/confluence/display/MAVEN/MojoFailureException
[ERROR] [Help 2] http://cwiki.apache.org/confluence/display/MAVEN/MojoExecutionException
[ERROR]
[ERROR] After correcting the problems, you can resume the build with the command
[ERROR] mvn <goals> -rf :tez-tests
[INFO] Build failures were ignored.
{color:red}-1 overall{color}. Here are the results of testing the latest attachment
http://issues.apache.org/jira/secure/attachment/12786836/TEZ-3102.001.patch
against master revision f352cfb.
{color:green}+1 @author{color}. The patch does not contain any @author tags.
{color:green}+1 tests included{color}. The patch appears to include 1 new or modified test files.
{color:green}+1 javac{color}. The applied patch does not increase the total number of javac compiler warnings.
{color:green}+1 javadoc{color}. There were no new javadoc warning messages.
{color:green}+1 findbugs{color}. The patch does not introduce any new Findbugs (version 3.0.1) warnings.
{color:green}+1 release audit{color}. The applied patch does not increase the total number of release audit warnings.
{color:red}-1 core tests{color}. The patch failed these unit tests in :
org.apache.tez.test.TestFaultTolerance
Test results: https://builds.apache.org/job/PreCommit-TEZ-Build/1453//testReport/
Console output: https://builds.apache.org/job/PreCommit-TEZ-Build/1453//console
This message is automatically generated.
======================================================================
======================================================================
Adding comment to Jira.
======================================================================
======================================================================
Comment added.
da60a44712ca5355ccfafe82e5d710c238d16d56 logged out
======================================================================
======================================================================
Finished build.
======================================================================
======================================================================
Build step 'Execute shell' marked build as failure
Archiving artifacts
[description-setter] Could not determine description.
Recording test results
Email was triggered for: Failure - Any
Sending email for trigger: Failure - Any
###################################################################################
############################## FAILED TESTS (if any) ##############################
14 tests failed.
FAILED: org.apache.tez.test.TestFaultTolerance.testNoProgress
Error Message:
expected:<FAILED> but was:<ERROR>
Stack Trace:
java.lang.AssertionError: expected:<FAILED> but was:<ERROR>
at org.junit.Assert.fail(Assert.java:88)
at org.junit.Assert.failNotEquals(Assert.java:743)
at org.junit.Assert.assertEquals(Assert.java:118)
at org.junit.Assert.assertEquals(Assert.java:144)
at org.apache.tez.test.TestFaultTolerance.runDAGAndVerify(TestFaultTolerance.java:141)
at org.apache.tez.test.TestFaultTolerance.testNoProgress(TestFaultTolerance.java:777)
FAILED: org.apache.tez.test.TestFaultTolerance.testInputFailureCausesRerunAttemptWithinMaxAttemptSuccess
Error Message:
TezSession has already shutdown. No cluster diagnostics found.
Stack Trace:
org.apache.tez.dag.api.SessionNotRunning: TezSession has already shutdown. No cluster diagnostics found.
at org.apache.tez.client.TezClient.waitTillReady(TezClient.java:784)
at org.apache.tez.test.TestFaultTolerance.runDAGAndVerify(TestFaultTolerance.java:129)
at org.apache.tez.test.TestFaultTolerance.runDAGAndVerify(TestFaultTolerance.java:124)
at org.apache.tez.test.TestFaultTolerance.runDAGAndVerify(TestFaultTolerance.java:120)
at org.apache.tez.test.TestFaultTolerance.testInputFailureCausesRerunAttemptWithinMaxAttemptSuccess(TestFaultTolerance.java:476)
FAILED: org.apache.tez.test.TestFaultTolerance.testBasicInputFailureWithoutExit
Error Message:
TezSession has already shutdown. No cluster diagnostics found.
Stack Trace:
org.apache.tez.dag.api.SessionNotRunning: TezSession has already shutdown. No cluster diagnostics found.
at org.apache.tez.client.TezClient.waitTillReady(TezClient.java:784)
at org.apache.tez.test.TestFaultTolerance.runDAGAndVerify(TestFaultTolerance.java:129)
at org.apache.tez.test.TestFaultTolerance.runDAGAndVerify(TestFaultTolerance.java:124)
at org.apache.tez.test.TestFaultTolerance.runDAGAndVerify(TestFaultTolerance.java:120)
at org.apache.tez.test.TestFaultTolerance.testBasicInputFailureWithoutExit(TestFaultTolerance.java:283)
FAILED: org.apache.tez.test.TestFaultTolerance.testBasicTaskFailure
Error Message:
TezSession has already shutdown. No cluster diagnostics found.
Stack Trace:
org.apache.tez.dag.api.SessionNotRunning: TezSession has already shutdown. No cluster diagnostics found.
at org.apache.tez.client.TezClient.waitTillReady(TezClient.java:784)
at org.apache.tez.test.TestFaultTolerance.runDAGAndVerify(TestFaultTolerance.java:129)
at org.apache.tez.test.TestFaultTolerance.runDAGAndVerify(TestFaultTolerance.java:124)
at org.apache.tez.test.TestFaultTolerance.testBasicTaskFailure(TestFaultTolerance.java:198)
FAILED: org.apache.tez.test.TestFaultTolerance.testBasicSuccessScatterGather
Error Message:
TezSession has already shutdown. No cluster diagnostics found.
Stack Trace:
org.apache.tez.dag.api.SessionNotRunning: TezSession has already shutdown. No cluster diagnostics found.
at org.apache.tez.client.TezClient.waitTillReady(TezClient.java:784)
at org.apache.tez.test.TestFaultTolerance.runDAGAndVerify(TestFaultTolerance.java:129)
at org.apache.tez.test.TestFaultTolerance.runDAGAndVerify(TestFaultTolerance.java:124)
at org.apache.tez.test.TestFaultTolerance.runDAGAndVerify(TestFaultTolerance.java:120)
at org.apache.tez.test.TestFaultTolerance.testBasicSuccessScatterGather(TestFaultTolerance.java:157)
FAILED: org.apache.tez.test.TestFaultTolerance.testThreeLevelsFailingDAGSuccess
Error Message:
TezSession has already shutdown. No cluster diagnostics found.
Stack Trace:
org.apache.tez.dag.api.SessionNotRunning: TezSession has already shutdown. No cluster diagnostics found.
at org.apache.tez.client.TezClient.waitTillReady(TezClient.java:784)
at org.apache.tez.test.TestFaultTolerance.runDAGAndVerify(TestFaultTolerance.java:129)
at org.apache.tez.test.TestFaultTolerance.runDAGAndVerify(TestFaultTolerance.java:124)
at org.apache.tez.test.TestFaultTolerance.runDAGAndVerify(TestFaultTolerance.java:120)
at org.apache.tez.test.TestFaultTolerance.testThreeLevelsFailingDAGSuccess(TestFaultTolerance.java:371)
FAILED: org.apache.tez.test.TestFaultTolerance.testSixLevelsFailingDAGSuccess
Error Message:
TezSession has already shutdown. No cluster diagnostics found.
Stack Trace:
org.apache.tez.dag.api.SessionNotRunning: TezSession has already shutdown. No cluster diagnostics found.
at org.apache.tez.client.TezClient.waitTillReady(TezClient.java:784)
at org.apache.tez.test.TestFaultTolerance.runDAGAndVerify(TestFaultTolerance.java:129)
at org.apache.tez.test.TestFaultTolerance.runDAGAndVerify(TestFaultTolerance.java:124)
at org.apache.tez.test.TestFaultTolerance.runDAGAndVerify(TestFaultTolerance.java:120)
at org.apache.tez.test.TestFaultTolerance.testSixLevelsFailingDAGSuccess(TestFaultTolerance.java:378)
FAILED: org.apache.tez.test.TestFaultTolerance.testRandomFailingInputs
Error Message:
TezSession has already shutdown. No cluster diagnostics found.
Stack Trace:
org.apache.tez.dag.api.SessionNotRunning: TezSession has already shutdown. No cluster diagnostics found.
at org.apache.tez.client.TezClient.waitTillReady(TezClient.java:784)
at org.apache.tez.test.TestFaultTolerance.runDAGAndVerify(TestFaultTolerance.java:129)
at org.apache.tez.test.TestFaultTolerance.runDAGAndVerify(TestFaultTolerance.java:124)
at org.apache.tez.test.TestFaultTolerance.runDAGAndVerify(TestFaultTolerance.java:120)
at org.apache.tez.test.TestFaultTolerance.testRandomFailingInputs(TestFaultTolerance.java:763)
FAILED: org.apache.tez.test.TestFaultTolerance.testBasicInputFailureWithExit
Error Message:
TezSession has already shutdown. No cluster diagnostics found.
Stack Trace:
org.apache.tez.dag.api.SessionNotRunning: TezSession has already shutdown. No cluster diagnostics found.
at org.apache.tez.client.TezClient.waitTillReady(TezClient.java:784)
at org.apache.tez.test.TestFaultTolerance.runDAGAndVerify(TestFaultTolerance.java:129)
at org.apache.tez.test.TestFaultTolerance.runDAGAndVerify(TestFaultTolerance.java:124)
at org.apache.tez.test.TestFaultTolerance.runDAGAndVerify(TestFaultTolerance.java:120)
at org.apache.tez.test.TestFaultTolerance.testBasicInputFailureWithExit(TestFaultTolerance.java:261)
FAILED: org.apache.tez.test.TestFaultTolerance.testInputFailureRerunCanSendOutputToTwoDownstreamVertices
Error Message:
TezSession has already shutdown. No cluster diagnostics found.
Stack Trace:
org.apache.tez.dag.api.SessionNotRunning: TezSession has already shutdown. No cluster diagnostics found.
at org.apache.tez.client.TezClient.waitTillReady(TezClient.java:784)
at org.apache.tez.test.TestFaultTolerance.runDAGAndVerify(TestFaultTolerance.java:129)
at org.apache.tez.test.TestFaultTolerance.runDAGAndVerify(TestFaultTolerance.java:124)
at org.apache.tez.test.TestFaultTolerance.runDAGAndVerify(TestFaultTolerance.java:120)
at org.apache.tez.test.TestFaultTolerance.testInputFailureRerunCanSendOutputToTwoDownstreamVertices(TestFaultTolerance.java:703)
FAILED: org.apache.tez.test.TestFaultTolerance.testMultipleInputFailureWithoutExit
Error Message:
TezSession has already shutdown. No cluster diagnostics found.
Stack Trace:
org.apache.tez.dag.api.SessionNotRunning: TezSession has already shutdown. No cluster diagnostics found.
at org.apache.tez.client.TezClient.waitTillReady(TezClient.java:784)
at org.apache.tez.test.TestFaultTolerance.runDAGAndVerify(TestFaultTolerance.java:129)
at org.apache.tez.test.TestFaultTolerance.runDAGAndVerify(TestFaultTolerance.java:124)
at org.apache.tez.test.TestFaultTolerance.runDAGAndVerify(TestFaultTolerance.java:120)
at org.apache.tez.test.TestFaultTolerance.testMultipleInputFailureWithoutExit(TestFaultTolerance.java:328)
FAILED: org.apache.tez.test.TestFaultTolerance.testCascadingInputFailureWithExitSuccess
Error Message:
TezSession has already shutdown. No cluster diagnostics found.
Stack Trace:
org.apache.tez.dag.api.SessionNotRunning: TezSession has already shutdown. No cluster diagnostics found.
at org.apache.tez.client.TezClient.waitTillReady(TezClient.java:784)
at org.apache.tez.test.TestFaultTolerance.runDAGAndVerify(TestFaultTolerance.java:129)
at org.apache.tez.test.TestFaultTolerance.runDAGAndVerify(TestFaultTolerance.java:124)
at org.apache.tez.test.TestFaultTolerance.runDAGAndVerify(TestFaultTolerance.java:120)
at org.apache.tez.test.TestFaultTolerance.testCascadingInputFailureWithExitSuccess(TestFaultTolerance.java:576)
FAILED: org.apache.tez.test.TestFaultTolerance.testBasicSuccessBroadcast
Error Message:
TezSession has already shutdown. No cluster diagnostics found.
Stack Trace:
org.apache.tez.dag.api.SessionNotRunning: TezSession has already shutdown. No cluster diagnostics found.
at org.apache.tez.client.TezClient.waitTillReady(TezClient.java:784)
at org.apache.tez.test.TestFaultTolerance.runDAGAndVerify(TestFaultTolerance.java:129)
at org.apache.tez.test.TestFaultTolerance.runDAGAndVerify(TestFaultTolerance.java:124)
at org.apache.tez.test.TestFaultTolerance.runDAGAndVerify(TestFaultTolerance.java:120)
at org.apache.tez.test.TestFaultTolerance.testBasicSuccessBroadcast(TestFaultTolerance.java:173)
FAILED: org.apache.tez.test.TestFaultTolerance.testTwoLevelsFailingDAGSuccess
Error Message:
TezSession has already shutdown. No cluster diagnostics found.
Stack Trace:
org.apache.tez.dag.api.SessionNotRunning: TezSession has already shutdown. No cluster diagnostics found.
at org.apache.tez.client.TezClient.waitTillReady(TezClient.java:784)
at org.apache.tez.test.TestFaultTolerance.runDAGAndVerify(TestFaultTolerance.java:129)
at org.apache.tez.test.TestFaultTolerance.runDAGAndVerify(TestFaultTolerance.java:124)
at org.apache.tez.test.TestFaultTolerance.runDAGAndVerify(TestFaultTolerance.java:120)
at org.apache.tez.test.TestFaultTolerance.testTwoLevelsFailingDAGSuccess(TestFaultTolerance.java:364)