You are viewing a plain text version of this content. The canonical link for it is here.
Posted to builds@solr.apache.org by Apache Jenkins Server <je...@builds.apache.org> on 2026/08/03 06:12:39 UTC

[JENKINS] Solr » Solr-Test-10.0 - Build # 2095 - Unstable!

Build: https://ci-builds.apache.org/job/Solr/job/Solr-Test-10.0/2095/

1 tests failed.
FAILED:  org.apache.solr.handler.admin.LoggingHandlerTest.testLogLevelHandlerOutput

Error Message:
java.lang.AssertionError: Logger Missing: org.apache.solr.bogus_logger_package.BogusClass_A

Stack Trace:
java.lang.AssertionError: Logger Missing: org.apache.solr.bogus_logger_package.BogusClass_A
	at __randomizedtesting.SeedInfo.seed([C9C25E93EF68F31E:52991B1BB2D94DE7]:0)
	at org.junit.Assert.fail(Assert.java:89)
	at org.junit.Assert.assertTrue(Assert.java:42)
	at org.apache.solr.handler.admin.LoggingHandlerTest.assertLoggerLevel(LoggingHandlerTest.java:200)
	at org.apache.solr.handler.admin.LoggingHandlerTest.testLogLevelHandlerOutput(LoggingHandlerTest.java:129)
	at java.base/jdk.internal.reflect.DirectMethodHandleAccessor.invoke(DirectMethodHandleAccessor.java:103)
	at java.base/java.lang.reflect.Method.invoke(Method.java:580)
	at com.carrotsearch.randomizedtesting.RandomizedRunner.invoke(RandomizedRunner.java:1763)
	at com.carrotsearch.randomizedtesting.RandomizedRunner$8.evaluate(RandomizedRunner.java:946)
	at com.carrotsearch.randomizedtesting.RandomizedRunner$9.evaluate(RandomizedRunner.java:982)
	at com.carrotsearch.randomizedtesting.RandomizedRunner$10.evaluate(RandomizedRunner.java:996)
	at com.carrotsearch.randomizedtesting.rules.SystemPropertiesRestoreRule$1.evaluate(SystemPropertiesRestoreRule.java:80)
	at org.junit.rules.RunRules.evaluate(RunRules.java:20)
	at org.apache.lucene.tests.util.TestRuleSetupTeardownChained$1.evaluate(TestRuleSetupTeardownChained.java:48)
	at org.apache.lucene.tests.util.AbstractBeforeAfterRule$1.evaluate(AbstractBeforeAfterRule.java:43)
	at org.apache.lucene.tests.util.TestRuleThreadAndTestName$1.evaluate(TestRuleThreadAndTestName.java:45)
	at org.apache.lucene.tests.util.TestRuleIgnoreAfterMaxFailures$1.evaluate(TestRuleIgnoreAfterMaxFailures.java:60)
	at org.apache.lucene.tests.util.TestRuleMarkFailure$1.evaluate(TestRuleMarkFailure.java:44)
	at org.junit.rules.RunRules.evaluate(RunRules.java:20)
	at com.carrotsearch.randomizedtesting.rules.StatementAdapter.evaluate(StatementAdapter.java:36)
	at com.carrotsearch.randomizedtesting.ThreadLeakControl$StatementRunner.run(ThreadLeakControl.java:390)
	at com.carrotsearch.randomizedtesting.ThreadLeakControl.forkTimeoutingTask(ThreadLeakControl.java:843)
	at com.carrotsearch.randomizedtesting.ThreadLeakControl$3.evaluate(ThreadLeakControl.java:490)
	at com.carrotsearch.randomizedtesting.RandomizedRunner.runSingleTest(RandomizedRunner.java:955)
	at com.carrotsearch.randomizedtesting.RandomizedRunner$5.evaluate(RandomizedRunner.java:840)
	at com.carrotsearch.randomizedtesting.RandomizedRunner$6.evaluate(RandomizedRunner.java:891)
	at com.carrotsearch.randomizedtesting.RandomizedRunner$7.evaluate(RandomizedRunner.java:902)
	at com.carrotsearch.randomizedtesting.rules.StatementAdapter.evaluate(StatementAdapter.java:36)
	at org.apache.solr.util.LogLevelTestRule$LogLevelStatement.evaluate(LogLevelTestRule.java:63)
	at com.carrotsearch.randomizedtesting.rules.StatementAdapter.evaluate(StatementAdapter.java:36)
	at org.apache.lucene.tests.util.AbstractBeforeAfterRule$1.evaluate(AbstractBeforeAfterRule.java:43)
	at com.carrotsearch.randomizedtesting.rules.SystemPropertiesRestoreRule$1.evaluate(SystemPropertiesRestoreRule.java:80)
	at org.junit.rules.RunRules.evaluate(RunRules.java:20)
	at org.apache.lucene.tests.util.AbstractBeforeAfterRule$1.evaluate(AbstractBeforeAfterRule.java:43)
	at com.carrotsearch.randomizedtesting.rules.StatementAdapter.evaluate(StatementAdapter.java:36)
	at org.apache.lucene.tests.util.TestRuleStoreClassName$1.evaluate(TestRuleStoreClassName.java:38)
	at com.carrotsearch.randomizedtesting.rules.NoShadowingOrOverridesOnMethodsRule$1.evaluate(NoShadowingOrOverridesOnMethodsRule.java:40)
	at com.carrotsearch.randomizedtesting.rules.NoShadowingOrOverridesOnMethodsRule$1.evaluate(NoShadowingOrOverridesOnMethodsRule.java:40)
	at com.carrotsearch.randomizedtesting.rules.StatementAdapter.evaluate(StatementAdapter.java:36)
	at com.carrotsearch.randomizedtesting.rules.StatementAdapter.evaluate(StatementAdapter.java:36)
	at org.apache.lucene.tests.util.TestRuleAssertionsRequired$1.evaluate(TestRuleAssertionsRequired.java:53)
	at org.apache.lucene.tests.util.AbstractBeforeAfterRule$1.evaluate(AbstractBeforeAfterRule.java:43)
	at org.apache.lucene.tests.util.TestRuleMarkFailure$1.evaluate(TestRuleMarkFailure.java:44)
	at org.apache.lucene.tests.util.TestRuleIgnoreAfterMaxFailures$1.evaluate(TestRuleIgnoreAfterMaxFailures.java:60)
	at org.apache.lucene.tests.util.TestRuleIgnoreTestSuites$1.evaluate(TestRuleIgnoreTestSuites.java:47)
	at org.junit.rules.RunRules.evaluate(RunRules.java:20)
	at com.carrotsearch.randomizedtesting.rules.StatementAdapter.evaluate(StatementAdapter.java:36)
	at com.carrotsearch.randomizedtesting.ThreadLeakControl$StatementRunner.run(ThreadLeakControl.java:390)
	at com.carrotsearch.randomizedtesting.ThreadLeakControl.lambda$forkTimeoutingTask$0(ThreadLeakControl.java:850)
	at java.base/java.lang.Thread.run(Thread.java:1583)




Build Log:
[...truncated 11 lines...]
ERROR: Workspace has a .git repository, but it appears to be corrupt.
hudson.plugins.git.GitException: Command "git rev-parse --resolve-git-dir /home/jenkins/jenkins-agent/workspace/Solr/Solr-Test-10.0/.git" returned status code 128:
stdout: 
stderr: fatal: not a gitdir '/home/jenkins/jenkins-agent/workspace/Solr/Solr-Test-10.0/.git'

	at PluginClassLoader for git-client//org.jenkinsci.plugins.gitclient.CliGitAPIImpl.launchCommandIn(CliGitAPIImpl.java:2848)
	at PluginClassLoader for git-client//org.jenkinsci.plugins.gitclient.CliGitAPIImpl.launchCommandIn(CliGitAPIImpl.java:2768)
	at PluginClassLoader for git-client//org.jenkinsci.plugins.gitclient.CliGitAPIImpl.launchCommandIn(CliGitAPIImpl.java:2763)
	at PluginClassLoader for git-client//org.jenkinsci.plugins.gitclient.CliGitAPIImpl.launchCommand(CliGitAPIImpl.java:2052)
	at PluginClassLoader for git-client//org.jenkinsci.plugins.gitclient.CliGitAPIImpl.launchCommand(CliGitAPIImpl.java:2064)
	at PluginClassLoader for git-client//org.jenkinsci.plugins.gitclient.CliGitAPIImpl.hasGitRepo(CliGitAPIImpl.java:404)
	at PluginClassLoader for git-client//hudson.plugins.git.GitAPI.hasGitRepo(GitAPI.java:281)
	at jdk.internal.reflect.GeneratedMethodAccessor137.invoke(Unknown Source)
	at java.base/jdk.internal.reflect.DelegatingMethodAccessorImpl.invoke(DelegatingMethodAccessorImpl.java:43)
	at java.base/java.lang.reflect.Method.invoke(Method.java:569)
	at hudson.remoting.RemoteInvocationHandler$RPCRequest.perform(RemoteInvocationHandler.java:986)
	at hudson.remoting.RemoteInvocationHandler$RPCRequest.call(RemoteInvocationHandler.java:961)
	at hudson.remoting.RemoteInvocationHandler$RPCRequest.call(RemoteInvocationHandler.java:907)
	at hudson.remoting.UserRequest.perform(UserRequest.java:225)
	at hudson.remoting.UserRequest.perform(UserRequest.java:50)
	at hudson.remoting.Request$2.run(Request.java:391)
	at hudson.remoting.InterceptingExecutorService.lambda$wrap$0(InterceptingExecutorService.java:81)
	at java.base/java.util.concurrent.FutureTask.run(FutureTask.java:264)
	at java.base/java.util.concurrent.ThreadPoolExecutor.runWorker(ThreadPoolExecutor.java:1136)
	at java.base/java.util.concurrent.ThreadPoolExecutor$Worker.run(ThreadPoolExecutor.java:635)
	at java.base/java.lang.Thread.run(Thread.java:840)
Cloning the remote Git repository
Cloning repository https://gitbox.apache.org/repos/asf/solr.git
 > git init /home/jenkins/jenkins-agent/workspace/Solr/Solr-Test-10.0 # timeout=10
Fetching upstream changes from https://gitbox.apache.org/repos/asf/solr.git
 > git --version # timeout=10
 > git --version # 'git version 2.43.0'
 > git fetch --tags --force --progress -- https://gitbox.apache.org/repos/asf/solr.git +refs/heads/*:refs/remotes/origin/* # timeout=10
 > git config remote.origin.url https://gitbox.apache.org/repos/asf/solr.git # timeout=10
 > git config --add remote.origin.fetch +refs/heads/*:refs/remotes/origin/* # timeout=10
Avoid second fetch
 > git rev-parse refs/remotes/origin/branch_10_0^{commit} # timeout=10
Checking out Revision 93068d1dfbc48816caac29c5b3aba3bf884aea85 (refs/remotes/origin/branch_10_0)
 > git config core.sparsecheckout # timeout=10
 > git checkout -f 93068d1dfbc48816caac29c5b3aba3bf884aea85 # timeout=10
 > git branch -a -v --no-abbrev # timeout=10
 > git checkout -b branch_10_0 93068d1dfbc48816caac29c5b3aba3bf884aea85 # timeout=10
Commit message: "Ref Guide - Change component name to Apache Solr (#4521)"
 > git rev-list --no-walk 93068d1dfbc48816caac29c5b3aba3bf884aea85 # timeout=10
No emails were triggered.
provisioning config files...
copy managed file [gradle.properties] to file:/home/jenkins/jenkins-agent/workspace/Solr/Solr-Test-10.0/gradle.properties
[Gradle] - Launching build.
[Solr-Test-10.0] $ /home/jenkins/jenkins-agent/workspace/Solr/Solr-Test-10.0/gradlew -Dtests.haltonfailure=false -Dtests.badapples=false --continue test
Downloading gradle-wrapper.jar from https://raw.githubusercontent.com/gradle/gradle/v8.10.2/gradle/wrapper/gradle-wrapper.jar
To honour the JVM settings for this build a single-use Daemon process will be forked. For more on this, please refer to https://docs.gradle.org/8.10/userguide/gradle_daemon.html#sec:disabling_the_daemon in the Gradle documentation.
Daemon will be stopped at the end of the build 

> Task :build-infra:compileJava
Note: /home/jenkins/jenkins-agent/workspace/Solr/Solr-Test-10.0/build-tools/build-infra/src/main/java/org/apache/lucene/gradle/Checksum.java uses or overrides a deprecated API.
Note: Recompile with -Xlint:deprecation for details.

> Task :build-infra:pluginDescriptors
> Task :build-infra:processResources
> Task :build-infra:classes
> Task :build-infra:jar
> Task :gitStatus
> Task :checkJdkInternalsExportedToGradle

> Task :solr:api:compileJava
Note: Some input files use or override a deprecated API.
Note: Recompile with -Xlint:deprecation for details.

> Task :solr:api:processResources NO-SOURCE
> Task :solr:api:classes
> Task :solr:api:jar

> Task :randomizationInfo
Running tests with randomization seed: tests.seed=C9C25E93EF68F31E

> Task :solr:api:resolve
SLF4J(W): No SLF4J providers were found.
SLF4J(W): Defaulting to no-operation (NOP) logger implementation
SLF4J(W): See https://www.slf4j.org/codes.html#noProviders for further details.

> Task :solr:solrj:openApiGenerate
Cleaned up output directory /home/jenkins/jenkins-agent/workspace/Solr/Solr-Test-10.0/solr/solrj/build/generated/ before code generation (cleanupOutput set to true).
No application/json content media type found in response. Response examples can currently only be generated for application/json media type.
############################################################################################
# Thanks for using OpenAPI Generator.                                                      #
# We appreciate your support! Please consider donation to help us maintain this project.   #
# https://opencollective.com/openapi_generator/donate                                      #
############################################################################################
Successfully generated code to /home/jenkins/jenkins-agent/workspace/Solr/Solr-Test-10.0/solr/solrj/build/generated/

> Task :spotlessInternalRegisterDependencies
> Task :solr:solrj:generatedSpotlessHelper
> Task :solr:solrj:generatedSpotless

> Task :solr:solrj:compileJava
Note: Some input files use or override a deprecated API.
Note: Recompile with -Xlint:deprecation for details.

> Task :solr:solrj-jetty:compileJava
Note: /home/jenkins/jenkins-agent/workspace/Solr/Solr-Test-10.0/solr/solrj-jetty/src/java/org/apache/solr/client/solrj/jetty/HttpJettySolrClient.java uses or overrides a deprecated API.
Note: Recompile with -Xlint:deprecation for details.

> Task :solr:solrj-streaming:compileJava
Note: Some input files use or override a deprecated API.
Note: Recompile with -Xlint:deprecation for details.

> Task :solr:solrj-zookeeper:compileJava
Note: Some input files use or override a deprecated API.
Note: Recompile with -Xlint:deprecation for details.

> Task :solr:core:compileJava
Note: Some input files use or override a deprecated API.
Note: Recompile with -Xlint:deprecation for details.

> Task :solr:test-framework:compileJava
Note: Some input files use or override a deprecated API.
Note: Recompile with -Xlint:deprecation for details.

> Task :solr:api:compileTestJava
> Task :solr:api:processTestResources
> Task :solr:api:testClasses
> Task :solr:core:processResources
> Task :solr:core:classes
> Task :solr:core:jar
> Task :solr:solrj:processResources
> Task :solr:solrj:classes
> Task :solr:solrj:jar
> Task :solr:solrj-jetty:processResources NO-SOURCE
> Task :solr:solrj-jetty:classes
> Task :solr:solrj-jetty:jar
> Task :solr:solrj-streaming:processResources
> Task :solr:solrj-streaming:classes
> Task :solr:solrj-streaming:jar
> Task :solr:solrj-zookeeper:processResources NO-SOURCE
> Task :solr:solrj-zookeeper:classes
> Task :solr:solrj-zookeeper:jar
> Task :solr:test-framework:processResources
> Task :solr:test-framework:classes
> Task :solr:test-framework:jar

> Task :solr:api:test
WARNING: Using incubator modules: jdk.incubator.vector
WARNING: Using incubator modules: jdk.incubator.vector
WARNING: A command line option has enabled the Security Manager
WARNING: The Security Manager is deprecated and will be removed in a future release
WARNING: A command line option has enabled the Security Manager
WARNING: The Security Manager is deprecated and will be removed in a future release
java.security.policy: error adding Permission, java.net.URLPermission:
	java.util.ServiceConfigurationError: Locale provider adapter "CLDR"cannot be instantiated.
java.security.policy: error adding Permission, java.net.URLPermission:
	java.util.ServiceConfigurationError: Locale provider adapter "CLDR"cannot be instantiated.
java.security.policy: error adding Permission, java.net.URLPermission:
	java.util.ServiceConfigurationError: Locale provider adapter "CLDR"cannot be instantiated.
java.security.policy: error adding Permission, java.net.URLPermission:
	java.util.ServiceConfigurationError: Locale provider adapter "CLDR"cannot be instantiated.
java.security.policy: error adding Permission, java.net.URLPermission:
	java.util.ServiceConfigurationError: Locale provider adapter "CLDR"cannot be instantiated.
java.security.policy: error adding Permission, java.net.URLPermission:
	java.util.ServiceConfigurationError: Locale provider adapter "CLDR"cannot be instantiated.
:solr:api:test (SUCCESS): 19 test(s)

> Task :solr:api:wipeTaskTemp
> Task :solr:benchmark:compileJava
> Task :solr:benchmark:processResources
> Task :solr:benchmark:classes
> Task :solr:benchmark:compileTestJava
> Task :solr:benchmark:processTestResources
> Task :solr:benchmark:testClasses

> Task :solr:benchmark:test
WARNING: Using incubator modules: jdk.incubator.vector
WARNING: Using incubator modules: jdk.incubator.vector
WARNING: Using incubator modules: jdk.incubator.vector
WARNING: A command line option has enabled the Security Manager
WARNING: The Security Manager is deprecated and will be removed in a future release
WARNING: A command line option has enabled the Security Manager
WARNING: The Security Manager is deprecated and will be removed in a future release
WARNING: A command line option has enabled the Security Manager
WARNING: The Security Manager is deprecated and will be removed in a future release
java.security.policy: error adding Permission, java.net.URLPermission:
	java.util.ServiceConfigurationError: Locale provider adapter "CLDR"cannot be instantiated.
java.security.policy: error adding Permission, java.net.URLPermission:
	java.util.ServiceConfigurationError: Locale provider adapter "CLDR"cannot be instantiated.
java.security.policy: error adding Permission, java.net.URLPermission:
	java.util.ServiceConfigurationError: Locale provider adapter "CLDR"cannot be instantiated.
java.security.policy: error adding Permission, java.net.URLPermission:
	java.util.ServiceConfigurationError: Locale provider adapter "CLDR"cannot be instantiated.
java.security.policy: error adding Permission, java.net.URLPermission:
	java.util.ServiceConfigurationError: Locale provider adapter "CLDR"cannot be instantiated.
java.security.policy: error adding Permission, java.net.URLPermission:
	java.util.ServiceConfigurationError: Locale provider adapter "CLDR"cannot be instantiated.
java.security.policy: error adding Permission, java.net.URLPermission:
	java.util.ServiceConfigurationError: Locale provider adapter "CLDR"cannot be instantiated.
java.security.policy: error adding Permission, java.net.URLPermission:
	java.util.ServiceConfigurationError: Locale provider adapter "CLDR"cannot be instantiated.
java.security.policy: error adding Permission, java.net.URLPermission:
	java.util.ServiceConfigurationError: Locale provider adapter "CLDR"cannot be instantiated.
:solr:benchmark:test (SUCCESS): 10 test(s)

> Task :solr:benchmark:wipeTaskTemp
> Task :solr:core:compileTestJava
Note: Some input files use or override a deprecated API.
Note: Recompile with -Xlint:deprecation for details.

> Task :solr:core:processTestResources
> Task :solr:core:testClasses

> Task :solr:modules:analysis-extras:compileJava
Note: /home/jenkins/jenkins-agent/workspace/Solr/Solr-Test-10.0/solr/modules/analysis-extras/src/java/org/apache/solr/schema/ICUCollationField.java uses or overrides a deprecated API.
Note: Recompile with -Xlint:deprecation for details.

> Task :solr:modules:analysis-extras:processResources NO-SOURCE
> Task :solr:modules:analysis-extras:classes
> Task :solr:modules:analysis-extras:jar

> Task :solr:core:test
WARNING: Using incubator modules: jdk.incubator.vector
WARNING: Using incubator modules: jdk.incubator.vector
WARNING: Using incubator modules: jdk.incubator.vector
WARNING: Using incubator modules: jdk.incubator.vector
WARNING: A command line option has enabled the Security Manager
WARNING: The Security Manager is deprecated and will be removed in a future release
WARNING: A command line option has enabled the Security Manager
WARNING: The Security Manager is deprecated and will be removed in a future release
WARNING: A command line option has enabled the Security Manager
WARNING: The Security Manager is deprecated and will be removed in a future release
WARNING: A command line option has enabled the Security Manager
WARNING: The Security Manager is deprecated and will be removed in a future release
java.security.policy: error adding Permission, java.net.URLPermission:
	java.util.ServiceConfigurationError: Locale provider adapter "CLDR"cannot be instantiated.
java.security.policy: error adding Permission, java.net.URLPermission:
	java.util.ServiceConfigurationError: Locale provider adapter "CLDR"cannot be instantiated.
java.security.policy: error adding Permission, java.net.URLPermission:
	java.util.ServiceConfigurationError: Locale provider adapter "CLDR"cannot be instantiated.
java.security.policy: error adding Permission, java.net.URLPermission:
java.security.policy: error adding Permission, java.net.URLPermission:
	java.util.ServiceConfigurationError: Locale provider adapter "CLDR"cannot be instantiated.
	java.util.ServiceConfigurationError: Locale provider adapter "CLDR"cannot be instantiated.
java.security.policy: error adding Permission, java.net.URLPermission:
	java.util.ServiceConfigurationError: Locale provider adapter "CLDR"cannot be instantiated.
java.security.policy: error adding Permission, java.net.URLPermission:
	java.util.ServiceConfigurationError: Locale provider adapter "CLDR"cannot be instantiated.
java.security.policy: error adding Permission, java.net.URLPermission:
	java.util.ServiceConfigurationError: Locale provider adapter "CLDR"cannot be instantiated.
java.security.policy: error adding Permission, java.net.URLPermission:
	java.util.ServiceConfigurationError: Locale provider adapter "CLDR"cannot be instantiated.
java.security.policy: error adding Permission, java.net.URLPermission:
	java.util.ServiceConfigurationError: Locale provider adapter "CLDR"cannot be instantiated.
java.security.policy: error adding Permission, java.net.URLPermission:
	java.util.ServiceConfigurationError: Locale provider adapter "CLDR"cannot be instantiated.
java.security.policy: error adding Permission, java.net.URLPermission:
	java.util.ServiceConfigurationError: Locale provider adapter "CLDR"cannot be instantiated.
WARNING: Test org.apache.solr.TestRandomDVFaceting wrote 12,974,448 bytes of output.
WARNING: Test org.apache.solr.TestRandomFaceting wrote 24,312,998 bytes of output.
WARNING: Test org.apache.solr.cloud.TestStressCloudBlindAtomicUpdates wrote 13,253,137 bytes of output.
WARNING: Test org.apache.solr.cloud.TestRandomFlRTGCloud wrote 36,189,018 bytes of output.
WARNING: Test org.apache.solr.cloud.TestStressInPlaceUpdates wrote 17,884,819 bytes of output.

[673.585s][warning][jfr,system] Could not initialize JDK events. access denied ("java.lang.RuntimePermission" "accessClassInPackage.jdk.internal.event")
[678.503s][warning][jfr,system] Could not initialize JDK events. access denied ("java.lang.RuntimePermission" "accessClassInPackage.jdk.internal.event")

> Task :solr:core:test

LoggingHandlerTest > testLogLevelHandlerOutput FAILED
    java.lang.AssertionError: Logger Missing: org.apache.solr.bogus_logger_package.BogusClass_A
        at __randomizedtesting.SeedInfo.seed([C9C25E93EF68F31E:52991B1BB2D94DE7]:0)
        at org.junit.Assert.fail(Assert.java:89)
        at org.junit.Assert.assertTrue(Assert.java:42)
        at org.apache.solr.handler.admin.LoggingHandlerTest.assertLoggerLevel(LoggingHandlerTest.java:200)
        at org.apache.solr.handler.admin.LoggingHandlerTest.testLogLevelHandlerOutput(LoggingHandlerTest.java:129)
        at java.base/jdk.internal.reflect.DirectMethodHandleAccessor.invoke(DirectMethodHandleAccessor.java:103)
        at java.base/java.lang.reflect.Method.invoke(Method.java:580)
        at com.carrotsearch.randomizedtesting.RandomizedRunner.invoke(RandomizedRunner.java:1763)
        at com.carrotsearch.randomizedtesting.RandomizedRunner$8.evaluate(RandomizedRunner.java:946)
        at com.carrotsearch.randomizedtesting.RandomizedRunner$9.evaluate(RandomizedRunner.java:982)
        at com.carrotsearch.randomizedtesting.RandomizedRunner$10.evaluate(RandomizedRunner.java:996)
        at com.carrotsearch.randomizedtesting.rules.SystemPropertiesRestoreRule$1.evaluate(SystemPropertiesRestoreRule.java:80)
        at org.junit.rules.RunRules.evaluate(RunRules.java:20)
        at org.apache.lucene.tests.util.TestRuleSetupTeardownChained$1.evaluate(TestRuleSetupTeardownChained.java:48)
        at org.apache.lucene.tests.util.AbstractBeforeAfterRule$1.evaluate(AbstractBeforeAfterRule.java:43)
        at org.apache.lucene.tests.util.TestRuleThreadAndTestName$1.evaluate(TestRuleThreadAndTestName.java:45)
        at org.apache.lucene.tests.util.TestRuleIgnoreAfterMaxFailures$1.evaluate(TestRuleIgnoreAfterMaxFailures.java:60)
        at org.apache.lucene.tests.util.TestRuleMarkFailure$1.evaluate(TestRuleMarkFailure.java:44)
        at org.junit.rules.RunRules.evaluate(RunRules.java:20)
        at com.carrotsearch.randomizedtesting.rules.StatementAdapter.evaluate(StatementAdapter.java:36)
        at com.carrotsearch.randomizedtesting.ThreadLeakControl$StatementRunner.run(ThreadLeakControl.java:390)
        at com.carrotsearch.randomizedtesting.ThreadLeakControl.forkTimeoutingTask(ThreadLeakControl.java:843)
        at com.carrotsearch.randomizedtesting.ThreadLeakControl$3.evaluate(ThreadLeakControl.java:490)
        at com.carrotsearch.randomizedtesting.RandomizedRunner.runSingleTest(RandomizedRunner.java:955)
        at com.carrotsearch.randomizedtesting.RandomizedRunner$5.evaluate(RandomizedRunner.java:840)
        at com.carrotsearch.randomizedtesting.RandomizedRunner$6.evaluate(RandomizedRunner.java:891)
        at com.carrotsearch.randomizedtesting.RandomizedRunner$7.evaluate(RandomizedRunner.java:902)
        at com.carrotsearch.randomizedtesting.rules.StatementAdapter.evaluate(StatementAdapter.java:36)
        at org.apache.solr.util.LogLevelTestRule$LogLevelStatement.evaluate(LogLevelTestRule.java:63)
        at com.carrotsearch.randomizedtesting.rules.StatementAdapter.evaluate(StatementAdapter.java:36)
        at org.apache.lucene.tests.util.AbstractBeforeAfterRule$1.evaluate(AbstractBeforeAfterRule.java:43)
        at com.carrotsearch.randomizedtesting.rules.SystemPropertiesRestoreRule$1.evaluate(SystemPropertiesRestoreRule.java:80)
        at org.junit.rules.RunRules.evaluate(RunRules.java:20)
        at org.apache.lucene.tests.util.AbstractBeforeAfterRule$1.evaluate(AbstractBeforeAfterRule.java:43)
        at com.carrotsearch.randomizedtesting.rules.StatementAdapter.evaluate(StatementAdapter.java:36)
        at org.apache.lucene.tests.util.TestRuleStoreClassName$1.evaluate(TestRuleStoreClassName.java:38)
        at com.carrotsearch.randomizedtesting.rules.NoShadowingOrOverridesOnMethodsRule$1.evaluate(NoShadowingOrOverridesOnMethodsRule.java:40)
        at com.carrotsearch.randomizedtesting.rules.NoShadowingOrOverridesOnMethodsRule$1.evaluate(NoShadowingOrOverridesOnMethodsRule.java:40)
        at com.carrotsearch.randomizedtesting.rules.StatementAdapter.evaluate(StatementAdapter.java:36)
        at com.carrotsearch.randomizedtesting.rules.StatementAdapter.evaluate(StatementAdapter.java:36)
        at org.apache.lucene.tests.util.TestRuleAssertionsRequired$1.evaluate(TestRuleAssertionsRequired.java:53)
        at org.apache.lucene.tests.util.AbstractBeforeAfterRule$1.evaluate(AbstractBeforeAfterRule.java:43)
        at org.apache.lucene.tests.util.TestRuleMarkFailure$1.evaluate(TestRuleMarkFailure.java:44)
        at org.apache.lucene.tests.util.TestRuleIgnoreAfterMaxFailures$1.evaluate(TestRuleIgnoreAfterMaxFailures.java:60)
        at org.apache.lucene.tests.util.TestRuleIgnoreTestSuites$1.evaluate(TestRuleIgnoreTestSuites.java:47)
        at org.junit.rules.RunRules.evaluate(RunRules.java:20)
        at com.carrotsearch.randomizedtesting.rules.StatementAdapter.evaluate(StatementAdapter.java:36)
        at com.carrotsearch.randomizedtesting.ThreadLeakControl$StatementRunner.run(ThreadLeakControl.java:390)
        at com.carrotsearch.randomizedtesting.ThreadLeakControl.lambda$forkTimeoutingTask$0(ThreadLeakControl.java:850)
        at java.base/java.lang.Thread.run(Thread.java:1583)

org.apache.solr.handler.admin.LoggingHandlerTest > test suite's output saved to /home/jenkins/jenkins-agent/workspace/Solr/Solr-Test-10.0/solr/core/build/test-results/test/outputs/OUTPUT-org.apache.solr.handler.admin.LoggingHandlerTest.txt, copied below:
  2> 793853 INFO  (SUITE-LoggingHandlerTest-seed#[C9C25E93EF68F31E]-worker) [] o.a.s.SolrTestCase Setting 'solr.configset.default.confdir' system property to test-framework derived value of '/home/jenkins/jenkins-agent/workspace/Solr/Solr-Test-10.0/solr/server/solr/configsets/_default/conf'
  2> 793854 INFO  (SUITE-LoggingHandlerTest-seed#[C9C25E93EF68F31E]-worker) [] o.a.s.u.ErrorLogMuter Closing ErrorLogMuter-regex-14790 after mutting 0 log messages
  2> 793854 INFO  (SUITE-LoggingHandlerTest-seed#[C9C25E93EF68F31E]-worker) [] o.a.s.u.ErrorLogMuter Creating ErrorLogMuter-regex-14791 for ERROR logs matching regex: ignore_exception
  2> 793855 INFO  (SUITE-LoggingHandlerTest-seed#[C9C25E93EF68F31E]-worker) [] o.a.s.SolrTestCaseJ4 Created dataDir: /home/jenkins/jenkins-agent/workspace/Solr/Solr-Test-10.0/build/tmp/tests-tmp/org.apache.solr.handler.admin.LoggingHandlerTest_C9C25E93EF68F31E-001/data-dir-82-001
  2> 793855 WARN  (SUITE-LoggingHandlerTest-seed#[C9C25E93EF68F31E]-worker) [] o.a.s.SolrTestCaseJ4 startTrackingSearchers: numOpens=3 numCloses=3
  2> 793855 INFO  (SUITE-LoggingHandlerTest-seed#[C9C25E93EF68F31E]-worker) [] o.a.s.SolrTestCaseJ4 Using PointFields (NUMERIC_POINTS_SYSPROP=true) w/NUMERIC_DOCVALUES_SYSPROP=true
  2> 793856 INFO  (SUITE-LoggingHandlerTest-seed#[C9C25E93EF68F31E]-worker) [] o.a.s.SolrTestCaseJ4 Randomized ssl (true) and clientAuth (true) via: @org.apache.solr.util.RandomizeSSL(reason="", value=0.0/0.0, ssl=0.0/0.0, clientAuth=0.0/0.0)
  2> 793856 INFO  (SUITE-LoggingHandlerTest-seed#[C9C25E93EF68F31E]-worker) [] o.a.s.SolrTestCaseJ4 SecureRandom sanity checks: test.solr.allowed.securerandom=null & java.security.egd=file:/dev/./urandom
  2> 793856 INFO  (SUITE-LoggingHandlerTest-seed#[C9C25E93EF68F31E]-worker) [] o.a.s.SolrTestCaseJ4 ####initCore
  2> 793860 INFO  (SUITE-LoggingHandlerTest-seed#[C9C25E93EF68F31E]-worker) [] o.a.s.c.SolrResourceLoader Added 2 libs to classloader, from paths: [/home/jenkins/jenkins-agent/workspace/Solr/Solr-Test-10.0/solr/core/build/resources/test/solr/collection1/lib, /home/jenkins/jenkins-agent/workspace/Solr/Solr-Test-10.0/solr/core/build/resources/test/solr/collection1/lib/classes]
  2> 793874 INFO  (SUITE-LoggingHandlerTest-seed#[C9C25E93EF68F31E]-worker) [] o.a.s.c.SolrConfig Using Lucene MatchVersion: 10.3.2
  2> 793874 WARN  (SUITE-LoggingHandlerTest-seed#[C9C25E93EF68F31E]-worker) [] o.a.s.c.SolrConfig solrconfig.xml: <boolTofilterOptimizer> is currently not implemented and has no effect.
  2> 793878 INFO  (SUITE-LoggingHandlerTest-seed#[C9C25E93EF68F31E]-worker) [] o.a.s.s.IndexSchema Schema name=test
  2> 793890 INFO  (SUITE-LoggingHandlerTest-seed#[C9C25E93EF68F31E]-worker) [] o.a.s.s.IndexSchema Loaded schema test/1.0 with uniqueid field id
  2> 794496 INFO  (SUITE-LoggingHandlerTest-seed#[C9C25E93EF68F31E]-worker) [] o.a.s.c.OpenTelemetryConfigurator OpenTelemetry tracer enabled with simple propagation only.
  2> 794498 WARN  (SUITE-LoggingHandlerTest-seed#[C9C25E93EF68F31E]-worker) [] o.e.j.u.s.S.config Trusting all certificates configured for Client@43421e37[provider=null,keyStore=null,trustStore=null]
  2> 794498 WARN  (SUITE-LoggingHandlerTest-seed#[C9C25E93EF68F31E]-worker) [] o.e.j.u.s.S.config No Client EndPointIdentificationAlgorithm configured for Client@43421e37[provider=null,keyStore=null,trustStore=null]
  2> 794500 WARN  (SUITE-LoggingHandlerTest-seed#[C9C25E93EF68F31E]-worker) [] o.e.j.u.s.S.config Trusting all certificates configured for Client@2675585d[provider=null,keyStore=null,trustStore=null]
  2> 794500 WARN  (SUITE-LoggingHandlerTest-seed#[C9C25E93EF68F31E]-worker) [] o.e.j.u.s.S.config No Client EndPointIdentificationAlgorithm configured for Client@2675585d[provider=null,keyStore=null,trustStore=null]
  2> 794501 WARN  (SUITE-LoggingHandlerTest-seed#[C9C25E93EF68F31E]-worker) [] o.e.j.u.s.S.config Trusting all certificates configured for Client@3b2059bc[provider=null,keyStore=null,trustStore=null]
  2> 794501 WARN  (SUITE-LoggingHandlerTest-seed#[C9C25E93EF68F31E]-worker) [] o.e.j.u.s.S.config No Client EndPointIdentificationAlgorithm configured for Client@3b2059bc[provider=null,keyStore=null,trustStore=null]
  2> 794503 WARN  (SUITE-LoggingHandlerTest-seed#[C9C25E93EF68F31E]-worker) [] o.e.j.u.s.S.config Trusting all certificates configured for Client@1bb31265[provider=null,keyStore=null,trustStore=null]
  2> 794503 WARN  (SUITE-LoggingHandlerTest-seed#[C9C25E93EF68F31E]-worker) [] o.e.j.u.s.S.config No Client EndPointIdentificationAlgorithm configured for Client@1bb31265[provider=null,keyStore=null,trustStore=null]
  2> 794504 WARN  (SUITE-LoggingHandlerTest-seed#[C9C25E93EF68F31E]-worker) [] o.a.s.c.CoreContainer Not all security plugins configured!  authentication=disabled authorization=disabled.  Solr is only as secure as you make it. Consider configuring authentication/authorization before exposing Solr to users internal or external.  See https://s.apache.org/solrsecurity for more info
  2> 794511 INFO  (coreLoadExecutor-10700-thread-1) [ x:collection1] o.a.s.c.SolrResourceLoader Added 2 libs to classloader, from paths: [/home/jenkins/jenkins-agent/workspace/Solr/Solr-Test-10.0/solr/core/build/resources/test/solr/collection1/lib, /home/jenkins/jenkins-agent/workspace/Solr/Solr-Test-10.0/solr/core/build/resources/test/solr/collection1/lib/classes]
  2> 794525 INFO  (coreLoadExecutor-10700-thread-1) [ x:collection1] o.a.s.c.SolrConfig Using Lucene MatchVersion: 10.3.2
  2> 794526 WARN  (coreLoadExecutor-10700-thread-1) [ x:collection1] o.a.s.c.SolrConfig solrconfig.xml: <boolTofilterOptimizer> is currently not implemented and has no effect.
  2> 794530 INFO  (coreLoadExecutor-10700-thread-1) [ x:collection1] o.a.s.s.IndexSchema Schema name=test
  2> 794542 INFO  (coreLoadExecutor-10700-thread-1) [ x:collection1] o.a.s.s.IndexSchema Loaded schema test/1.0 with uniqueid field id
  2> 794548 INFO  (coreLoadExecutor-10700-thread-1) [ x:collection1] o.a.s.c.CoreContainer Creating SolrCore 'collection1' using configuration from instancedir /home/jenkins/jenkins-agent/workspace/Solr/Solr-Test-10.0/solr/core/build/resources/test/solr/collection1
  2> 794549 INFO  (coreLoadExecutor-10700-thread-1) [ x:collection1] o.a.s.c.SolrCore Opening new SolrCore at [/home/jenkins/jenkins-agent/workspace/Solr/Solr-Test-10.0/solr/core/build/resources/test/solr/collection1], dataDir=[/home/jenkins/jenkins-agent/workspace/Solr/Solr-Test-10.0/build/tmp/tests-tmp/org.apache.solr.handler.admin.LoggingHandlerTest_C9C25E93EF68F31E-001/data-dir-82-001/]
  2> 794549 INFO  (coreLoadExecutor-10700-thread-1) [ x:collection1] o.a.s.u.RandomMergePolicy RandomMergePolicy wrapping class org.apache.lucene.index.TieredMergePolicy: [TieredMergePolicy: maxMergeAtOnce=50, maxMergedSegmentMB=16.771934509277344, floorSegmentMB=0.3621330261230469, forceMergeDeletesPctAllowed=5.984481846803618, segmentsPerTier=32.0, maxCFSSegmentSizeMB=8.796093022208E12, noCFSRatio=1.0, deletesPctAllowed=37.23383088976993, targetSearchConcurrency=15
  2> 794575 INFO  (coreLoadExecutor-10700-thread-1) [ x:collection1] o.a.s.j.SolrRequestAuthorizer Creating a new SolrRequestAuthorizer
  2> 794580 INFO  (coreLoadExecutor-10700-thread-1) [ x:collection1] o.a.s.u.UpdateHandler Using UpdateLog implementation: org.apache.solr.update.UpdateLog
  2> 794580 INFO  (coreLoadExecutor-10700-thread-1) [ x:collection1] o.a.s.u.UpdateLog Initializing UpdateLog: dataDir= defaultSyncLevel=FLUSH numRecordsToKeep=100 maxNumLogsToKeep=10
  2> 794580 INFO  (coreLoadExecutor-10700-thread-1) [ x:collection1] o.a.s.u.CommitTracker Hard AutoCommit: disabled
  2> 794580 INFO  (coreLoadExecutor-10700-thread-1) [ x:collection1] o.a.s.u.CommitTracker Soft AutoCommit: disabled
  2> 794581 INFO  (coreLoadExecutor-10700-thread-1) [ x:collection1] o.a.s.u.RandomMergePolicy RandomMergePolicy wrapping class org.apache.lucene.index.LogByteSizeMergePolicy: [LogByteSizeMergePolicy: minMergeSize=16777216, mergeFactor=23, maxMergeSize=2147483648, maxMergeSizeForForcedMerge=9223372036854775807, calibrateSizeByDeletes=true, maxMergeDocs=2147483647, maxCFSSegmentSizeMB=8.796093022208E12, noCFSRatio=0.501365930509412]
  2> 794589 INFO  (coreLoadExecutor-10700-thread-1) [ x:collection1] o.a.s.s.DirectSolrSpellChecker init: {minQueryLength=3, name=direct, classname=DirectSolrSpellChecker, field=lowerfilt}
  2> 794589 INFO  (coreLoadExecutor-10700-thread-1) [ x:collection1] o.a.s.s.DirectSolrSpellChecker init: {minQueryLength=3, maxQueryFrequency=2, name=directMQF2, classname=DirectSolrSpellChecker, field=lowerfilt}
  2> 794614 INFO  (coreLoadExecutor-10700-thread-1) [ x:collection1] o.a.s.h.ReplicationHandler Commits will be reserved for 10000 ms
  2> 794614 INFO  (searcherExecutor-10702-thread-1-processing-collection1) [ x:collection1] o.a.s.h.c.SpellCheckComponent Loading spell index for spellchecker: default
  2> 794614 INFO  (searcherExecutor-10702-thread-1-processing-collection1) [ x:collection1] o.a.s.h.c.SpellCheckComponent Loading spell index for spellchecker: direct
  2> 794614 INFO  (searcherExecutor-10702-thread-1-processing-collection1) [ x:collection1] o.a.s.h.c.SpellCheckComponent Loading spell index for spellchecker: directMQF2
  2> 794614 INFO  (searcherExecutor-10702-thread-1-processing-collection1) [ x:collection1] o.a.s.h.c.SpellCheckComponent Loading spell index for spellchecker: wordbreak
  2> 794614 INFO  (searcherExecutor-10702-thread-1-processing-collection1) [ x:collection1] o.a.s.h.c.SpellCheckComponent Loading spell index for spellchecker: multipleFields
  2> 794615 INFO  (searcherExecutor-10702-thread-1-processing-collection1) [ x:collection1] o.a.s.h.c.SpellCheckComponent Loading spell index for spellchecker: jarowinkler
  2> 794615 INFO  (searcherExecutor-10702-thread-1-processing-collection1) [ x:collection1] o.a.s.h.c.SpellCheckComponent Loading spell index for spellchecker: external
  2> 794615 INFO  (searcherExecutor-10702-thread-1-processing-collection1) [ x:collection1] o.a.s.h.c.SpellCheckComponent Loading spell index for spellchecker: freq
  2> 794616 INFO  (searcherExecutor-10702-thread-1-processing-collection1) [ x:collection1] o.a.s.h.c.SpellCheckComponent Loading spell index for spellchecker: fqcn
  2> 794616 INFO  (searcherExecutor-10702-thread-1-processing-collection1) [ x:collection1] o.a.s.h.c.SpellCheckComponent Loading spell index for spellchecker: perDict
  2> 794616 INFO  (searcherExecutor-10702-thread-1-processing-collection1) [ x:collection1] o.a.s.c.SolrCore Registered new searcher autowarm time: 0 ms
  2> 794643 INFO  (SUITE-LoggingHandlerTest-seed#[C9C25E93EF68F31E]-worker) [] o.a.s.j.SolrRequestAuthorizer Creating a new SolrRequestAuthorizer
  2> 794654 INFO  (SUITE-LoggingHandlerTest-seed#[C9C25E93EF68F31E]-worker) [] o.a.s.SolrTestCaseJ4 ####initCore end
  2> 794658 INFO  (TEST-LoggingHandlerTest.testLogLevelHandlerOutput-seed#[C9C25E93EF68F31E]) [] o.a.s.SolrTestCaseJ4 ###Starting testLogLevelHandlerOutput
  2> 794694 INFO  (TEST-LoggingHandlerTest.testLogLevelHandlerOutput-seed#[C9C25E93EF68F31E]) [] o.a.s.l.l.Log4j2Watcher Setting log level to 'TRACE' for logger: org.apache.solr.bogus_logger_package.BogusClass_B
  2> 794711 INFO  (TEST-LoggingHandlerTest.testLogLevelHandlerOutput-seed#[C9C25E93EF68F31E]) [] o.a.s.SolrTestCaseJ4 ###Ending testLogLevelHandlerOutput
   >     java.lang.AssertionError: Logger Missing: org.apache.solr.bogus_logger_package.BogusClass_A
   >         at __randomizedtesting.SeedInfo.seed([C9C25E93EF68F31E:52991B1BB2D94DE7]:0)
   >         at org.junit.Assert.fail(Assert.java:89)
   >         at org.junit.Assert.assertTrue(Assert.java:42)
   >         at org.apache.solr.handler.admin.LoggingHandlerTest.assertLoggerLevel(LoggingHandlerTest.java:200)
   >         at org.apache.solr.handler.admin.LoggingHandlerTest.testLogLevelHandlerOutput(LoggingHandlerTest.java:129)
   >         at java.base/jdk.internal.reflect.DirectMethodHandleAccessor.invoke(DirectMethodHandleAccessor.java:103)
   >         at java.base/java.lang.reflect.Method.invoke(Method.java:580)
   >         at com.carrotsearch.randomizedtesting.RandomizedRunner.invoke(RandomizedRunner.java:1763)
   >         at com.carrotsearch.randomizedtesting.RandomizedRunner$8.evaluate(RandomizedRunner.java:946)
   >         at com.carrotsearch.randomizedtesting.RandomizedRunner$9.evaluate(RandomizedRunner.java:982)
   >         at com.carrotsearch.randomizedtesting.RandomizedRunner$10.evaluate(RandomizedRunner.java:996)
   >         at com.carrotsearch.randomizedtesting.rules.SystemPropertiesRestoreRule$1.evaluate(SystemPropertiesRestoreRule.java:80)
   >         at org.junit.rules.RunRules.evaluate(RunRules.java:20)
   >         at org.apache.lucene.tests.util.TestRuleSetupTeardownChained$1.evaluate(TestRuleSetupTeardownChained.java:48)
   >         at org.apache.lucene.tests.util.AbstractBeforeAfterRule$1.evaluate(AbstractBeforeAfterRule.java:43)
   >         at org.apache.lucene.tests.util.TestRuleThreadAndTestName$1.evaluate(TestRuleThreadAndTestName.java:45)
   >         at org.apache.lucene.tests.util.TestRuleIgnoreAfterMaxFailures$1.evaluate(TestRuleIgnoreAfterMaxFailures.java:60)
   >         at org.apache.lucene.tests.util.TestRuleMarkFailure$1.evaluate(TestRuleMarkFailure.java:44)
   >         at org.junit.rules.RunRules.evaluate(RunRules.java:20)
   >         at com.carrotsearch.randomizedtesting.rules.StatementAdapter.evaluate(StatementAdapter.java:36)
   >         at com.carrotsearch.randomizedtesting.ThreadLeakControl$StatementRunner.run(ThreadLeakControl.java:390)
   >         at com.carrotsearch.randomizedtesting.ThreadLeakControl.forkTimeoutingTask(ThreadLeakControl.java:843)
   >         at com.carrotsearch.randomizedtesting.ThreadLeakControl$3.evaluate(ThreadLeakControl.java:490)
   >         at com.carrotsearch.randomizedtesting.RandomizedRunner.runSingleTest(RandomizedRunner.java:955)
   >         at com.carrotsearch.randomizedtesting.RandomizedRunner$5.evaluate(RandomizedRunner.java:840)
   >         at com.carrotsearch.randomizedtesting.RandomizedRunner$6.evaluate(RandomizedRunner.java:891)
   >         at com.carrotsearch.randomizedtesting.RandomizedRunner$7.evaluate(RandomizedRunner.java:902)
   >         at com.carrotsearch.randomizedtesting.rules.StatementAdapter.evaluate(StatementAdapter.java:36)
   >         at org.apache.solr.util.LogLevelTestRule$LogLevelStatement.evaluate(LogLevelTestRule.java:63)
   >         at com.carrotsearch.randomizedtesting.rules.StatementAdapter.evaluate(StatementAdapter.java:36)
   >         at org.apache.lucene.tests.util.AbstractBeforeAfterRule$1.evaluate(AbstractBeforeAfterRule.java:43)
   >         at com.carrotsearch.randomizedtesting.rules.SystemPropertiesRestoreRule$1.evaluate(SystemPropertiesRestoreRule.java:80)
   >         at org.junit.rules.RunRules.evaluate(RunRules.java:20)
   >         at org.apache.lucene.tests.util.AbstractBeforeAfterRule$1.evaluate(AbstractBeforeAfterRule.java:43)
   >         at com.carrotsearch.randomizedtesting.rules.StatementAdapter.evaluate(StatementAdapter.java:36)
   >         at org.apache.lucene.tests.util.TestRuleStoreClassName$1.evaluate(TestRuleStoreClassName.java:38)
   >         at com.carrotsearch.randomizedtesting.rules.NoShadowingOrOverridesOnMethodsRule$1.evaluate(NoShadowingOrOverridesOnMethodsRule.java:40)
   >         at com.carrotsearch.randomizedtesting.rules.NoShadowingOrOverridesOnMethodsRule$1.evaluate(NoShadowingOrOverridesOnMethodsRule.java:40)
   >         at com.carrotsearch.randomizedtesting.rules.StatementAdapter.evaluate(StatementAdapter.java:36)
   >         at com.carrotsearch.randomizedtesting.rules.StatementAdapter.evaluate(StatementAdapter.java:36)
   >         at org.apache.lucene.tests.util.TestRuleAssertionsRequired$1.evaluate(TestRuleAssertionsRequired.java:53)
   >         at org.apache.lucene.tests.util.AbstractBeforeAfterRule$1.evaluate(AbstractBeforeAfterRule.java:43)
   >         at org.apache.lucene.tests.util.TestRuleMarkFailure$1.evaluate(TestRuleMarkFailure.java:44)
   >         at org.apache.lucene.tests.util.TestRuleIgnoreAfterMaxFailures$1.evaluate(TestRuleIgnoreAfterMaxFailures.java:60)
   >         at org.apache.lucene.tests.util.TestRuleIgnoreTestSuites$1.evaluate(TestRuleIgnoreTestSuites.java:47)
   >         at org.junit.rules.RunRules.evaluate(RunRules.java:20)
   >         at com.carrotsearch.randomizedtesting.rules.StatementAdapter.evaluate(StatementAdapter.java:36)
   >         at com.carrotsearch.randomizedtesting.ThreadLeakControl$StatementRunner.run(ThreadLeakControl.java:390)
   >         at com.carrotsearch.randomizedtesting.ThreadLeakControl.lambda$forkTimeoutingTask$0(ThreadLeakControl.java:850)
   >         at java.base/java.lang.Thread.run(Thread.java:1583)
  2> NOTE: reproduce with: gradlew test --tests LoggingHandlerTest.testLogLevelHandlerOutput -Dtests.seed=C9C25E93EF68F31E -Dtests.multiplier=2 -Dtests.locale=dav -Dtests.timezone=America/St_Kitts -Dtests.asserts=true -Dtests.file.encoding=UTF-8
  2> 794714 INFO  (SUITE-LoggingHandlerTest-seed#[C9C25E93EF68F31E]-worker) [] o.a.s.SolrTestCaseJ4 ###deleteCore
  2> 794714 INFO  (SUITE-LoggingHandlerTest-seed#[C9C25E93EF68F31E]-worker) [] o.a.s.c.CoreContainer Shutting down CoreContainer instance=303042870
  2> Wun 03, 2026 1:48:50 LUMA LWA K io.opentelemetry.sdk.internal.ThrottlingLogger doLog
  2> WARNING: CallbackRegistration{instrumentDescriptors=[InstrumentDescriptor{name=solr_node_executor_thread_pool_size, description=Thread pool size, unit=, type=OBSERVABLE_GAUGE, valueType=LONG, advice=Advice{explicitBucketBoundaries=null, attributes=null}}]} has called close() multiple times.
  2> Wun 03, 2026 1:48:50 LUMA LWA K io.opentelemetry.sdk.internal.ThrottlingLogger doLog
  2> WARNING: CallbackRegistration{instrumentDescriptors=[InstrumentDescriptor{name=solr_node_executor_thread_pool_tasks, description=Thread pool task counts, unit=, type=OBSERVABLE_GAUGE, valueType=LONG, advice=Advice{explicitBucketBoundaries=null, attributes=null}}]} has called close() multiple times.
  2> 794714 INFO  (coreCloseExecutor-10708-thread-1) [ x:collection1] o.a.s.c.SolrCore CLOSING SolrCore org.apache.solr.core.SolrCore@20ceb66f collection1
  2> Wun 03, 2026 1:48:50 LUMA LWA K io.opentelemetry.sdk.internal.ThrottlingLogger doLog
  2> WARNING: CallbackRegistration{instrumentDescriptors=[InstrumentDescriptor{name=solr_core_replication_is_leader, description=Whether this node is a leader (1) or not (0), unit=, type=OBSERVABLE_GAUGE, valueType=LONG, advice=Advice{explicitBucketBoundaries=null, attributes=null}}, InstrumentDescriptor{name=solr_core_replication_download_speed, description=Download speed in bytes per second, unit=, type=OBSERVABLE_GAUGE, valueType=LONG, advice=Advice{explicitBucketBoundaries=null, attributes=null}}, InstrumentDescriptor{name=solr_core_replication_index_version, description=Current index version, unit=, type=OBSERVABLE_GAUGE, valueType=LONG, advice=Advice{explicitBucketBoundaries=null, attributes=null}}, InstrumentDescriptor{name=solr_core_replication_index_size, description=Size of the index in megabytes, unit=MBy, type=OBSERVABLE_GAUGE, valueType=DOUBLE, advice=Advice{explicitBucketBoundaries=null, attributes=null}}, InstrumentDescriptor{name=solr_core_replication_is_polling_disabled, description=Whether polling is disabled (1) or not (0), unit=, type=OBSERVABLE_GAUGE, valueType=LONG, advice=Advice{explicitBucketBoundaries=null, attributes=null}}, InstrumentDescriptor{name=solr_core_replication_is_enabled, description=Whether replication is enabled (1) or not (0), unit=, type=OBSERVABLE_GAUGE, valueType=LONG, advice=Advice{explicitBucketBoundaries=null, attributes=null}}, InstrumentDescriptor{name=solr_core_replication_is_follower, description=Whether this node is a follower (1) or not (0), unit=, type=OBSERVABLE_GAUGE, valueType=LONG, advice=Advice{explicitBucketBoundaries=null, attributes=null}}, InstrumentDescriptor{name=solr_core_replication_time_elapsed, description=Time elapsed during replication in seconds, unit=s, type=OBSERVABLE_GAUGE, valueType=LONG, advice=Advice{explicitBucketBoundaries=null, attributes=null}}, InstrumentDescriptor{name=solr_core_replication_index_generation, description=Current index generation, unit=, type=OBSERVABLE_GAUGE, valueType=LONG, advice=Advice{explicitBucketBoundaries=null, attributes=null}}, InstrumentDescriptor{name=solr_core_replication_downloaded_size, description=Total bytes downloaded during replication, unit=By, type=OBSERVABLE_GAUGE, valueType=LONG, advice=Advice{explicitBucketBoundaries=null, attributes=null}}, InstrumentDescriptor{name=solr_core_replication_is_replicating, description=Whether replication is in progress (1) or not (0), unit=, type=OBSERVABLE_GAUGE, valueType=LONG, advice=Advice{explicitBucketBoundaries=null, attributes=null}}]} has called close() multiple times.
  2> Wun 03, 2026 1:48:50 LUMA LWA K io.opentelemetry.sdk.internal.ThrottlingLogger doLog
  2> WARNING: CallbackRegistration{instrumentDescriptors=[InstrumentDescriptor{name=solr_core_update_auto_commits, description=Current number of auto commits, unit=, type=OBSERVABLE_COUNTER, valueType=LONG, advice=Advice{explicitBucketBoundaries=null, attributes=null}}]} has called close() multiple times.
  2> Wun 03, 2026 1:48:50 LUMA LWA K io.opentelemetry.sdk.internal.ThrottlingLogger doLog
  2> WARNING: CallbackRegistration{instrumentDescriptors=[InstrumentDescriptor{name=solr_core_update_commit_stats, description=Metrics around commits, unit=, type=OBSERVABLE_GAUGE, valueType=LONG, advice=Advice{explicitBucketBoundaries=null, attributes=null}}]} has called close() multiple times.
  2> Wun 03, 2026 1:48:50 LUMA LWA K io.opentelemetry.sdk.internal.ThrottlingLogger doLog
  2> WARNING: CallbackRegistration{instrumentDescriptors=[InstrumentDescriptor{name=solr_core_update_docs_pending_commit, description=Current number of documents pending commit. Value is reset to 0 on commit., unit=, type=OBSERVABLE_GAUGE, valueType=LONG, advice=Advice{explicitBucketBoundaries=null, attributes=null}}]} has called close() multiple times.
  2> 794715 INFO  (coreCloseExecutor-10708-thread-1) [ x:collection1] o.a.s.u.DirectUpdateHandler2 Committing on IndexWriter.close()  ... SKIPPED (unnecessary).
  2> Wun 03, 2026 1:48:50 LUMA LWA K io.opentelemetry.sdk.internal.ThrottlingLogger doLog
  2> WARNING: CallbackRegistration{instrumentDescriptors=[InstrumentDescriptor{name=solr_core_indexsearcher_cache_size, description=Current number cache entries, unit=, type=OBSERVABLE_GAUGE, valueType=LONG, advice=Advice{explicitBucketBoundaries=null, attributes=null}}, InstrumentDescriptor{name=solr_core_indexsearcher_cache_ops, description=Number of cumulative cache operations (inserts and evictions), unit=, type=OBSERVABLE_COUNTER, valueType=LONG, advice=Advice{explicitBucketBoundaries=null, attributes=null}}, InstrumentDescriptor{name=solr_core_indexsearcher_cache_warmup_time, description=Cache warmup time (most recent), unit=ms, type=OBSERVABLE_GAUGE, valueType=LONG, advice=Advice{explicitBucketBoundaries=null, attributes=null}}, InstrumentDescriptor{name=solr_core_indexsearcher_cache_lookups, description=Number of cumulative cache lookup results (hits and misses), unit=, type=OBSERVABLE_COUNTER, valueType=LONG, advice=Advice{explicitBucketBoundaries=null, attributes=null}}, InstrumentDescriptor{name=solr_core_indexsearcher_cache_ram_used, description=RAM bytes used by cache, unit=By, type=OBSERVABLE_GAUGE, valueType=LONG, advice=Advice{explicitBucketBoundaries=null, attributes=null}}]} has called close() multiple times.
  2> Wun 03, 2026 1:48:50 LUMA LWA K io.opentelemetry.sdk.internal.ThrottlingLogger doLog
  2> WARNING: CallbackRegistration{instrumentDescriptors=[InstrumentDescriptor{name=solr_core_indexsearcher_cache_lookups, description=Number of cumulative cache lookup results (hits and misses), unit=, type=OBSERVABLE_COUNTER, valueType=LONG, advice=Advice{explicitBucketBoundaries=null, attributes=null}}, InstrumentDescriptor{name=solr_core_indexsearcher_cache_ops, description=Number of cumulative cache operations (inserts and evictions), unit=, type=OBSERVABLE_COUNTER, valueType=LONG, advice=Advice{explicitBucketBoundaries=null, attributes=null}}, InstrumentDescriptor{name=solr_core_indexsearcher_cache_ram_used, description=RAM bytes used by cache, unit=By, type=OBSERVABLE_GAUGE, valueType=LONG, advice=Advice{explicitBucketBoundaries=null, attributes=null}}, InstrumentDescriptor{name=solr_core_indexsearcher_cache_size, description=Current number cache entries, unit=, type=OBSERVABLE_GAUGE, valueType=LONG, advice=Advice{explicitBucketBoundaries=null, attributes=null}}, InstrumentDescriptor{name=solr_core_indexsearcher_cache_warmup_time, description=Cache warmup time (most recent), unit=ms, type=OBSERVABLE_GAUGE, valueType=LONG, advice=Advice{explicitBucketBoundaries=null, attributes=null}}]} has called close() multiple times.
  2> Wun 03, 2026 1:48:50 LUMA LWA K io.opentelemetry.sdk.internal.ThrottlingLogger doLog
  2> WARNING: CallbackRegistration{instrumentDescriptors=[InstrumentDescriptor{name=solr_core_indexsearcher_cache_ops, description=Number of cumulative cache operations (inserts and evictions), unit=, type=OBSERVABLE_COUNTER, valueType=LONG, advice=Advice{explicitBucketBoundaries=null, attributes=null}}, InstrumentDescriptor{name=solr_core_indexsearcher_cache_ram_used, description=RAM bytes used by cache, unit=By, type=OBSERVABLE_GAUGE, valueType=LONG, advice=Advice{explicitBucketBoundaries=null, attributes=null}}, InstrumentDescriptor{name=solr_core_indexsearcher_cache_size, description=Current number cache entries, unit=, type=OBSERVABLE_GAUGE, valueType=LONG, advice=Advice{explicitBucketBoundaries=null, attributes=null}}, InstrumentDescriptor{name=solr_core_indexsearcher_cache_lookups, description=Number of cumulative cache lookup results (hits and misses), unit=, type=OBSERVABLE_COUNTER, valueType=LONG, advice=Advice{explicitBucketBoundaries=null, attributes=null}}, InstrumentDescriptor{name=solr_core_indexsearcher_cache_warmup_time, description=Cache warmup time (most recent), unit=ms, type=OBSERVABLE_GAUGE, valueType=LONG, advice=Advice{explicitBucketBoundaries=null, attributes=null}}]} has called close() multiple times.
  2> Wun 03, 2026 1:48:50 LUMA LWA K io.opentelemetry.sdk.internal.ThrottlingLogger doLog
  2> WARNING: CallbackRegistration{instrumentDescriptors=[InstrumentDescriptor{name=solr_core_indexsearcher_cache_ram_used, description=RAM bytes used by cache, unit=By, type=OBSERVABLE_GAUGE, valueType=LONG, advice=Advice{explicitBucketBoundaries=null, attributes=null}}, InstrumentDescriptor{name=solr_core_indexsearcher_cache_lookups, description=Number of cumulative cache lookup results (hits and misses), unit=, type=OBSERVABLE_COUNTER, valueType=LONG, advice=Advice{explicitBucketBoundaries=null, attributes=null}}, InstrumentDescriptor{name=solr_core_indexsearcher_cache_warmup_time, description=Cache warmup time (most recent), unit=ms, type=OBSERVABLE_GAUGE, valueType=LONG, advice=Advice{explicitBucketBoundaries=null, attributes=null}}, InstrumentDescriptor{name=solr_core_indexsearcher_cache_size, description=Current number cache entries, unit=, type=OBSERVABLE_GAUGE, valueType=LONG, advice=Advice{explicitBucketBoundaries=null, attributes=null}}, InstrumentDescriptor{name=solr_core_indexsearcher_cache_ops, description=Number of cumulative cache operations (inserts and evictions), unit=, type=OBSERVABLE_COUNTER, valueType=LONG, advice=Advice{explicitBucketBoundaries=null, attributes=null}}]} has called close() multiple times.
  2> Wun 03, 2026 1:48:50 LUMA LWA K io.opentelemetry.sdk.internal.ThrottlingLogger doLog
  2> WARNING: CallbackRegistration{instrumentDescriptors=[InstrumentDescriptor{name=solr_core_indexsearcher_cache_lookups, description=Number of cumulative cache lookup results (hits and misses), unit=, type=OBSERVABLE_COUNTER, valueType=LONG, advice=Advice{explicitBucketBoundaries=null, attributes=null}}, InstrumentDescriptor{name=solr_core_indexsearcher_cache_ops, description=Number of cumulative cache operations (inserts and evictions), unit=, type=OBSERVABLE_COUNTER, valueType=LONG, advice=Advice{explicitBucketBoundaries=null, attributes=null}}, InstrumentDescriptor{name=solr_core_indexsearcher_cache_size, description=Current number cache entries, unit=, type=OBSERVABLE_GAUGE, valueType=LONG, advice=Advice{explicitBucketBoundaries=null, attributes=null}}, InstrumentDescriptor{name=solr_core_indexsearcher_cache_ram_used, description=RAM bytes used by cache, unit=By, type=OBSERVABLE_GAUGE, valueType=LONG, advice=Advice{explicitBucketBoundaries=null, attributes=null}}, InstrumentDescriptor{name=solr_core_indexsearcher_cache_warmup_time, description=Cache warmup time (most recent), unit=ms, type=OBSERVABLE_GAUGE, valueType=LONG, advice=Advice{explicitBucketBoundaries=null, attributes=null}}]} has called close() multiple times.
  2> Wun 03, 2026 1:48:50 LUMA LWA K io.opentelemetry.sdk.internal.ThrottlingLogger doLog
  2> WARNING: CallbackRegistration{instrumentDescriptors=[InstrumentDescriptor{name=solr_core_indexsearcher_termstats_cache, description=Operation counts for the searcher term statistics cache, reported per operation type, unit=, type=OBSERVABLE_GAUGE, valueType=LONG, advice=Advice{explicitBucketBoundaries=null, attributes=null}}]} has called close() multiple times.
  2> Wun 03, 2026 1:48:50 LUMA LWA K io.opentelemetry.sdk.internal.ThrottlingLogger doLog
  2> WARNING: CallbackRegistration{instrumentDescriptors=[InstrumentDescriptor{name=solr_core_indexsearcher_live_docs_cache, description=LiveDocs cache metrics, unit=, type=OBSERVABLE_COUNTER, valueType=LONG, advice=Advice{explicitBucketBoundaries=null, attributes=null}}]} has called close() multiple times.
  2> Wun 03, 2026 1:48:50 LUMA LWA K io.opentelemetry.sdk.internal.ThrottlingLogger doLog
  2> WARNING: CallbackRegistration{instrumentDescriptors=[InstrumentDescriptor{name=solr_core_indexsearcher_index_num_docs, description=Number of live docs in the index, unit=, type=OBSERVABLE_GAUGE, valueType=LONG, advice=Advice{explicitBucketBoundaries=null, attributes=null}}]} has called close() multiple times.
  2> Wun 03, 2026 1:48:50 LUMA LWA K io.opentelemetry.sdk.internal.ThrottlingLogger doLog
  2> WARNING: CallbackRegistration{instrumentDescriptors=[InstrumentDescriptor{name=solr_core_indexsearcher_index_docs, description=Total number of docs in the index (including deletions), unit=, type=OBSERVABLE_GAUGE, valueType=LONG, advice=Advice{explicitBucketBoundaries=null, attributes=null}}]} has called close() multiple times.
  2> Wun 03, 2026 1:48:50 LUMA LWA K io.opentelemetry.sdk.internal.ThrottlingLogger doLog
  2> WARNING: CallbackRegistration{instrumentDescriptors=[InstrumentDescriptor{name=solr_core_indexsearcher_index_version, description=Lucene index version, unit=, type=OBSERVABLE_GAUGE, valueType=LONG, advice=Advice{explicitBucketBoundaries=null, attributes=null}}]} has called close() multiple times.
  2> Wun 03, 2026 1:48:50 LUMA LWA K io.opentelemetry.sdk.internal.ThrottlingLogger doLog
  2> WARNING: CallbackRegistration{instrumentDescriptors=[InstrumentDescriptor{name=solr_core_ref_count, description=The current number of active references to a Solr core, unit=, type=OBSERVABLE_GAUGE, valueType=LONG, advice=Advice{explicitBucketBoundaries=null, attributes=null}}]} has called close() multiple times.
  2> Wun 03, 2026 1:48:50 LUMA LWA K io.opentelemetry.sdk.internal.ThrottlingLogger doLog
  2> WARNING: CallbackRegistration{instrumentDescriptors=[InstrumentDescriptor{name=solr_core_executor_thread_pool_size, description=Thread pool size, unit=, type=OBSERVABLE_GAUGE, valueType=LONG, advice=Advice{explicitBucketBoundaries=null, attributes=null}}]} has called close() multiple times.
  2> Wun 03, 2026 1:48:50 LUMA LWA K io.opentelemetry.sdk.internal.ThrottlingLogger doLog
  2> WARNING: CallbackRegistration{instrumentDescriptors=[InstrumentDescriptor{name=solr_core_executor_thread_pool_tasks, description=Thread pool task counts, unit=, type=OBSERVABLE_GAUGE, valueType=LONG, advice=Advice{explicitBucketBoundaries=null, attributes=null}}]} has called close() multiple times.
  2> Wun 03, 2026 1:48:50 LUMA LWA K io.opentelemetry.sdk.internal.ThrottlingLogger doLog
  2> WARNING: CallbackRegistration{instrumentDescriptors=[InstrumentDescriptor{name=solr_core_executor_thread_pool_size, description=Thread pool size, unit=, type=OBSERVABLE_GAUGE, valueType=LONG, advice=Advice{explicitBucketBoundaries=null, attributes=null}}]} has called close() multiple times.
  2> Wun 03, 2026 1:48:50 LUMA LWA K io.opentelemetry.sdk.internal.ThrottlingLogger doLog
  2> WARNING: CallbackRegistration{instrumentDescriptors=[InstrumentDescriptor{name=solr_core_executor_thread_pool_tasks, description=Thread pool task counts, unit=, type=OBSERVABLE_GAUGE, valueType=LONG, advice=Advice{explicitBucketBoundaries=null, attributes=null}}]} has called close() multiple times.
  2> Wun 03, 2026 1:48:50 LUMA LWA K io.opentelemetry.sdk.internal.ThrottlingLogger doLog
  2> WARNING: CallbackRegistration{instrumentDescriptors=[InstrumentDescriptor{name=solr_core_executor_thread_pool_size, description=Thread pool size, unit=, type=OBSERVABLE_GAUGE, valueType=LONG, advice=Advice{explicitBucketBoundaries=null, attributes=null}}]} has called close() multiple times.
  2> Wun 03, 2026 1:48:50 LUMA LWA K io.opentelemetry.sdk.internal.ThrottlingLogger doLog
  2> WARNING: CallbackRegistration{instrumentDescriptors=[InstrumentDescriptor{name=solr_core_executor_thread_pool_tasks, description=Thread pool task counts, unit=, type=OBSERVABLE_GAUGE, valueType=LONG, advice=Advice{explicitBucketBoundaries=null, attributes=null}}]} has called close() multiple times.
  2> 794719 INFO  (SUITE-LoggingHandlerTest-seed#[C9C25E93EF68F31E]-worker) [] o.a.s.u.ErrorLogMuter Closing ErrorLogMuter-regex-14791 after mutting 0 log messages
  2> 794719 INFO  (SUITE-LoggingHandlerTest-seed#[C9C25E93EF68F31E]-worker) [] o.a.s.u.ErrorLogMuter Creating ErrorLogMuter-regex-14792 for ERROR logs matching regex: ignore_exception
  2> NOTE: leaving temporary files on disk at: /home/jenkins/jenkins-agent/workspace/Solr/Solr-Test-10.0/build/tmp/tests-tmp/org.apache.solr.handler.admin.LoggingHandlerTest_C9C25E93EF68F31E-001
  2> NOTE: test params are: codec=Asserting(Lucene103): {}, docValues:{}, maxPointsInLeafNode=1003, maxMBSortInHeap=7.566395862238386, sim=Asserting(RandomSimilarity(queryNorm=true): {}), locale=dav, timezone=America/St_Kitts
  2> NOTE: Linux 6.8.0-136-generic amd64/Eclipse Adoptium 21.0.4 (64-bit)/cpus=1,threads=1,free=395905392,total=497025024
  2> NOTE: All tests run in this JVM: [ConvertedLegacyTest, EchoParamsTest, SampleTest, TestCpuTimeSearch, TestDistributedGrouping, TestGroupingSearch, TestRandomFaceting, CommonGramsPhraseQueryTest, TestLuceneMatchVersion, JerseyResourceTest, BufferStoreTest, CLIUtilsTest, PackageToolTest, SolrCLIZkToolsTest, TestExportTool, TestEmbeddedSolrServerConstructors, AliasIntegrationTest, ChaosMonkeyNothingIsSafeTest, ClusterStateTest, CollectionsAPISolrJTest, CreateCollectionWithPropertiesTest, DeleteNodeTest, DistribCursorPagingTest, DistributedQueueTest, ForceLeaderWithTlogReplicasTest, HttpPartitionWithTlogReplicasTest, LeaderFailoverAfterPartitionTest, MigrateReplicasTest, MultiSolrCloudTestCaseTest, NodeRolesTest, OverseerModifyCollectionTest, OverseerTaskQueueTest, RecoveryAfterSoftCommitTest, ReindexCollectionTest, ReplicationFactorTest, SSLMigrationTest, SliceStateTest, SyncSliceTest, TestCloudInspectUtil, TestCloudRecovery, TestConfigSetsAPI, TestDeleteCollectionOnDownNodes, TestDynamicFieldNamesIndexCorrectly, TestGracefulJettyShutdown, TestLeaderElectionZkExpiry, TestOnReconnectListenerSupport, TestPullReplicaWithAuth, TestRandomRequestDistribution, TestSegmentSorting, TestSkipOverseerOperations, TestTlogReplayVsRecovery, TestWaitForStateWithJettyShutdowns, VMParamsZkACLAndCredentialsProvidersTest, ZkNodePropsTest, BackupRestoreApiErrorConditionsTest, CollectionsAPIAsyncDistributedZkTest, LocalFSCloudIncrementalBackupTest, SimpleCollectionCreateDeleteTest, TestLocalFSCloudBackupRestore, ZkCollectionPropsCachingTest, CollectionsRepairEventListenerTest, PlacementPluginIntegrationTest, SimplePlacementFactoryTest, ByteBuffersDirectoryFactoryTest, CoreSorterTest, PluginBagTest, RAMDirectoryFactoryTest, SolrCoreCheckLockOnStartupTest, TestCodecSupport, TestConfigSetImmutable, TestCoreContainer, TestFileSystemConfigSetService, TestInitParams, TestNRTOpen, TestSchemaCodecFactoryDefaults, TestSolrDeletionPolicy1, TestTracerConfigurator, BackupIdTest, TestSolrCoreSnapshots, DocumentAnalysisRequestHandlerTest, PingRequestHandlerTest, SearchHandlerTest, TestHealthCheckHandlerLegacyMode, TestReplicationHandlerBackup, TestRestoreCore, TestSolrConfigHandlerConcurrent, V2ApiIntegrationTest, XmlUpdateRequestHandlerTest, CoreAdminHandlerTest, DaemonStreamApiTest, LoggingHandlerTest]

WARNING: Test org.apache.solr.search.TestRealTimeGet wrote 11,034,384 bytes of output.

[972.268s][warning][jfr,system] Could not initialize JDK events. access denied ("java.lang.RuntimePermission" "accessClassInPackage.jdk.internal.event")

> Task :solr:core:test
WARNING: Test org.apache.solr.search.TestRandomCollapseQParserPlugin wrote 18,075,738 bytes of output.
WARNING: Test org.apache.solr.search.TestRangeQuery wrote 15,912,393 bytes of output.
WARNING: Test org.apache.solr.schema.TestPointFields wrote 21,736,421 bytes of output.
WARNING: Test org.apache.solr.search.TestStressVersions wrote 11,206,387 bytes of output.
WARNING: Test org.apache.solr.search.facet.TestCloudJSONFacetJoinDomain wrote 13,332,245 bytes of output.
WARNING: Test org.apache.solr.search.TestStressReorder wrote 13,384,620 bytes of output.
WARNING: Test org.apache.solr.update.TestInPlaceUpdatesStandalone wrote 28,201,118 bytes of output.
WARNING: Test org.apache.solr.search.facet.TestCloudJSONFacetSKG wrote 38,687,821 bytes of output.
WARNING: Using incubator modules: jdk.incubator.vector
WARNING: Using incubator modules: jdk.incubator.vector
WARNING: Using incubator modules: jdk.incubator.vector
WARNING: Using incubator modules: jdk.incubator.vector
WARNING: A command line option has enabled the Security Manager
WARNING: The Security Manager is deprecated and will be removed in a future release
WARNING: A command line option has enabled the Security Manager
WARNING: The Security Manager is deprecated and will be removed in a future release
WARNING: A command line option has enabled the Security Manager
WARNING: The Security Manager is deprecated and will be removed in a future release
WARNING: A command line option has enabled the Security Manager
WARNING: The Security Manager is deprecated and will be removed in a future release
java.security.policy: error adding Permission, java.net.URLPermission:
	java.util.ServiceConfigurationError: Locale provider adapter "CLDR"cannot be instantiated.
java.security.policy: error adding Permission, java.net.URLPermission:
	java.util.ServiceConfigurationError: Locale provider adapter "CLDR"cannot be instantiated.
java.security.policy: error adding Permission, java.net.URLPermission:
	java.util.ServiceConfigurationError: Locale provider adapter "CLDR"cannot be instantiated.
java.security.policy: error adding Permission, java.net.URLPermission:
	java.util.ServiceConfigurationError: Locale provider adapter "CLDR"cannot be instantiated.
java.security.policy: error adding Permission, java.net.URLPermission:
	java.util.ServiceConfigurationError: Locale provider adapter "CLDR"cannot be instantiated.
java.security.policy: error adding Permission, java.net.URLPermission:
	java.util.ServiceConfigurationError: Locale provider adapter "CLDR"cannot be instantiated.
java.security.policy: error adding Permission, java.net.URLPermission:
	java.util.ServiceConfigurationError: Locale provider adapter "CLDR"cannot be instantiated.
java.security.policy: error adding Permission, java.net.URLPermission:
	java.util.ServiceConfigurationError: Locale provider adapter "CLDR"cannot be instantiated.
java.security.policy: error adding Permission, java.net.URLPermission:
	java.util.ServiceConfigurationError: Locale provider adapter "CLDR"cannot be instantiated.
java.security.policy: error adding Permission, java.net.URLPermission:
	java.util.ServiceConfigurationError: Locale provider adapter "CLDR"cannot be instantiated.
java.security.policy: error adding Permission, java.net.URLPermission:
	java.util.ServiceConfigurationError: Locale provider adapter "CLDR"cannot be instantiated.
java.security.policy: error adding Permission, java.net.URLPermission:
	java.util.ServiceConfigurationError: Locale provider adapter "CLDR"cannot be instantiated.
:solr:core:test (FAILURE): 5177 test(s), 1 failure(s), 182 skipped

5177 tests completed, 1 failed, 182 skipped
There were failing tests. See the results at: file:///home/jenkins/jenkins-agent/workspace/Solr/Solr-Test-10.0/solr/core/build/test-results/test/

> Task :solr:core:wipeTaskTemp

> Task :solr:modules:cross-dc:compileJava
Note: Some input files use or override a deprecated API.
Note: Recompile with -Xlint:deprecation for details.

> Task :solr:cross-dc-manager:compileJava
Note: Some input files use or override a deprecated API.
Note: Recompile with -Xlint:deprecation for details.

> Task :solr:cross-dc-manager:processResources NO-SOURCE
> Task :solr:cross-dc-manager:classes

> Task :solr:cross-dc-manager:compileTestJava
Note: Some input files use or override a deprecated API.
Note: Recompile with -Xlint:deprecation for details.

> Task :solr:cross-dc-manager:processTestResources
> Task :solr:cross-dc-manager:testClasses
> Task :solr:modules:cross-dc:processResources NO-SOURCE
> Task :solr:modules:cross-dc:classes
> Task :solr:modules:cross-dc:jar
OpenJDK 64-Bit Server VM warning: Sharing is only supported for boot loader classes because bootstrap classpath has been appended

> Task :solr:cross-dc-manager:test
WARNING: Using incubator modules: jdk.incubator.vector
WARNING: Using incubator modules: jdk.incubator.vector
WARNING: Using incubator modules: jdk.incubator.vector
WARNING: A command line option has enabled the Security Manager
WARNING: The Security Manager is deprecated and will be removed in a future release
WARNING: Using incubator modules: jdk.incubator.vector
WARNING: A command line option has enabled the Security Manager
WARNING: The Security Manager is deprecated and will be removed in a future release
WARNING: A command line option has enabled the Security Manager
WARNING: The Security Manager is deprecated and will be removed in a future release
WARNING: A command line option has enabled the Security Manager
WARNING: The Security Manager is deprecated and will be removed in a future release
java.security.policy: error adding Permission, java.net.URLPermission:
	java.util.ServiceConfigurationError: Locale provider adapter "CLDR"cannot be instantiated.
java.security.policy: error adding Permission, java.net.URLPermission:
	java.util.ServiceConfigurationError: Locale provider adapter "CLDR"cannot be instantiated.
java.security.policy: error adding Permission, java.net.URLPermission:
	java.util.ServiceConfigurationError: Locale provider adapter "CLDR"cannot be instantiated.
java.security.policy: error adding Permission, java.net.URLPermission:
	java.util.ServiceConfigurationError: Locale provider adapter "CLDR"cannot be instantiated.
java.security.policy: error adding Permission, java.net.URLPermission:
	java.util.ServiceConfigurationError: Locale provider adapter "CLDR"cannot be instantiated.
java.security.policy: error adding Permission, java.net.URLPermission:
	java.util.ServiceConfigurationError: Locale provider adapter "CLDR"cannot be instantiated.
java.security.policy: error adding Permission, java.net.URLPermission:
	java.util.ServiceConfigurationError: Locale provider adapter "CLDR"cannot be instantiated.
java.security.policy: error adding Permission, java.net.URLPermission:
	java.util.ServiceConfigurationError: Locale provider adapter "CLDR"cannot be instantiated.
java.security.policy: error adding Permission, java.net.URLPermission:
	java.util.ServiceConfigurationError: Locale provider adapter "CLDR"cannot be instantiated.
java.security.policy: error adding Permission, java.net.URLPermission:
	java.util.ServiceConfigurationError: Locale provider adapter "CLDR"cannot be instantiated.
java.security.policy: error adding Permission, java.net.URLPermission:
	java.util.ServiceConfigurationError: Locale provider adapter "CLDR"cannot be instantiated.
java.security.policy: error adding Permission, java.net.URLPermission:
	java.util.ServiceConfigurationError: Locale provider adapter "CLDR"cannot be instantiated.

OpenJDK 64-Bit Server VM warning: Sharing is only supported for boot loader classes because bootstrap classpath has been appended
OpenJDK 64-Bit Server VM warning: Sharing is only supported for boot loader classes because bootstrap classpath has been appended
OpenJDK 64-Bit Server VM warning: Sharing is only supported for boot loader classes because bootstrap classpath has been appended

> Task :solr:cross-dc-manager:test
:solr:cross-dc-manager:test (SUCCESS): 38 test(s), 7 skipped

> Task :solr:cross-dc-manager:wipeTaskTemp
> Task :solr:server:compileJava SKIPPED
> Task :solr:server:processResources NO-SOURCE
> Task :solr:server:classes UP-TO-DATE
> Task :solr:server:compileTestJava NO-SOURCE
> Task :solr:server:processTestResources NO-SOURCE
> Task :solr:server:testClasses UP-TO-DATE
> Task :solr:server:test NO-SOURCE
> Task :solr:server:wipeTaskTemp
> Task :solr:solr-ref-guide:compileJava NO-SOURCE
> Task :solr:solr-ref-guide:processResources NO-SOURCE
> Task :solr:solr-ref-guide:classes UP-TO-DATE

> Task :solr:solr-ref-guide:compileTestJava
Note: /home/jenkins/jenkins-agent/workspace/Solr/Solr-Test-10.0/solr/solr-ref-guide/modules/indexing-guide/examples/IndexingNestedDocuments.java uses or overrides a deprecated API.
Note: Recompile with -Xlint:deprecation for details.

> Task :solr:solr-ref-guide:copySolrjTestResources
> Task :solr:solr-ref-guide:processTestResources NO-SOURCE
> Task :solr:solr-ref-guide:testClasses

> Task :solr:modules:sql:compileJava
Note: Some input files use or override a deprecated API.
Note: Recompile with -Xlint:deprecation for details.

> Task :solr:modules:sql:processResources
> Task :solr:modules:sql:classes
> Task :solr:modules:sql:jar

> Task :solr:solr-ref-guide:test
WARNING: Using incubator modules: jdk.incubator.vector
WARNING: Using incubator modules: jdk.incubator.vector
WARNING: Using incubator modules: jdk.incubator.vector
WARNING: Using incubator modules: jdk.incubator.vector
WARNING: A command line option has enabled the Security Manager
WARNING: The Security Manager is deprecated and will be removed in a future release
WARNING: A command line option has enabled the Security Manager
WARNING: The Security Manager is deprecated and will be removed in a future release
WARNING: A command line option has enabled the Security Manager
WARNING: The Security Manager is deprecated and will be removed in a future release
WARNING: A command line option has enabled the Security Manager
WARNING: The Security Manager is deprecated and will be removed in a future release
java.security.policy: error adding Permission, java.net.URLPermission:
	java.util.ServiceConfigurationError: Locale provider adapter "CLDR"cannot be instantiated.
java.security.policy: error adding Permission, java.net.URLPermission:
	java.util.ServiceConfigurationError: Locale provider adapter "CLDR"cannot be instantiated.
java.security.policy: error adding Permission, java.net.URLPermission:
	java.util.ServiceConfigurationError: Locale provider adapter "CLDR"cannot be instantiated.
java.security.policy: error adding Permission, java.net.URLPermission:
	java.util.ServiceConfigurationError: Locale provider adapter "CLDR"cannot be instantiated.
java.security.policy: error adding Permission, java.net.URLPermission:
	java.util.ServiceConfigurationError: Locale provider adapter "CLDR"cannot be instantiated.
java.security.policy: error adding Permission, java.net.URLPermission:
	java.util.ServiceConfigurationError: Locale provider adapter "CLDR"cannot be instantiated.
java.security.policy: error adding Permission, java.net.URLPermission:
	java.util.ServiceConfigurationError: Locale provider adapter "CLDR"cannot be instantiated.
java.security.policy: error adding Permission, java.net.URLPermission:
java.security.policy: error adding Permission, java.net.URLPermission:
	java.util.ServiceConfigurationError: Locale provider adapter "CLDR"cannot be instantiated.
	java.util.ServiceConfigurationError: Locale provider adapter "CLDR"cannot be instantiated.
java.security.policy: error adding Permission, java.net.URLPermission:
	java.util.ServiceConfigurationError: Locale provider adapter "CLDR"cannot be instantiated.
java.security.policy: error adding Permission, java.net.URLPermission:
	java.util.ServiceConfigurationError: Locale provider adapter "CLDR"cannot be instantiated.
java.security.policy: error adding Permission, java.net.URLPermission:
	java.util.ServiceConfigurationError: Locale provider adapter "CLDR"cannot be instantiated.
:solr:solr-ref-guide:test (SUCCESS): 34 test(s)

> Task :solr:solr-ref-guide:wipeTaskTemp

> Task :solr:solrj:compileTestJava
Note: Some input files use or override a deprecated API.
Note: Recompile with -Xlint:deprecation for details.

> Task :solr:solrj:processTestResources
> Task :solr:solrj:testClasses
> Task :solr:solrj:testJar

> Task :solr:solrj:test
WARNING: Using incubator modules: jdk.incubator.vector
WARNING: Using incubator modules: jdk.incubator.vector
WARNING: A command line option has enabled the Security Manager
WARNING: The Security Manager is deprecated and will be removed in a future release
WARNING: A command line option has enabled the Security Manager
WARNING: The Security Manager is deprecated and will be removed in a future release
WARNING: Using incubator modules: jdk.incubator.vector
WARNING: Using incubator modules: jdk.incubator.vector
WARNING: A command line option has enabled the Security Manager
WARNING: The Security Manager is deprecated and will be removed in a future release
WARNING: A command line option has enabled the Security Manager
WARNING: The Security Manager is deprecated and will be removed in a future release
java.security.policy: error adding Permission, java.net.URLPermission:
	java.util.ServiceConfigurationError: Locale provider adapter "CLDR"cannot be instantiated.
java.security.policy: error adding Permission, java.net.URLPermission:
	java.util.ServiceConfigurationError: Locale provider adapter "CLDR"cannot be instantiated.
java.security.policy: error adding Permission, java.net.URLPermission:
	java.util.ServiceConfigurationError: Locale provider adapter "CLDR"cannot be instantiated.
java.security.policy: error adding Permission, java.net.URLPermission:
	java.util.ServiceConfigurationError: Locale provider adapter "CLDR"cannot be instantiated.
java.security.policy: error adding Permission, java.net.URLPermission:
	java.util.ServiceConfigurationError: Locale provider adapter "CLDR"cannot be instantiated.
java.security.policy: error adding Permission, java.net.URLPermission:
	java.util.ServiceConfigurationError: Locale provider adapter "CLDR"cannot be instantiated.
java.security.policy: error adding Permission, java.net.URLPermission:
	java.util.ServiceConfigurationError: Locale provider adapter "CLDR"cannot be instantiated.
java.security.policy: error adding Permission, java.net.URLPermission:
	java.util.ServiceConfigurationError: Locale provider adapter "CLDR"cannot be instantiated.
java.security.policy: error adding Permission, java.net.URLPermission:
	java.util.ServiceConfigurationError: Locale provider adapter "CLDR"cannot be instantiated.
java.security.policy: error adding Permission, java.net.URLPermission:
	java.util.ServiceConfigurationError: Locale provider adapter "CLDR"cannot be instantiated.
java.security.policy: error adding Permission, java.net.URLPermission:
	java.util.ServiceConfigurationError: Locale provider adapter "CLDR"cannot be instantiated.
java.security.policy: error adding Permission, java.net.URLPermission:
	java.util.ServiceConfigurationError: Locale provider adapter "CLDR"cannot be instantiated.

[2.111s][warning][jfr,system] Could not initialize JDK events. access denied ("java.lang.RuntimePermission" "accessClassInPackage.jdk.internal.event")
[29.904s][warning][jfr,system] Could not initialize JDK events. access denied ("java.lang.RuntimePermission" "accessClassInPackage.jdk.internal.event")
[33.092s][warning][jfr,system] Could not initialize JDK events. access denied ("java.lang.RuntimePermission" "accessClassInPackage.jdk.internal.event")
[50.073s][warning][jfr,system] Could not initialize JDK events. access denied ("java.lang.RuntimePermission" "accessClassInPackage.jdk.internal.event")

> Task :solr:solrj:test
:solr:solrj:test (SUCCESS): 1176 test(s), 40 skipped

> Task :solr:solrj:wipeTaskTemp

> Task :solr:solrj-jetty:compileTestJava
Note: Some input files use or override a deprecated API.
Note: Recompile with -Xlint:deprecation for details.

> Task :solr:solrj-jetty:processTestResources
> Task :solr:solrj-jetty:testClasses

> Task :solr:solrj-jetty:test
WARNING: Using incubator modules: jdk.incubator.vector
WARNING: Using incubator modules: jdk.incubator.vector
WARNING: Using incubator modules: jdk.incubator.vector
WARNING: Using incubator modules: jdk.incubator.vector
WARNING: A command line option has enabled the Security Manager
WARNING: The Security Manager is deprecated and will be removed in a future release
WARNING: A command line option has enabled the Security Manager
WARNING: The Security Manager is deprecated and will be removed in a future release
WARNING: A command line option has enabled the Security Manager
WARNING: The Security Manager is deprecated and will be removed in a future release
WARNING: A command line option has enabled the Security Manager
WARNING: The Security Manager is deprecated and will be removed in a future release
java.security.policy: error adding Permission, java.net.URLPermission:
	java.util.ServiceConfigurationError: Locale provider adapter "CLDR"cannot be instantiated.
java.security.policy: error adding Permission, java.net.URLPermission:
	java.util.ServiceConfigurationError: Locale provider adapter "CLDR"cannot be instantiated.
java.security.policy: error adding Permission, java.net.URLPermission:
	java.util.ServiceConfigurationError: Locale provider adapter "CLDR"cannot be instantiated.
java.security.policy: error adding Permission, java.net.URLPermission:
	java.util.ServiceConfigurationError: Locale provider adapter "CLDR"cannot be instantiated.
java.security.policy: error adding Permission, java.net.URLPermission:
	java.util.ServiceConfigurationError: Locale provider adapter "CLDR"cannot be instantiated.
java.security.policy: error adding Permission, java.net.URLPermission:
	java.util.ServiceConfigurationError: Locale provider adapter "CLDR"cannot be instantiated.
java.security.policy: error adding Permission, java.net.URLPermission:
	java.util.ServiceConfigurationError: Locale provider adapter "CLDR"cannot be instantiated.
java.security.policy: error adding Permission, java.net.URLPermission:
	java.util.ServiceConfigurationError: Locale provider adapter "CLDR"cannot be instantiated.
java.security.policy: error adding Permission, java.net.URLPermission:
	java.util.ServiceConfigurationError: Locale provider adapter "CLDR"cannot be instantiated.
java.security.policy: error adding Permission, java.net.URLPermission:
	java.util.ServiceConfigurationError: Locale provider adapter "CLDR"cannot be instantiated.
java.security.policy: error adding Permission, java.net.URLPermission:
	java.util.ServiceConfigurationError: Locale provider adapter "CLDR"cannot be instantiated.
java.security.policy: error adding Permission, java.net.URLPermission:
	java.util.ServiceConfigurationError: Locale provider adapter "CLDR"cannot be instantiated.
:solr:solrj-jetty:test (SUCCESS): 53 test(s), 2 skipped

> Task :solr:solrj-jetty:wipeTaskTemp

> Task :solr:solrj-streaming:compileTestJava
Note: Some input files use or override a deprecated API.
Note: Recompile with -Xlint:deprecation for details.

> Task :solr:solrj-streaming:processTestResources
> Task :solr:solrj-streaming:testClasses

> Task :solr:solrj-streaming:test
WARNING: Using incubator modules: jdk.incubator.vector
WARNING: Using incubator modules: jdk.incubator.vector
WARNING: Using incubator modules: jdk.incubator.vector
WARNING: Using incubator modules: jdk.incubator.vector
WARNING: A command line option has enabled the Security Manager
WARNING: The Security Manager is deprecated and will be removed in a future release
WARNING: A command line option has enabled the Security Manager
WARNING: The Security Manager is deprecated and will be removed in a future release
WARNING: A command line option has enabled the Security Manager
WARNING: The Security Manager is deprecated and will be removed in a future release
WARNING: A command line option has enabled the Security Manager
WARNING: The Security Manager is deprecated and will be removed in a future release
java.security.policy: error adding Permission, java.net.URLPermission:
	java.util.ServiceConfigurationError: Locale provider adapter "CLDR"cannot be instantiated.
java.security.policy: error adding Permission, java.net.URLPermission:
	java.util.ServiceConfigurationError: Locale provider adapter "CLDR"cannot be instantiated.
java.security.policy: error adding Permission, java.net.URLPermission:
	java.util.ServiceConfigurationError: Locale provider adapter "CLDR"cannot be instantiated.
java.security.policy: error adding Permission, java.net.URLPermission:
	java.util.ServiceConfigurationError: Locale provider adapter "CLDR"cannot be instantiated.
java.security.policy: error adding Permission, java.net.URLPermission:
	java.util.ServiceConfigurationError: Locale provider adapter "CLDR"cannot be instantiated.
java.security.policy: error adding Permission, java.net.URLPermission:
	java.util.ServiceConfigurationError: Locale provider adapter "CLDR"cannot be instantiated.
java.security.policy: error adding Permission, java.net.URLPermission:
	java.util.ServiceConfigurationError: Locale provider adapter "CLDR"cannot be instantiated.
java.security.policy: error adding Permission, java.net.URLPermission:
	java.util.ServiceConfigurationError: Locale provider adapter "CLDR"cannot be instantiated.
java.security.policy: error adding Permission, java.net.URLPermission:
	java.util.ServiceConfigurationError: Locale provider adapter "CLDR"cannot be instantiated.
java.security.policy: error adding Permission, java.net.URLPermission:
	java.util.ServiceConfigurationError: Locale provider adapter "CLDR"cannot be instantiated.
java.security.policy: error adding Permission, java.net.URLPermission:
	java.util.ServiceConfigurationError: Locale provider adapter "CLDR"cannot be instantiated.
java.security.policy: error adding Permission, java.net.URLPermission:
	java.util.ServiceConfigurationError: Locale provider adapter "CLDR"cannot be instantiated.
:solr:solrj-streaming:test (SUCCESS): 610 test(s), 12 skipped

> Task :solr:solrj-streaming:wipeTaskTemp

> Task :solr:solrj-zookeeper:compileTestJava
Note: /home/jenkins/jenkins-agent/workspace/Solr/Solr-Test-10.0/solr/solrj-zookeeper/src/test/org/apache/solr/common/cloud/SolrZkClientTest.java uses or overrides a deprecated API.
Note: Recompile with -Xlint:deprecation for details.

> Task :solr:solrj-zookeeper:processTestResources
> Task :solr:solrj-zookeeper:testClasses

> Task :solr:solrj-zookeeper:test
WARNING: Using incubator modules: jdk.incubator.vector
WARNING: Using incubator modules: jdk.incubator.vector
WARNING: Using incubator modules: jdk.incubator.vector
WARNING: Using incubator modules: jdk.incubator.vector
WARNING: A command line option has enabled the Security Manager
WARNING: The Security Manager is deprecated and will be removed in a future release
WARNING: A command line option has enabled the Security Manager
WARNING: The Security Manager is deprecated and will be removed in a future release
WARNING: A command line option has enabled the Security Manager
WARNING: The Security Manager is deprecated and will be removed in a future release
WARNING: A command line option has enabled the Security Manager
WARNING: The Security Manager is deprecated and will be removed in a future release
java.security.policy: error adding Permission, java.net.URLPermission:
	java.util.ServiceConfigurationError: Locale provider adapter "CLDR"cannot be instantiated.
java.security.policy: error adding Permission, java.net.URLPermission:
	java.util.ServiceConfigurationError: Locale provider adapter "CLDR"cannot be instantiated.
java.security.policy: error adding Permission, java.net.URLPermission:
	java.util.ServiceConfigurationError: Locale provider adapter "CLDR"cannot be instantiated.
java.security.policy: error adding Permission, java.net.URLPermission:
	java.util.ServiceConfigurationError: Locale provider adapter "CLDR"cannot be instantiated.
java.security.policy: error adding Permission, java.net.URLPermission:
	java.util.ServiceConfigurationError: Locale provider adapter "CLDR"cannot be instantiated.
java.security.policy: error adding Permission, java.net.URLPermission:
	java.util.ServiceConfigurationError: Locale provider adapter "CLDR"cannot be instantiated.
java.security.policy: error adding Permission, java.net.URLPermission:
	java.util.ServiceConfigurationError: Locale provider adapter "CLDR"cannot be instantiated.
java.security.policy: error adding Permission, java.net.URLPermission:
	java.util.ServiceConfigurationError: Locale provider adapter "CLDR"cannot be instantiated.
java.security.policy: error adding Permission, java.net.URLPermission:
	java.util.ServiceConfigurationError: Locale provider adapter "CLDR"cannot be instantiated.
java.security.policy: error adding Permission, java.net.URLPermission:
	java.util.ServiceConfigurationError: Locale provider adapter "CLDR"cannot be instantiated.
java.security.policy: error adding Permission, java.net.URLPermission:
	java.util.ServiceConfigurationError: Locale provider adapter "CLDR"cannot be instantiated.
java.security.policy: error adding Permission, java.net.URLPermission:
	java.util.ServiceConfigurationError: Locale provider adapter "CLDR"cannot be instantiated.
:solr:solrj-zookeeper:test (SUCCESS): 18 test(s)

> Task :solr:solrj-zookeeper:wipeTaskTemp

> Task :solr:test-framework:compileTestJava
Note: Some input files use or override a deprecated API.
Note: Recompile with -Xlint:deprecation for details.

> Task :solr:test-framework:processTestResources
> Task :solr:test-framework:testClasses

> Task :solr:test-framework:test
WARNING: Using incubator modules: jdk.incubator.vector
WARNING: Using incubator modules: jdk.incubator.vector
WARNING: Using incubator modules: jdk.incubator.vector
WARNING: Using i

[...truncated too long message...]

, java.net.URLPermission:
	java.util.ServiceConfigurationError: Locale provider adapter "CLDR"cannot be instantiated.
java.security.policy: error adding Permission, java.net.URLPermission:
java.security.policy: error adding Permission, java.net.URLPermission:
	java.util.ServiceConfigurationError: Locale provider adapter "CLDR"cannot be instantiated.
	java.util.ServiceConfigurationError: Locale provider adapter "CLDR"cannot be instantiated.
java.security.policy: error adding Permission, java.net.URLPermission:
	java.util.ServiceConfigurationError: Locale provider adapter "CLDR"cannot be instantiated.
java.security.policy: error adding Permission, java.net.URLPermission:
	java.util.ServiceConfigurationError: Locale provider adapter "CLDR"cannot be instantiated.
:solr:modules:s3-repository:test (SUCCESS): 53 test(s), 1 skipped

> Task :solr:modules:s3-repository:wipeTaskTemp

> Task :solr:modules:scripting:compileJava
Note: Some input files use or override a deprecated API.
Note: Recompile with -Xlint:deprecation for details.

> Task :solr:modules:scripting:processResources NO-SOURCE
> Task :solr:modules:scripting:classes

> Task :solr:modules:scripting:compileTestJava
Note: Some input files use or override a deprecated API.
Note: Recompile with -Xlint:deprecation for details.

> Task :solr:modules:scripting:processTestResources
> Task :solr:modules:scripting:testClasses

> Task :solr:modules:scripting:test
WARNING: Using incubator modules: jdk.incubator.vector
WARNING: Using incubator modules: jdk.incubator.vector
WARNING: Using incubator modules: jdk.incubator.vector
WARNING: Using incubator modules: jdk.incubator.vector
WARNING: A command line option has enabled the Security Manager
WARNING: The Security Manager is deprecated and will be removed in a future release
WARNING: A command line option has enabled the Security Manager
WARNING: The Security Manager is deprecated and will be removed in a future release
WARNING: A command line option has enabled the Security Manager
WARNING: The Security Manager is deprecated and will be removed in a future release
WARNING: A command line option has enabled the Security Manager
WARNING: The Security Manager is deprecated and will be removed in a future release
java.security.policy: error adding Permission, java.net.URLPermission:
	java.util.ServiceConfigurationError: Locale provider adapter "CLDR"cannot be instantiated.
java.security.policy: error adding Permission, java.net.URLPermission:
	java.util.ServiceConfigurationError: Locale provider adapter "CLDR"cannot be instantiated.
java.security.policy: error adding Permission, java.net.URLPermission:
	java.util.ServiceConfigurationError: Locale provider adapter "CLDR"cannot be instantiated.
java.security.policy: error adding Permission, java.net.URLPermission:
	java.util.ServiceConfigurationError: Locale provider adapter "CLDR"cannot be instantiated.
java.security.policy: error adding Permission, java.net.URLPermission:
	java.util.ServiceConfigurationError: Locale provider adapter "CLDR"cannot be instantiated.
java.security.policy: error adding Permission, java.net.URLPermission:
	java.util.ServiceConfigurationError: Locale provider adapter "CLDR"cannot be instantiated.
java.security.policy: error adding Permission, java.net.URLPermission:
	java.util.ServiceConfigurationError: Locale provider adapter "CLDR"cannot be instantiated.
java.security.policy: error adding Permission, java.net.URLPermission:
	java.util.ServiceConfigurationError: Locale provider adapter "CLDR"cannot be instantiated.
java.security.policy: error adding Permission, java.net.URLPermission:
	java.util.ServiceConfigurationError: Locale provider adapter "CLDR"cannot be instantiated.
java.security.policy: error adding Permission, java.net.URLPermission:
	java.util.ServiceConfigurationError: Locale provider adapter "CLDR"cannot be instantiated.
java.security.policy: error adding Permission, java.net.URLPermission:
	java.util.ServiceConfigurationError: Locale provider adapter "CLDR"cannot be instantiated.
java.security.policy: error adding Permission, java.net.URLPermission:
	java.util.ServiceConfigurationError: Locale provider adapter "CLDR"cannot be instantiated.
:solr:modules:scripting:test (SUCCESS): 22 test(s), 17 skipped

> Task :solr:modules:scripting:wipeTaskTemp

> Task :solr:modules:sql:compileTestJava
Note: Some input files use or override a deprecated API.
Note: Recompile with -Xlint:deprecation for details.

> Task :solr:modules:sql:copySolrCoreTestResources
> Task :solr:modules:sql:processTestResources
> Task :solr:modules:sql:testClasses

> Task :solr:modules:sql:test
WARNING: Using incubator modules: jdk.incubator.vector
WARNING: Using incubator modules: jdk.incubator.vector
WARNING: Using incubator modules: jdk.incubator.vector
WARNING: A command line option has enabled the Security Manager
WARNING: The Security Manager is deprecated and will be removed in a future release
WARNING: A command line option has enabled the Security Manager
WARNING: The Security Manager is deprecated and will be removed in a future release
WARNING: A command line option has enabled the Security Manager
WARNING: The Security Manager is deprecated and will be removed in a future release
java.security.policy: error adding Permission, java.net.URLPermission:
	java.util.ServiceConfigurationError: Locale provider adapter "CLDR"cannot be instantiated.
java.security.policy: error adding Permission, java.net.URLPermission:
	java.util.ServiceConfigurationError: Locale provider adapter "CLDR"cannot be instantiated.
java.security.policy: error adding Permission, java.net.URLPermission:
	java.util.ServiceConfigurationError: Locale provider adapter "CLDR"cannot be instantiated.
java.security.policy: error adding Permission, java.net.URLPermission:
	java.util.ServiceConfigurationError: Locale provider adapter "CLDR"cannot be instantiated.
java.security.policy: error adding Permission, java.net.URLPermission:
	java.util.ServiceConfigurationError: Locale provider adapter "CLDR"cannot be instantiated.
java.security.policy: error adding Permission, java.net.URLPermission:
	java.util.ServiceConfigurationError: Locale provider adapter "CLDR"cannot be instantiated.
java.security.policy: error adding Permission, java.net.URLPermission:
	java.util.ServiceConfigurationError: Locale provider adapter "CLDR"cannot be instantiated.
java.security.policy: error adding Permission, java.net.URLPermission:
	java.util.ServiceConfigurationError: Locale provider adapter "CLDR"cannot be instantiated.
java.security.policy: error adding Permission, java.net.URLPermission:
	java.util.ServiceConfigurationError: Locale provider adapter "CLDR"cannot be instantiated.
:solr:modules:sql:test (SUCCESS): 33 test(s)

> Task :solr:modules:sql:wipeTaskTemp
The slowest tests (exceeding 500 ms) during this run:
  90.41s BasicDistributedZkTest.test (:solr:core)
  69.74s TestCpuAllowedLimit.testDistribLimit2 (:solr:core)
  54.31s TestCpuAllowedLimit.testDistribLimit (:solr:core)
  48.88s ReplicationFactorTest.test (:solr:core)
  46.94s SyncSliceTest.test (:solr:core)
  44.14s PeerSyncReplicationTest.test (:solr:core)
  41.55s TestCloudJSONFacetSKG.testRandom (:solr:core)
  40.14s HttpJettySolrClientTest.testIdleTimeoutWithHttpClient (:solr:solrj-jetty)
  38.45s TestCoordinatorRole.testNRTRestart (:solr:core)
  37.33s TestRandomCollapseQParserPlugin.testRandomCollapseWithSort (:solr:core)
The slowest suites (exceeding 1s) during this run:
  132.03s TestCpuAllowedLimit (:solr:core)
  90.65s BasicDistributedZkTest (:solr:core)
  83.68s TestPullReplica (:solr:core)
  75.90s TestCoordinatorRole (:solr:core)
  68.72s KnnQParserTest (:solr:core)
  65.40s TestRecovery (:solr:core)
  62.90s TestRangeQuery (:solr:core)
  60.53s TestCloudConsistency (:solr:core)
  60.40s MultiThreadedOCPTest (:solr:core)
  55.51s TestTlogReplica (:solr:core)
ERROR: The following test(s) have failed:
  - org.apache.solr.handler.admin.LoggingHandlerTest.testLogLevelHandlerOutput (:solr:core)
    Test history: https://develocity.apache.org/scans/tests?search.rootProjectNames=solr-root&tests.container=org.apache.solr.handler.admin.LoggingHandlerTest&tests.test=testLogLevelHandlerOutput http://fucit.org/solr-jenkins-reports/history-trend-of-recent-failures.html#series/org.apache.solr.handler.admin.LoggingHandlerTest.testLogLevelHandlerOutput
    Test output: /home/jenkins/jenkins-agent/workspace/Solr/Solr-Test-10.0/solr/core/build/test-results/test/outputs/OUTPUT-org.apache.solr.handler.admin.LoggingHandlerTest.txt
    Reproduce with: ./gradlew :solr:core:test --tests "org.apache.solr.handler.admin.LoggingHandlerTest.testLogLevelHandlerOutput" -Ptests.haltonfailure=false "-Ptests.jvmargs=-XX:TieredStopAtLevel=1 -XX:+UseParallelGC -XX:ActiveProcessorCount=1 -XX:ReservedCodeCacheSize=120m" -Ptests.seed=C9C25E93EF68F31E -Ptests.multiplier=2 -Ptests.useSecurityManager=true -Ptests.badapples=false -Ptests.file.encoding=UTF-8


Deprecated Gradle features were used in this build, making it incompatible with Gradle 9.0.

You can use '--warning-mode all' to show the individual deprecation warnings and determine if they come from your own scripts or plugins.

For more on this, please refer to https://docs.gradle.org/8.10/userguide/command_line_interface.html#sec:command_line_warnings in the Gradle documentation.

BUILD SUCCESSFUL in 40m 44s
153 actionable tasks: 153 executed

Publishing build scan...
https://develocity.apache.org/s/3elfjsshc3pke

Build step 'Invoke Gradle script' changed build result to SUCCESS
Archiving artifacts
‘**/*.events’ doesn’t match anything: ‘**’ exists but not ‘**/*.events’
No artifacts found that match the file pattern "**/*.events,heapdumps/**,**/hs_err_pid*". Configuration error?
Recording test results
[Checks API] No suitable checks publisher found.
Build step 'Publish JUnit test result report' changed build result to UNSTABLE
Email was triggered for: Unstable (Test Failures)
Sending email for trigger: Unstable (Test Failures)