You are viewing a plain text version of this content. The canonical link for it is here.
Posted to builds@cassandra.apache.org by Apache Jenkins Server <je...@builds.apache.org> on 2026/07/21 15:24:20 UTC
Build complete: Cassandra-6.0 #77 [UNSTABLE] 15a6bac06d0ca1ca78b8b4326dd7bca2e00a1de5
-------------------------------------------------------------------------------
Build Cassandra-6.0 #77 Still Unstable
URL: https://ci-cassandra.apache.org/job/Cassandra-6.0/77/
-------------------------------------------------------------------------------
Changes:
[build] Verify extension type before initializing reflectively-loaded classes
-------------------------------------------------------------------------------
Failed Tests:
68 tests failed.
FAILED: dtest-large.replace_address_test.TestReplaceAddress.Tests / dtest-large jdk21 1/6 / test_replace_stopped_node
FAILED: dtest-large.snitch_test.TestDynamicEndpointSnitch.Tests / dtest-large jdk17 6/6 / test_multidatacenter_local_quorum
FAILED: dtest-latest.cqlsh_tests.test_cqlsh_copy.TestCqlshCopy.Tests / dtest-latest jdk17 5/64 / test_bulk_round_trip_with_timeouts
FAILED: dtest-latest.replace_address_test.TestReplaceAddress.Tests / dtest-latest jdk21 18/64 / test_fail_without_replace
FAILED: dtest-novnode.materialized_views_test.TestMaterializedViews.Tests / dtest-novnode jdk11 5/64 / test_drop_with_stopped_build
FAILED: dtest-novnode.materialized_views_test.TestMaterializedViews.Tests / dtest-novnode jdk17 42/64 / test_view_metadata_cleanup
FAILED: dtest-novnode.materialized_views_test.TestMaterializedViews.Tests / dtest-novnode jdk17 42/64 / test_view_metadata_cleanup
FAILED: dtest-novnode.pushed_notifications_test.TestPushedNotifications.Tests / dtest-novnode jdk17 56/64 / test_move_single_node_localhost
FAILED: dtest-novnode.rebuild_test.TestRebuild.Tests / dtest-novnode jdk11 25/64 / test_resumable_rebuild
FAILED: dtest-novnode.rebuild_test.TestRebuild.Tests / dtest-novnode jdk21 25/64 / test_resumable_rebuild
FAILED: dtest-upgrade-novnode.upgrade_tests.cql_tests.TestCQLNodes2RF1_Upgrade_current_6_0_x_To_indev_6_0_x.Tests / dtest-upgrade-novnode jdk11 106/160 / test_batch_and_list
FAILED: dtest-upgrade-novnode.upgrade_tests.cql_tests.TestCQLNodes2RF1_Upgrade_current_6_0_x_To_indev_6_0_x.Tests / dtest-upgrade-novnode jdk11 134/160 / test_clustering_order_and_functions
FAILED: dtest-upgrade-novnode.upgrade_tests.cql_tests.TestCQLNodes2RF1_Upgrade_current_6_0_x_To_indev_6_0_x.Tests / dtest-upgrade-novnode jdk11 155/160 / test_collection_indexing
FAILED: dtest-upgrade-novnode.upgrade_tests.cql_tests.TestCQLNodes2RF1_Upgrade_current_6_0_x_To_indev_6_0_x.Tests / dtest-upgrade-novnode jdk11 122/160 / test_compact_metadata
FAILED: dtest-upgrade-novnode.upgrade_tests.cql_tests.TestCQLNodes2RF1_Upgrade_current_6_0_x_To_indev_6_0_x.Tests / dtest-upgrade-novnode jdk11 128/160 / test_conversion_functions
FAILED: dtest-upgrade-novnode.upgrade_tests.cql_tests.TestCQLNodes2RF1_Upgrade_current_6_0_x_To_indev_6_0_x.Tests / dtest-upgrade-novnode jdk11 141/160 / test_empty_in
FAILED: dtest-upgrade-novnode.upgrade_tests.cql_tests.TestCQLNodes2RF1_Upgrade_current_6_0_x_To_indev_6_0_x.Tests / dtest-upgrade-novnode jdk11 126/160 / test_end_of_component_as_end_key
FAILED: dtest-upgrade-novnode.upgrade_tests.cql_tests.TestCQLNodes2RF1_Upgrade_current_6_0_x_To_indev_6_0_x.Tests / dtest-upgrade-novnode jdk11 138/160 / test_range_key_ordered
FAILED: dtest-upgrade-novnode.upgrade_tests.cql_tests.TestCQLNodes2RF1_Upgrade_current_6_0_x_To_indev_6_0_x.Tests / dtest-upgrade-novnode jdk11 148/160 / test_store_sets_with_if_not_exists
FAILED: dtest-upgrade-novnode.upgrade_tests.cql_tests.TestCQLNodes3RF3_Upgrade_current_6_0_x_To_indev_6_0_x.Tests / dtest-upgrade-novnode jdk11 57/160 / test_float_with_exponent
FAILED: dtest-upgrade-novnode.upgrade_tests.cql_tests.TestCQLNodes3RF3_Upgrade_current_6_0_x_To_indev_6_0_x.Tests / dtest-upgrade-novnode jdk11 89/160 / test_intersection_logic_returns_empty_result
FAILED: dtest-upgrade-novnode.upgrade_tests.cql_tests.TestCQLNodes3RF3_Upgrade_current_6_0_x_To_indev_6_0_x.Tests / dtest-upgrade-novnode jdk11 153/160 / test_limit_multiget
FAILED: dtest-upgrade-novnode.upgrade_tests.cql_tests.TestCQLNodes3RF3_Upgrade_current_6_0_x_To_indev_6_0_x.Tests / dtest-upgrade-novnode jdk11 155/160 / test_limit_sparse
FAILED: dtest-upgrade-novnode.upgrade_tests.cql_tests.TestCQLNodes3RF3_Upgrade_current_6_0_x_To_indev_6_0_x.Tests / dtest-upgrade-novnode jdk11 106/160 / test_list_item_conditional
FAILED: dtest-upgrade-novnode.upgrade_tests.cql_tests.TestCQLNodes3RF3_Upgrade_current_6_0_x_To_indev_6_0_x.Tests / dtest-upgrade-novnode jdk11 148/160 / test_noncomposite_static_cf
FAILED: dtest-upgrade-novnode.upgrade_tests.cql_tests.TestCQLNodes3RF3_Upgrade_current_6_0_x_To_indev_6_0_x.Tests / dtest-upgrade-novnode jdk11 76/160 / test_nonpure_function_collection
FAILED: dtest-upgrade-novnode.upgrade_tests.cql_tests.TestCQLNodes3RF3_Upgrade_current_6_0_x_To_indev_6_0_x.Tests / dtest-upgrade-novnode jdk11 56/160 / test_timeuuid
FAILED: dtest-upgrade-novnode.upgrade_tests.cql_tests.TestCQLNodes3RF3_Upgrade_current_6_0_x_To_indev_6_0_x.Tests / dtest-upgrade-novnode jdk11 132/160 / test_tracing_prevents_startup_after_upgrading
FAILED: dtest-upgrade-novnode.upgrade_tests.cql_tests.TestCQLNodes3RF3_Upgrade_current_6_0_x_To_indev_6_0_x.Tests / dtest-upgrade-novnode jdk11 105/160 / test_whole_list_conditional
FAILED: dtest-upgrade-novnode.upgrade_tests.cql_tests.TestCQLNodes3RF3_Upgrade_indev_4_0_x_To_indev_6_0_x.Tests / dtest-upgrade-novnode jdk11 19/160 / test_range_slice
FAILED: dtest-upgrade.upgrade_tests.cql_tests.TestCQLNodes2RF1_Upgrade_current_6_0_x_To_indev_6_0_x.Tests / dtest-upgrade jdk11 135/160 / test_batch_and_list
FAILED: dtest-upgrade.upgrade_tests.cql_tests.TestCQLNodes2RF1_Upgrade_current_6_0_x_To_indev_6_0_x.Tests / dtest-upgrade jdk11 149/160 / test_compact_metadata
FAILED: dtest-upgrade.upgrade_tests.cql_tests.TestCQLNodes2RF1_Upgrade_current_6_0_x_To_indev_6_0_x.Tests / dtest-upgrade jdk11 142/160 / test_composite_partition_key_validation
FAILED: dtest-upgrade.upgrade_tests.cql_tests.TestCQLNodes2RF1_Upgrade_current_6_0_x_To_indev_6_0_x.Tests / dtest-upgrade jdk11 100/160 / test_more_order_by
FAILED: dtest-upgrade.upgrade_tests.cql_tests.TestCQLNodes2RF1_Upgrade_current_6_0_x_To_indev_6_0_x.Tests / dtest-upgrade jdk11 139/160 / test_multi_list_set
FAILED: dtest-upgrade.upgrade_tests.cql_tests.TestCQLNodes2RF1_Upgrade_current_6_0_x_To_indev_6_0_x.Tests / dtest-upgrade jdk11 154/160 / test_ticket_5230
FAILED: dtest-upgrade.upgrade_tests.cql_tests.TestCQLNodes2RF1_Upgrade_indev_4_0_x_To_indev_6_0_x.Tests / dtest-upgrade jdk11 73/160 / test_indexed_with_eq
FAILED: dtest-upgrade.upgrade_tests.cql_tests.TestCQLNodes2RF1_Upgrade_indev_4_0_x_To_indev_6_0_x.Tests / dtest-upgrade jdk11 91/160 / test_range_tombstones_compaction
FAILED: dtest-upgrade.upgrade_tests.cql_tests.TestCQLNodes3RF3_Upgrade_current_6_0_x_To_indev_6_0_x.Tests / dtest-upgrade jdk11 158/160 / test_composite_partition_key_validation
FAILED: dtest-upgrade.upgrade_tests.cql_tests.TestCQLNodes3RF3_Upgrade_current_6_0_x_To_indev_6_0_x.Tests / dtest-upgrade jdk11 142/160 / test_date
FAILED: dtest-upgrade.upgrade_tests.cql_tests.TestCQLNodes3RF3_Upgrade_current_6_0_x_To_indev_6_0_x.Tests / dtest-upgrade jdk11 122/160 / test_deletion
FAILED: dtest-upgrade.upgrade_tests.cql_tests.TestCQLNodes3RF3_Upgrade_current_6_0_x_To_indev_6_0_x.Tests / dtest-upgrade jdk11 109/160 / test_limit_sparse
FAILED: dtest-upgrade.upgrade_tests.cql_tests.TestCQLNodes3RF3_Upgrade_current_6_0_x_To_indev_6_0_x.Tests / dtest-upgrade jdk11 135/160 / test_multi_collection
FAILED: dtest-upgrade.upgrade_tests.cql_tests.TestCQLNodes3RF3_Upgrade_current_6_0_x_To_indev_6_0_x.Tests / dtest-upgrade jdk11 153/160 / test_multiordering
FAILED: dtest-upgrade.upgrade_tests.cql_tests.TestCQLNodes3RF3_Upgrade_current_6_0_x_To_indev_6_0_x.Tests / dtest-upgrade jdk11 136/160 / test_range_query
FAILED: dtest-upgrade.upgrade_tests.cql_tests.TestCQLNodes3RF3_Upgrade_current_6_0_x_To_indev_6_0_x.Tests / dtest-upgrade jdk11 143/160 / test_range_slice
FAILED: dtest-upgrade.upgrade_tests.cql_tests.TestCQLNodes3RF3_Upgrade_current_6_0_x_To_indev_6_0_x.Tests / dtest-upgrade jdk11 129/160 / test_range_tombstones_compaction
FAILED: dtest-upgrade.upgrade_tests.cql_tests.TestCQLNodes3RF3_Upgrade_current_6_0_x_To_indev_6_0_x.Tests / dtest-upgrade jdk11 154/160 / test_returned_null
FAILED: dtest-upgrade.upgrade_tests.cql_tests.TestCQLNodes3RF3_Upgrade_current_6_0_x_To_indev_6_0_x.Tests / dtest-upgrade jdk11 149/160 / test_reversed_compact_multikey
FAILED: dtest.materialized_views_test.TestMaterializedViews.Tests / dtest jdk17 17/64 / test_complex_mv_select_statements
FAILED: dtest.repair_tests.repair_test.TestRepair.Tests / dtest jdk11 11/64 / test_dead_sync_participant
FAILED: org.apache.cassandra.distributed.test.accord.AccordDeleteCommandStoreTest.Tests / jvm-dtest jdk21 7/16 / deleteCommandStoresTest-_jdk21_x86_64
FAILED: org.apache.cassandra.distributed.test.accord.AccordMigrationTest.Tests / jvm-dtest jdk11 4/16 / testPaxosToAccordCAS-_jdk11_x86_64
FAILED: org.apache.cassandra.distributed.test.accord.AccordMigrationTest.Tests / jvm-dtest jdk11 4/16 / testPaxosToAccordSerialRead-_jdk11_x86_64
FAILED: org.apache.cassandra.distributed.test.log.InProgressSequenceCoordinationTest.Tests / jvm-dtest jdk17 2/16 / inProgressSequenceRetryTest-cassandra.testtag_IS_UNDEFINED
FAILED: org.apache.cassandra.fuzz.topology.AccordTopologyMixupTest.Tests / jvm-dtest jdk17 10/16 / test-_jdk17_x86_64
FAILED: org.apache.cassandra.simulator.test.ShortAccordSimulationTest.Tests / simulator-dtest jdk11 1/2 / simulationTest-_jdk11_x86_64
FAILED: org.apache.cassandra.distributed.test.accord.InteropAccordCQLTest.Tests / jvm-dtest jdk11 16/16 / testCASSimulatorLite-_jdk11_x86_64
FAILED: org.apache.cassandra.distributed.test.accord.InteropAccordCQLTest.Tests / jvm-dtest jdk21 16/16 / testCASSimulatorLite-_jdk21_x86_64
FAILED: org.apache.cassandra.transport.DriverBurnTest.Tests / test-burn jdk21 1/4 / measureLargeV6-cassandra.testtag_IS_UNDEFINED
FAILED: org.apache.cassandra.repair.autorepair.AutoRepairParameterizedTest.Tests / test-oa jdk17 16/20 / testRepairShufflesKeyspacesAndTables[repairType=PREVIEW_REPAIRED]-cassandra.testtag_IS_UNDEFINED
FAILED: org.apache.cassandra.simulator.test.EpochStressTest.Tests / simulator-dtest jdk11 2/2 / manyEpochsAndAccordConverges-_jdk11_x86_64
FAILED: org.apache.cassandra.simulator.test.SingleNodeSingleTableASTTest.Tests / simulator-dtest jdk11 1/2 / accordFull-_jdk11_x86_64
FAILED: org.apache.cassandra.simulator.test.SingleNodeSingleTableASTTest.Tests / simulator-dtest jdk11 1/2 / accordMixedReads-_jdk11_x86_64
FAILED: org.apache.cassandra.simulator.test.AccordHarrySimulationTest.Tests / simulator-dtest jdk11 2/2 / test-_jdk11_x86_64
FAILED: org.apache.cassandra.simulator.test.ShortPaxosSimulationTest.Tests / simulator-dtest jdk11 2/2 / selfReconcileTest-cassandra.testtag_IS_UNDEFINED
FAILED: org.apache.cassandra.fuzz.sai.MultiNodeSAITest.Tests / jvm-dtest jdk21 2/16 / indexOnlySaiTest-cassandra.testtag_IS_UNDEFINED
FAILED: org.apache.cassandra.fuzz.sai.MultiNodeSAITest.Tests / jvm-dtest jdk17 2/16 / indexOnlySaiTest-cassandra.testtag_IS_UNDEFINED
-------------------------------------------------------------------------------
For complete test report and logs see https://nightlies.apache.org/cassandra/Cassandra-6.0/77/