You are viewing a plain text version of this content. The canonical link for it is here.
Posted to hdfs-dev@hadoop.apache.org by Apache Jenkins Server <je...@builds.apache.org> on 2011/12/17 01:07:26 UTC
Hadoop-Hdfs-trunk-Commit - Build # 1517 - Still Failing
See https://builds.apache.org/job/Hadoop-Hdfs-trunk-Commit/1517/
###################################################################################
########################## LAST 60 LINES OF THE CONSOLE ###########################
[...truncated 6729 lines...]
A hadoop-project/src
A hadoop-project/src/site
AU hadoop-project/src/site/site.xml
A hadoop-project/src/site/apt
AU hadoop-project/src/site/apt/index.apt.vm
A hadoop-project/src/site/resources
A hadoop-project/src/site/resources/css
AU hadoop-project/src/site/resources/css/site.css
AU hadoop-project/pom.xml
U .
At revision 1215352
AU tar-munge
A commitBuild.sh
A hudsonEnv.sh
A jenkinsSetup
A jenkinsSetup/installTools.sh
AU hudsonBuildHadoopNightly.sh
A buildMR-279Branch.sh
AU hudsonBuildHadoopPatch.sh
AU hudsonBuildHadoopRelease.sh
AU processHadoopPatchEmailRemote.sh
AU hudsonPatchQueueAdmin.sh
AU processHadoopPatchEmail.sh
A README.txt
A test-patch
A test-patch/test-patch.sh
At revision 1215352
no change for http://svn.apache.org/repos/asf/hadoop/nightly since the previous build
No emails were triggered.
[Hadoop-Hdfs-trunk-Commit] $ /bin/bash /tmp/hudson7699323136843076693.sh
60000
[INFO] Scanning for projects...
[ERROR] The build could not read 1 project -> [Help 1]
[ERROR]
[ERROR] The project org.apache.hadoop.contrib:hadoop-hdfs-bkjournal:0.24.0-SNAPSHOT (/home/jenkins/jenkins-slave/workspace/Hadoop-Hdfs-trunk-Commit/trunk/hadoop-hdfs-project/hadoop-hdfs/src/contrib/bkjournal/pom.xml) has 1 error
[ERROR] Non-resolvable parent POM: Could not find artifact org.apache.hadoop:hadoop-project-dist:pom:0.24.0-SNAPSHOT and 'parent.relativePath' points at wrong local POM @ line 17, column 11 -> [Help 2]
[ERROR]
[ERROR] To see the full stack trace of the errors, re-run Maven with the -e switch.
[ERROR] Re-run Maven using the -X switch to enable full debug logging.
[ERROR]
[ERROR] For more information about the errors and possible solutions, please read the following articles:
[ERROR] [Help 1] http://cwiki.apache.org/confluence/display/MAVEN/ProjectBuildingException
[ERROR] [Help 2] http://cwiki.apache.org/confluence/display/MAVEN/UnresolvableModelException
[INFO] Scanning for projects...
[ERROR] The build could not read 1 project -> [Help 1]
[ERROR]
[ERROR] The project org.apache.hadoop.contrib:hadoop-hdfs-bkjournal:0.24.0-SNAPSHOT (/home/jenkins/jenkins-slave/workspace/Hadoop-Hdfs-trunk-Commit/trunk/hadoop-hdfs-project/hadoop-hdfs/src/contrib/bkjournal/pom.xml) has 1 error
[ERROR] Non-resolvable parent POM: Could not find artifact org.apache.hadoop:hadoop-project-dist:pom:0.24.0-SNAPSHOT and 'parent.relativePath' points at wrong local POM @ line 17, column 11 -> [Help 2]
[ERROR]
[ERROR] To see the full stack trace of the errors, re-run Maven with the -e switch.
[ERROR] Re-run Maven using the -X switch to enable full debug logging.
[ERROR]
[ERROR] For more information about the errors and possible solutions, please read the following articles:
[ERROR] [Help 1] http://cwiki.apache.org/confluence/display/MAVEN/ProjectBuildingException
[ERROR] [Help 2] http://cwiki.apache.org/confluence/display/MAVEN/UnresolvableModelException
Build step 'Execute shell' marked build as failure
Updating MAPREDUCE-3387
Email was triggered for: Failure
Sending email for trigger: Failure
###################################################################################
############################## FAILED TESTS (if any) ##############################
No tests ran.
Hadoop-Hdfs-trunk-Commit - Build # 1519 - Still Failing
Posted by Apache Jenkins Server <je...@builds.apache.org>.
See https://builds.apache.org/job/Hadoop-Hdfs-trunk-Commit/1519/
###################################################################################
########################## LAST 60 LINES OF THE CONSOLE ###########################
[...truncated 6730 lines...]
p-project/src/site
AU hadoop-project/src/site/site.xml
A hadoop-project/src/site/apt
AU hadoop-project/src/site/apt/index.apt.vm
A hadoop-project/src/site/resources
A hadoop-project/src/site/resources/css
AU hadoop-project/src/site/resources/css/site.css
AU hadoop-project/pom.xml
U .
At revision 1215364
AU tar-munge
A commitBuild.sh
A hudsonEnv.sh
A jenkinsSetup
A jenkinsSetup/installTools.sh
AU hudsonBuildHadoopNightly.sh
A buildMR-279Branch.sh
AU hudsonBuildHadoopPatch.sh
AU hudsonBuildHadoopRelease.sh
AU processHadoopPatchEmailRemote.sh
AU hudsonPatchQueueAdmin.sh
AU processHadoopPatchEmail.sh
A README.txt
A test-patch
A test-patch/test-patch.sh
At revision 1215364
no change for http://svn.apache.org/repos/asf/hadoop/nightly since the previous build
No emails were triggered.
[Hadoop-Hdfs-trunk-Commit] $ /bin/bash /tmp/hudson685807082242774586.sh
60000
[INFO] Scanning for projects...
[ERROR] The build could not read 1 project -> [Help 1]
[ERROR]
[ERROR] The project org.apache.hadoop.contrib:hadoop-hdfs-bkjournal:0.24.0-SNAPSHOT (/home/jenkins/jenkins-slave/workspace/Hadoop-Hdfs-trunk-Commit/trunk/hadoop-hdfs-project/hadoop-hdfs/src/contrib/bkjournal/pom.xml) has 1 error
[ERROR] Non-resolvable parent POM: Could not find artifact org.apache.hadoop:hadoop-project-dist:pom:0.24.0-SNAPSHOT and 'parent.relativePath' points at wrong local POM @ line 17, column 11 -> [Help 2]
[ERROR]
[ERROR] To see the full stack trace of the errors, re-run Maven with the -e switch.
[ERROR] Re-run Maven using the -X switch to enable full debug logging.
[ERROR]
[ERROR] For more information about the errors and possible solutions, please read the following articles:
[ERROR] [Help 1] http://cwiki.apache.org/confluence/display/MAVEN/ProjectBuildingException
[ERROR] [Help 2] http://cwiki.apache.org/confluence/display/MAVEN/UnresolvableModelException
[INFO] Scanning for projects...
[ERROR] The build could not read 1 project -> [Help 1]
[ERROR]
[ERROR] The project org.apache.hadoop.contrib:hadoop-hdfs-bkjournal:0.24.0-SNAPSHOT (/home/jenkins/jenkins-slave/workspace/Hadoop-Hdfs-trunk-Commit/trunk/hadoop-hdfs-project/hadoop-hdfs/src/contrib/bkjournal/pom.xml) has 1 error
[ERROR] Non-resolvable parent POM: Could not find artifact org.apache.hadoop:hadoop-project-dist:pom:0.24.0-SNAPSHOT and 'parent.relativePath' points at wrong local POM @ line 17, column 11 -> [Help 2]
[ERROR]
[ERROR] To see the full stack trace of the errors, re-run Maven with the -e switch.
[ERROR] Re-run Maven using the -X switch to enable full debug logging.
[ERROR]
[ERROR] For more information about the errors and possible solutions, please read the following articles:
[ERROR] [Help 1] http://cwiki.apache.org/confluence/display/MAVEN/ProjectBuildingException
[ERROR] [Help 2] http://cwiki.apache.org/confluence/display/MAVEN/UnresolvableModelException
Build step 'Execute shell' marked build as failure
Updating HADOOP-7931
Updating HDFS-2694
Email was triggered for: Failure
Sending email for trigger: Failure
###################################################################################
############################## FAILED TESTS (if any) ##############################
No tests ran.
Hadoop-Hdfs-trunk-Commit - Build # 1518 - Still Failing
Posted by Apache Jenkins Server <je...@builds.apache.org>.
See https://builds.apache.org/job/Hadoop-Hdfs-trunk-Commit/1518/
###################################################################################
########################## LAST 60 LINES OF THE CONSOLE ###########################
[...truncated 6729 lines...]
A hadoop-project/src/site
AU hadoop-project/src/site/site.xml
A hadoop-project/src/site/apt
AU hadoop-project/src/site/apt/index.apt.vm
A hadoop-project/src/site/resources
A hadoop-project/src/site/resources/css
AU hadoop-project/src/site/resources/css/site.css
AU hadoop-project/pom.xml
U .
At revision 1215354
Checking out http://svn.apache.org/repos/asf/hadoop/nightly
AU tar-munge
A commitBuild.sh
A hudsonEnv.sh
A jenkinsSetup
A jenkinsSetup/installTools.sh
AU hudsonBuildHadoopNightly.sh
A buildMR-279Branch.sh
AU hudsonBuildHadoopPatch.sh
AU hudsonBuildHadoopRelease.sh
AU processHadoopPatchEmailRemote.sh
AU hudsonPatchQueueAdmin.sh
AU processHadoopPatchEmail.sh
A README.txt
A test-patch
A test-patch/test-patch.sh
At revision 1215354
no change for http://svn.apache.org/repos/asf/hadoop/nightly since the previous build
No emails were triggered.
[Hadoop-Hdfs-trunk-Commit] $ /bin/bash /tmp/hudson5972457766730169924.sh
60000
[INFO] Scanning for projects...
[ERROR] The build could not read 1 project -> [Help 1]
[ERROR]
[ERROR] The project org.apache.hadoop.contrib:hadoop-hdfs-bkjournal:0.24.0-SNAPSHOT (/home/jenkins/jenkins-slave/workspace/Hadoop-Hdfs-trunk-Commit/trunk/hadoop-hdfs-project/hadoop-hdfs/src/contrib/bkjournal/pom.xml) has 1 error
[ERROR] Non-resolvable parent POM: Could not find artifact org.apache.hadoop:hadoop-project-dist:pom:0.24.0-SNAPSHOT and 'parent.relativePath' points at wrong local POM @ line 17, column 11 -> [Help 2]
[ERROR]
[ERROR] To see the full stack trace of the errors, re-run Maven with the -e switch.
[ERROR] Re-run Maven using the -X switch to enable full debug logging.
[ERROR]
[ERROR] For more information about the errors and possible solutions, please read the following articles:
[ERROR] [Help 1] http://cwiki.apache.org/confluence/display/MAVEN/ProjectBuildingException
[ERROR] [Help 2] http://cwiki.apache.org/confluence/display/MAVEN/UnresolvableModelException
[INFO] Scanning for projects...
[ERROR] The build could not read 1 project -> [Help 1]
[ERROR]
[ERROR] The project org.apache.hadoop.contrib:hadoop-hdfs-bkjournal:0.24.0-SNAPSHOT (/home/jenkins/jenkins-slave/workspace/Hadoop-Hdfs-trunk-Commit/trunk/hadoop-hdfs-project/hadoop-hdfs/src/contrib/bkjournal/pom.xml) has 1 error
[ERROR] Non-resolvable parent POM: Could not find artifact org.apache.hadoop:hadoop-project-dist:pom:0.24.0-SNAPSHOT and 'parent.relativePath' points at wrong local POM @ line 17, column 11 -> [Help 2]
[ERROR]
[ERROR] To see the full stack trace of the errors, re-run Maven with the -e switch.
[ERROR] Re-run Maven using the -X switch to enable full debug logging.
[ERROR]
[ERROR] For more information about the errors and possible solutions, please read the following articles:
[ERROR] [Help 1] http://cwiki.apache.org/confluence/display/MAVEN/ProjectBuildingException
[ERROR] [Help 2] http://cwiki.apache.org/confluence/display/MAVEN/UnresolvableModelException
Build step 'Execute shell' marked build as failure
Updating HDFS-2640
Email was triggered for: Failure
Sending email for trigger: Failure
###################################################################################
############################## FAILED TESTS (if any) ##############################
No tests ran.