You are viewing a plain text version of this content. The canonical link for it is here.
Posted to commits@karaf.apache.org by Apache Jenkins Server <je...@builds.apache.org> on 2012/07/13 11:11:58 UTC

Jenkins build became unstable: Karaf-2.2.x #632

See <https://builds.apache.org/job/Karaf-2.2.x/632/changes>


Jenkins build is back to stable : Karaf-2.2.x #636

Posted by Apache Jenkins Server <je...@builds.apache.org>.
See <https://builds.apache.org/job/Karaf-2.2.x/636/changes>


Jenkins build is unstable: Karaf-2.2.x #635

Posted by Apache Jenkins Server <je...@builds.apache.org>.
See <https://builds.apache.org/job/Karaf-2.2.x/635/>


Build failed in Jenkins: Karaf-2.2.x #634

Posted by Apache Jenkins Server <je...@builds.apache.org>.
See <https://builds.apache.org/job/Karaf-2.2.x/634/changes>

Changes:

[jbonofre] [KARAF-1642] Upgrade to exec-maven-plugin 1.2.1

------------------------------------------
[...truncated 3505 lines...]
[debug] execute contextualize
[INFO] [resources:resources {execution: default-resources}]
[INFO] Using 'UTF-8' encoding to copy filtered resources.
[INFO] Copying 2 resources
[INFO] Copying 1 resource
[INFO] Copying 3 resources
[INFO] [compiler:compile {execution: default-compile}]
[INFO] Compiling 3 source files to <https://builds.apache.org/job/Karaf-2.2.x/ws/karaf/admin/management/target/classes>
[debug] execute contextualize
[INFO] [resources:testResources {execution: default-testResources}]
[INFO] Using 'UTF-8' encoding to copy filtered resources.
[INFO] skip non existing resourceDirectory <https://builds.apache.org/job/Karaf-2.2.x/ws/karaf/admin/management/src/test/resources>
[INFO] Copying 3 resources
[INFO] [compiler:testCompile {execution: default-testCompile}]
[INFO] Compiling 2 source files to <https://builds.apache.org/job/Karaf-2.2.x/ws/karaf/admin/management/target/test-classes>
[INFO] [surefire:test {execution: default-test}]
[INFO] Surefire report directory: <https://builds.apache.org/job/Karaf-2.2.x/ws/karaf/admin/management/target/surefire-reports>

-------------------------------------------------------
 T E S T S
-------------------------------------------------------
Running org.apache.karaf.admin.management.internal.AdminServiceMBeanImplTest
Tests run: 11, Failures: 0, Errors: 0, Skipped: 0, Time elapsed: 0.085 sec
Running org.apache.karaf.admin.management.codec.JmxInstanceTest
Tests run: 3, Failures: 0, Errors: 0, Skipped: 0, Time elapsed: 0.003 sec

Results :

Tests run: 14, Failures: 0, Errors: 0, Skipped: 0

[JENKINS] Recording test results
[INFO] [bundle:bundle {execution: default-bundle}]
[INFO] [install:install {execution: default-install}]
[INFO] Installing <https://builds.apache.org/job/Karaf-2.2.x/ws/karaf/admin/management/target/org.apache.karaf.admin.management-2.2.9-SNAPSHOT.jar> to <https://builds.apache.org/job/Karaf-2.2.x/ws/.repository/org/apache/karaf/admin/org.apache.karaf.admin.management/2.2.9-SNAPSHOT/org.apache.karaf.admin.management-2.2.9-SNAPSHOT.jar>
[INFO] [bundle:install {execution: default-install}]
[INFO] Installing org/apache/karaf/admin/org.apache.karaf.admin.management/2.2.9-SNAPSHOT/org.apache.karaf.admin.management-2.2.9-SNAPSHOT.jar
[INFO] Writing OBR metadata
[JENKINS] Archiving <https://builds.apache.org/job/Karaf-2.2.x/ws/karaf/admin/management/pom.xml> to /home/hudson/hudson/jobs/Karaf-2.2.x/modules/org.apache.karaf.admin$org.apache.karaf.admin.management/builds/2012-07-13_15-03-25/archive/org.apache.karaf.admin/org.apache.karaf.admin.management/2.2.9-SNAPSHOT/org.apache.karaf.admin.management-2.2.9-SNAPSHOT.pom
[JENKINS] Archiving <https://builds.apache.org/job/Karaf-2.2.x/ws/karaf/admin/management/target/org.apache.karaf.admin.management-2.2.9-SNAPSHOT.jar> to /home/hudson/hudson/jobs/Karaf-2.2.x/modules/org.apache.karaf.admin$org.apache.karaf.admin.management/builds/2012-07-13_15-03-25/archive/org.apache.karaf.admin/org.apache.karaf.admin.management/2.2.9-SNAPSHOT/org.apache.karaf.admin.management-2.2.9-SNAPSHOT.jar
[INFO] ------------------------------------------------------------------------
[INFO] Building Apache Karaf :: Deployer
[INFO]    task-segment: [clean, install]
[INFO] ------------------------------------------------------------------------
[INFO] [clean:clean {execution: default-clean}]
[INFO] [bundle:cleanVersions {execution: cleanVersions}]
[WARNING] The parameter expression: 'project.build.resources' used in mojo: 'process' has been deprecated. Use 'project.resources' instead.
[INFO] [remote-resources:process {execution: default}]
[INFO] [antrun:run {execution: copy-notice}]
[INFO] Executing tasks

main:
     [copy] Warning: Could not find file <https://builds.apache.org/job/Karaf-2.2.x/ws/karaf/deployer/NOTICE> to copy.
[INFO] Executed tasks
[INFO] [site:attach-descriptor {execution: default-attach-descriptor}]
[INFO] [install:install {execution: default-install}]
[INFO] Installing <https://builds.apache.org/job/Karaf-2.2.x/ws/karaf/deployer/pom.xml> to <https://builds.apache.org/job/Karaf-2.2.x/ws/.repository/org/apache/karaf/deployer/deployer/2.2.9-SNAPSHOT/deployer-2.2.9-SNAPSHOT.pom>
[JENKINS] Archiving <https://builds.apache.org/job/Karaf-2.2.x/ws/karaf/deployer/pom.xml> to /home/hudson/hudson/jobs/Karaf-2.2.x/modules/org.apache.karaf.deployer$deployer/builds/2012-07-13_15-03-26/archive/org.apache.karaf.deployer/deployer/2.2.9-SNAPSHOT/deployer-2.2.9-SNAPSHOT.pom
[INFO] ------------------------------------------------------------------------
[INFO] Building Apache Karaf :: Deployer :: Spring
[INFO]    task-segment: [clean, install]
[INFO] ------------------------------------------------------------------------
[INFO] [clean:clean {execution: default-clean}]
[INFO] [bundle:cleanVersions {execution: cleanVersions}]
[WARNING] The parameter expression: 'project.build.resources' used in mojo: 'process' has been deprecated. Use 'project.resources' instead.
[INFO] [remote-resources:process {execution: default}]
[INFO] [antrun:run {execution: copy-notice}]
[INFO] Executing tasks

main:
     [copy] Copying 1 file to <https://builds.apache.org/job/Karaf-2.2.x/ws/karaf/deployer/spring/target/maven-shared-archive-resources/META-INF>
[INFO] Executed tasks
[debug] execute contextualize
[INFO] [resources:resources {execution: default-resources}]
[INFO] Using 'UTF-8' encoding to copy filtered resources.
[INFO] Copying 4 resources
[INFO] Copying 1 resource
[INFO] Copying 3 resources
[INFO] [compiler:compile {execution: default-compile}]
[INFO] Compiling 3 source files to <https://builds.apache.org/job/Karaf-2.2.x/ws/karaf/deployer/spring/target/classes>
[debug] execute contextualize
[INFO] [resources:testResources {execution: default-testResources}]
[INFO] Using 'UTF-8' encoding to copy filtered resources.
[INFO] Copying 1 resource
[INFO] Copying 3 resources
[INFO] [compiler:testCompile {execution: default-testCompile}]
[INFO] Compiling 1 source file to <https://builds.apache.org/job/Karaf-2.2.x/ws/karaf/deployer/spring/target/test-classes>
[INFO] [surefire:test {execution: default-test}]
[INFO] Surefire report directory: <https://builds.apache.org/job/Karaf-2.2.x/ws/karaf/deployer/spring/target/surefire-reports>

-------------------------------------------------------
 T E S T S
-------------------------------------------------------
Running org.apache.karaf.deployer.spring.SpringDeploymentListenerTest
Manifest-Version: 2
RequireBundle: org.osgi
Import-Package: org.apache.karaf.deployer.spring,org.osgi.service.url
Bundle-ManifestVersion: 2
Spring-Context: *;publish-context:=false;create-asynchronously:=true
Bundle-SymbolicName: test.xml
Header: value
Bundle-Version: 0.0.0
DynamicImport-Package: *

Tests run: 2, Failures: 0, Errors: 0, Skipped: 0, Time elapsed: 0.218 sec

Results :

Tests run: 2, Failures: 0, Errors: 0, Skipped: 0

[JENKINS] Recording test results
[INFO] [bundle:bundle {execution: default-bundle}]
[WARNING] Bundle org.apache.karaf.deployer:org.apache.karaf.deployer.spring:bundle:2.2.9-SNAPSHOT : Unknown directive blueprint.graceperiod: in Bundle-SymbolicName, allowed directives are singleton:,fragment-attachment:,mandatory:, and 'x-*'.
[INFO] [install:install {execution: default-install}]
[INFO] Installing <https://builds.apache.org/job/Karaf-2.2.x/ws/karaf/deployer/spring/target/org.apache.karaf.deployer.spring-2.2.9-SNAPSHOT.jar> to <https://builds.apache.org/job/Karaf-2.2.x/ws/.repository/org/apache/karaf/deployer/org.apache.karaf.deployer.spring/2.2.9-SNAPSHOT/org.apache.karaf.deployer.spring-2.2.9-SNAPSHOT.jar>
[INFO] [bundle:install {execution: default-install}]
[INFO] Installing org/apache/karaf/deployer/org.apache.karaf.deployer.spring/2.2.9-SNAPSHOT/org.apache.karaf.deployer.spring-2.2.9-SNAPSHOT.jar
[INFO] Writing OBR metadata
[JENKINS] Archiving <https://builds.apache.org/job/Karaf-2.2.x/ws/karaf/deployer/spring/pom.xml> to /home/hudson/hudson/jobs/Karaf-2.2.x/modules/org.apache.karaf.deployer$org.apache.karaf.deployer.spring/builds/2012-07-13_15-03-26/archive/org.apache.karaf.deployer/org.apache.karaf.deployer.spring/2.2.9-SNAPSHOT/org.apache.karaf.deployer.spring-2.2.9-SNAPSHOT.pom
[JENKINS] Archiving <https://builds.apache.org/job/Karaf-2.2.x/ws/karaf/deployer/spring/target/org.apache.karaf.deployer.spring-2.2.9-SNAPSHOT.jar> to /home/hudson/hudson/jobs/Karaf-2.2.x/modules/org.apache.karaf.deployer$org.apache.karaf.deployer.spring/builds/2012-07-13_15-03-26/archive/org.apache.karaf.deployer/org.apache.karaf.deployer.spring/2.2.9-SNAPSHOT/org.apache.karaf.deployer.spring-2.2.9-SNAPSHOT.jar
[INFO] ------------------------------------------------------------------------
[INFO] Building Apache Karaf :: Deployer :: Blueprint
[INFO]    task-segment: [clean, install]
[INFO] ------------------------------------------------------------------------
[INFO] [clean:clean {execution: default-clean}]
[INFO] [bundle:cleanVersions {execution: cleanVersions}]
[WARNING] The parameter expression: 'project.build.resources' used in mojo: 'process' has been deprecated. Use 'project.resources' instead.
[INFO] [remote-resources:process {execution: default}]
[INFO] [antrun:run {execution: copy-notice}]
[INFO] Executing tasks

main:
     [copy] Copying 1 file to <https://builds.apache.org/job/Karaf-2.2.x/ws/karaf/deployer/blueprint/target/maven-shared-archive-resources/META-INF>
[INFO] Executed tasks
[debug] execute contextualize
[INFO] [resources:resources {execution: default-resources}]
[INFO] Using 'UTF-8' encoding to copy filtered resources.
[INFO] Copying 4 resources
[INFO] Copying 1 resource
[INFO] Copying 3 resources
[INFO] [compiler:compile {execution: default-compile}]
[INFO] Compiling 3 source files to <https://builds.apache.org/job/Karaf-2.2.x/ws/karaf/deployer/blueprint/target/classes>
[debug] execute contextualize
[INFO] [resources:testResources {execution: default-testResources}]
[INFO] Using 'UTF-8' encoding to copy filtered resources.
[INFO] Copying 2 resources
[INFO] Copying 3 resources
[INFO] [compiler:testCompile {execution: default-testCompile}]
[INFO] Compiling 1 source file to <https://builds.apache.org/job/Karaf-2.2.x/ws/karaf/deployer/blueprint/target/test-classes>
[INFO] [surefire:test {execution: default-test}]
[INFO] Surefire report directory: <https://builds.apache.org/job/Karaf-2.2.x/ws/karaf/deployer/blueprint/target/surefire-reports>

-------------------------------------------------------
 T E S T S
-------------------------------------------------------
Jul 13, 2012 3:06:07 PM hudson.remoting.SynchronousCommandTransport$ReaderThread run
SEVERE: I/O error in channel channel
java.io.InvalidClassException: r [Ljava.lang.StackTraceEleme; enum descriptor has non-zero serialVersionUID: 7959051322423655484
	at java.io.ObjectStreamClass.readNonProxy(ObjectStreamClass.java:620)
	at java.io.ObjectInputStream.readClassDescriptor(ObjectInputStream.java:789)
	at java.io.ObjectInputStream.readNonProxyDesc(ObjectInputStream.java:1534)
	at java.io.ObjectInputStream.readClassDesc(ObjectInputStream.java:1466)
	at java.io.ObjectInputStream.readArray(ObjectInputStream.java:1591)
	at java.io.ObjectInputStream.readObject0(ObjectInputStream.java:1299)
	at java.io.ObjectInputStream.defaultReadFields(ObjectInputStream.java:1910)
	at java.io.ObjectInputStream.readSerialData(ObjectInputStream.java:1834)
	at java.io.ObjectInputStream.readOrdinaryObject(ObjectInputStream.java:1719)
	at java.io.ObjectInputStream.readObject0(ObjectInputStream.java:1305)
	at java.io.ObjectInputStream.defaultReadFields(ObjectInputStream.java:1910)
	at java.io.ObjectInputStream.readSerialData(ObjectInputStream.java:1834)
	at java.io.ObjectInputStream.readOrdinaryObject(ObjectInputStream.java:1719)
	at java.io.ObjectInputStream.readObject0(ObjectInputStream.java:1305)
	at java.io.ObjectInputStream.readObject(ObjectInputStream.java:348)
	at hudson.remoting.Command.readFrom(Command.java:90)
	at hudson.remoting.ClassicCommandTransport.read(ClassicCommandTransport.java:59)
	at hudson.remoting.SynchronousCommandTransport$ReaderThread.run(SynchronousCommandTransport.java:48)

Results :

Tests run: 0, Failures: 0, Errors: 0, Skipped: 0

channel stopped
[INFO] ------------------------------------------------------------------------
[ERROR] FATAL ERROR
[INFO] ------------------------------------------------------------------------
[INFO] null
r [Ljava.lang.StackTraceEleme; enum descriptor has non-zero serialVersionUID: 7959051322423655484
[INFO] ------------------------------------------------------------------------
[INFO] Trace
java.lang.reflect.UndeclaredThrowableException
	at $Proxy2.isArchivingDisabled(Unknown Source)
	at hudson.maven.MavenBuildProxy$Filter.isArchivingDisabled(MavenBuildProxy.java:227)
	at hudson.maven.reporters.MavenArtifact.archive(MavenArtifact.java:223)
	at hudson.maven.reporters.MavenArtifactArchiver.postBuild(MavenArtifactArchiver.java:108)
	at hudson.maven.Maven2Builder.postModule(Maven2Builder.java:127)
	at hudson.maven.MavenBuilder$Adapter.fireLeaveModule(MavenBuilder.java:327)
	at hudson.maven.MavenBuilder$Adapter.postBuild(MavenBuilder.java:285)
	at org.apache.maven.lifecycle.LifecycleExecutorInterceptor.execute(LifecycleExecutorInterceptor.java:68)
	at org.apache.maven.DefaultMaven.doExecute(DefaultMaven.java:328)
	at org.apache.maven.DefaultMaven.execute(DefaultMaven.java:138)
	at org.apache.maven.cli.MavenCli.main(MavenCli.java:362)
	at sun.reflect.NativeMethodAccessorImpl.invoke0(Native Method)
	at sun.reflect.NativeMethodAccessorImpl.invoke(NativeMethodAccessorImpl.java:39)
	at sun.reflect.DelegatingMethodAccessorImpl.invoke(DelegatingMethodAccessorImpl.java:25)
	at java.lang.reflect.Method.invoke(Method.java:592)
	at org.codehaus.classworlds.Launcher.launchEnhanced(Launcher.java:315)
	at org.codehaus.classworlds.Launcher.launch(Launcher.java:255)
	at hudson.maven.agent.Main.launch(Main.java:185)
	at hudson.maven.MavenBuilder.call(MavenBuilder.java:151)
	at hudson.maven.Maven2Builder.call(Maven2Builder.java:77)
	at hudson.maven.Maven2Builder.call(Maven2Builder.java:53)
	at hudson.remoting.UserRequest.perform(UserRequest.java:118)
	at hudson.remoting.UserRequest.perform(UserRequest.java:48)
	at hudson.remoting.Request$2.run(Request.java:326)
	at hudson.remoting.InterceptingExecutorService$1.call(InterceptingExecutorService.java:72)
	at java.util.concurrent.FutureTask$Sync.innerRun(FutureTask.java:269)
	at java.util.concurrent.FutureTask.run(FutureTask.java:123)
	at java.util.concurrent.ThreadPoolExecutor$Worker.runTask(ThreadPoolExecutor.java:651)
	at java.util.concurrent.ThreadPoolExecutor$Worker.run(ThreadPoolExecutor.java:676)
	at java.lang.Thread.run(Thread.java:595)
Caused by: hudson.remoting.ChannelClosedException: channel is already closed
	at hudson.remoting.Channel.send(Channel.java:492)
	at hudson.remoting.Request.call(Request.java:129)
	at hudson.remoting.Channel.call(Channel.java:663)
	at hudson.remoting.RemoteInvocationHandler.invoke(RemoteInvocationHandler.java:158)
	... 30 more
Caused by: java.io.InvalidClassException: r [Ljava.lang.StackTraceEleme; enum descriptor has non-zero serialVersionUID: 7959051322423655484
	at java.io.ObjectStreamClass.readNonProxy(ObjectStreamClass.java:620)
	at java.io.ObjectInputStream.readClassDescriptor(ObjectInputStream.java:789)
	at java.io.ObjectInputStream.readNonProxyDesc(ObjectInputStream.java:1534)
	at java.io.ObjectInputStream.readClassDesc(ObjectInputStream.java:1466)
	at java.io.ObjectInputStream.readArray(ObjectInputStream.java:1591)
	at java.io.ObjectInputStream.readObject0(ObjectInputStream.java:1299)
	at java.io.ObjectInputStream.defaultReadFields(ObjectInputStream.java:1910)
	at java.io.ObjectInputStream.readSerialData(ObjectInputStream.java:1834)
	at java.io.ObjectInputStream.readOrdinaryObject(ObjectInputStream.java:1719)
	at java.io.ObjectInputStream.readObject0(ObjectInputStream.java:1305)
	at java.io.ObjectInputStream.defaultReadFields(ObjectInputStream.java:1910)
	at java.io.ObjectInputStream.readSerialData(ObjectInputStream.java:1834)
	at java.io.ObjectInputStream.readOrdinaryObject(ObjectInputStream.java:1719)
	at java.io.ObjectInputStream.readObject0(ObjectInputStream.java:1305)
	at java.io.ObjectInputStream.readObject(ObjectInputStream.java:348)
	at hudson.remoting.Command.readFrom(Command.java:90)
	at hudson.remoting.ClassicCommandTransport.read(ClassicCommandTransport.java:59)
	at hudson.remoting.SynchronousCommandTransport$ReaderThread.run(SynchronousCommandTransport.java:48)
[INFO] ------------------------------------------------------------------------
[INFO] Total time: 2 minutes 9 seconds
[INFO] Finished at: Fri Jul 13 15:06:07 UTC 2012
ERROR: Maven JVM terminated unexpectedly with exit code 0


Jenkins build is still unstable: Karaf-2.2.x #633

Posted by Apache Jenkins Server <je...@builds.apache.org>.
See <https://builds.apache.org/job/Karaf-2.2.x/changes>