You are viewing a plain text version of this content. The canonical link for it is here.
Posted to dev@aries.apache.org by Timothy Ward <ti...@apache.org> on 2017/03/03 13:05:21 UTC
Re: Build failed in Jenkins: Aries-JPA-Trunk-JDK7 #127
The latest snapshots of the JPA container component now use the publicly published OSGi snapshot API. These are built using JDK 8, but I have added the retrolambda plugin to ensure the built binary is still JDK 1.6 compatible. The build, however, must now use JDK 1.8 because otherwise retrolambda cannot run. I trust that this is an acceptable compromise (i.e. not requiring JDK 8 at runtime for JPA).
Regards,
Tim
> On 3 Mar 2017, at 12:58, Apache Jenkins Server <je...@builds.apache.org> wrote:
>
> See <https://builds.apache.org/job/Aries-JPA-Trunk-JDK7/127/display/redirect?page=changes>
>
> Changes:
>
> [timothyjward] [jpa] Add support for the standard JPA service extender capability
>
> Fixes ARIES-1671
>
> [timothyjward] [jpa] Update to use OSGi API snapshots for the JPA Service
>
> Fixes ARIES-1698
>
> ------------------------------------------
> [...truncated 8.31 KB...]
> [INFO] --- maven-remote-resources-plugin:1.5:process (default) @ org.apache.aries.jpa.api ---
> [INFO]
> [INFO] --- maven-resources-plugin:2.7:resources (default-resources) @ org.apache.aries.jpa.api ---
> [INFO] Using 'UTF-8' encoding to copy filtered resources.
> [INFO] skip non existing resourceDirectory <https://builds.apache.org/job/Aries-JPA-Trunk-JDK7/ws/jpa-api/src/main/resources>
> [INFO] Copying 3 resources
> [INFO]
> [INFO] --- maven-bundle-plugin:3.2.0:cleanVersions (cleanVersions) @ org.apache.aries.jpa.api ---
> [INFO]
> [INFO] --- maven-compiler-plugin:3.3:compile (default-compile) @ org.apache.aries.jpa.api ---
> [INFO] Changes detected - recompiling the module!
> [INFO] Compiling 5 source files to <https://builds.apache.org/job/Aries-JPA-Trunk-JDK7/ws/jpa-api/target/classes>
> [INFO]
> [INFO] --- maven-resources-plugin:2.7:testResources (default-testResources) @ org.apache.aries.jpa.api ---
> [INFO] Using 'UTF-8' encoding to copy filtered resources.
> [INFO] skip non existing resourceDirectory <https://builds.apache.org/job/Aries-JPA-Trunk-JDK7/ws/jpa-api/src/test/resources>
> [INFO] Copying 3 resources
> [INFO]
> [INFO] --- maven-compiler-plugin:3.3:testCompile (default-testCompile) @ org.apache.aries.jpa.api ---
> [INFO] No sources to compile
> [INFO]
> [INFO] --- maven-surefire-plugin:2.18.1:test (default-test) @ org.apache.aries.jpa.api ---
> [JENKINS] Recording test results[INFO]
> [INFO] --- maven-bundle-plugin:3.2.0:bundle (default-bundle) @ org.apache.aries.jpa.api ---
>
> [INFO]
> [INFO] --- maven-site-plugin:3.4:attach-descriptor (attach-descriptor) @ org.apache.aries.jpa.api ---
> [INFO]
> [INFO] --- maven-bundle-plugin:3.2.0:baseline (baseline) @ org.apache.aries.jpa.api ---
> [INFO] Downloading: https://repo.maven.apache.org/maven2/org/apache/aries/jpa/org.apache.aries.jpa.api/2.3.0/org.apache.aries.jpa.api-2.3.0.jar
> [INFO] Downloaded: https://repo.maven.apache.org/maven2/org/apache/aries/jpa/org.apache.aries.jpa.api/2.3.0/org.apache.aries.jpa.api-2.3.0.jar (12 KB at 535.1 KB/sec)
> [INFO] Baseline Report - Generated by Apache Felix Maven Bundle Plugin on 2017-03-03T12:58Z based on Bnd - see http://www.aqute.biz/Bnd/Bnd
> [INFO] Comparing bundle org.apache.aries.jpa.api version 2.7.0-SNAPSHOT to version 2.3.0
> [INFO]
> [INFO] PACKAGE_NAME DELTA CUR_VER BASE_VER REC_VER WARNINGS
> [INFO] = ================================================== ========== ========== ========== ========== ==========
> [INFO] org.apache.aries.jpa.supplier unchanged 1.0.0 1.0.0 1.0.0 -
> [INFO] -----------------------------------------------------------------------------------------------------------
> [INFO] org.apache.aries.jpa.template unchanged 1.0.0 1.0.0 1.0.0 -
> [INFO] -----------------------------------------------------------------------------------------------------------
> [INFO] Baseline analysis complete, 0 error(s), 0 warning(s)
> [INFO]
> [INFO] --- ianal-maven-plugin:1.0-alpha-1:verify-legal-files (default) @ org.apache.aries.jpa.api ---
> [INFO] Checking legal files in: org.apache.aries.jpa.api-2.7.0-SNAPSHOT.jar
> [INFO]
> [INFO] --- maven-install-plugin:2.5.2:install (default-install) @ org.apache.aries.jpa.api ---
> [INFO] Installing <https://builds.apache.org/job/Aries-JPA-Trunk-JDK7/ws/jpa-api/target/org.apache.aries.jpa.api-2.7.0-SNAPSHOT.jar> to /home/jenkins/jenkins-slave/maven-repositories/0/org/apache/aries/jpa/org.apache.aries.jpa.api/2.7.0-SNAPSHOT/org.apache.aries.jpa.api-2.7.0-SNAPSHOT.jar
> [INFO] Installing <https://builds.apache.org/job/Aries-JPA-Trunk-JDK7/ws/jpa-api/pom.xml> to /home/jenkins/jenkins-slave/maven-repositories/0/org/apache/aries/jpa/org.apache.aries.jpa.api/2.7.0-SNAPSHOT/org.apache.aries.jpa.api-2.7.0-SNAPSHOT.pom
> [INFO]
> [INFO] --- maven-bundle-plugin:3.2.0:install (default-install) @ org.apache.aries.jpa.api ---
> [INFO] Local OBR update disabled (enable with -DobrRepository)
> [INFO]
> [INFO] ------------------------------------------------------------------------
> [INFO] Building Apache Aries JPA container 2.7.0-SNAPSHOT
> [INFO] ------------------------------------------------------------------------
> [INFO] Downloading: https://repo.maven.apache.org/maven2/net/orfjackal/retrolambda/retrolambda-maven-plugin/2.5.1/retrolambda-maven-plugin-2.5.1.pom
> [INFO] Downloaded: https://repo.maven.apache.org/maven2/net/orfjackal/retrolambda/retrolambda-maven-plugin/2.5.1/retrolambda-maven-plugin-2.5.1.pom (5 KB at 50.4 KB/sec)
> [INFO] Downloading: https://repo.maven.apache.org/maven2/net/orfjackal/retrolambda/parent/2.5.1/parent-2.5.1.pom
> [INFO] Downloaded: https://repo.maven.apache.org/maven2/net/orfjackal/retrolambda/parent/2.5.1/parent-2.5.1.pom (15 KB at 711.9 KB/sec)
> [INFO] Downloading: https://repo.maven.apache.org/maven2/net/orfjackal/retrolambda/retrolambda-maven-plugin/2.5.1/retrolambda-maven-plugin-2.5.1.jar
> [INFO] Downloaded: https://repo.maven.apache.org/maven2/net/orfjackal/retrolambda/retrolambda-maven-plugin/2.5.1/retrolambda-maven-plugin-2.5.1.jar (21 KB at 160.1 KB/sec)
> [INFO] Downloading: http://repository.apache.org/snapshots/org/osgi/org.osgi.service.jpa/1.1.0-SNAPSHOT/maven-metadata.xml
> [INFO] Downloading: https://oss.sonatype.org/content/repositories/osgi/org/osgi/org.osgi.service.jpa/1.1.0-SNAPSHOT/maven-metadata.xml
> [INFO] Downloaded: https://oss.sonatype.org/content/repositories/osgi/org/osgi/org.osgi.service.jpa/1.1.0-SNAPSHOT/maven-metadata.xml (3 KB at 6.2 KB/sec)
> [INFO] Downloading: https://oss.sonatype.org/content/repositories/osgi/org/osgi/org.osgi.service.jpa/1.1.0-SNAPSHOT/org.osgi.service.jpa-1.1.0-20170302.235044-1.pom
> [INFO] Downloaded: https://oss.sonatype.org/content/repositories/osgi/org/osgi/org.osgi.service.jpa/1.1.0-SNAPSHOT/org.osgi.service.jpa-1.1.0-20170302.235044-1.pom (2 KB at 8.0 KB/sec)
> [INFO] Downloading: https://oss.sonatype.org/content/repositories/osgi/org/osgi/org.osgi.service.jpa/1.1.0-SNAPSHOT/org.osgi.service.jpa-1.1.0-20170302.235044-1.jar
> [INFO] Downloaded: https://oss.sonatype.org/content/repositories/osgi/org/osgi/org.osgi.service.jpa/1.1.0-SNAPSHOT/org.osgi.service.jpa-1.1.0-20170302.235044-1.jar (12 KB at 67.0 KB/sec)
> [INFO]
> [INFO] --- maven-clean-plugin:2.5:clean (default-clean) @ org.apache.aries.jpa.container ---
> [INFO] Deleting <https://builds.apache.org/job/Aries-JPA-Trunk-JDK7/ws/jpa-container/target>
> [INFO]
> [INFO] --- maven-remote-resources-plugin:1.5:process (default) @ org.apache.aries.jpa.container ---
> [INFO]
> [INFO] --- maven-resources-plugin:2.7:resources (default-resources) @ org.apache.aries.jpa.container ---
> [INFO] Using 'UTF-8' encoding to copy filtered resources.
> [INFO] skip non existing resourceDirectory <https://builds.apache.org/job/Aries-JPA-Trunk-JDK7/ws/jpa-container/src/main/resources>
> [INFO] Copying 3 resources
> [INFO]
> [INFO] --- maven-bundle-plugin:3.2.0:cleanVersions (cleanVersions) @ org.apache.aries.jpa.container ---
> [INFO]
> [INFO] --- maven-compiler-plugin:3.3:compile (default-compile) @ org.apache.aries.jpa.container ---
> [INFO] Changes detected - recompiling the module!
> [INFO] Compiling 18 source files to <https://builds.apache.org/job/Aries-JPA-Trunk-JDK7/ws/jpa-container/target/classes>
> [INFO]
> [INFO] --- maven-dependency-plugin:3.0.0:unpack (extract-osgi-api) @ org.apache.aries.jpa.container ---
> [INFO] Configured Artifact: org.osgi:org.osgi.service.jpa:?:jar
> [INFO] Unpacking /home/jenkins/jenkins-slave/maven-repositories/0/org/osgi/org.osgi.service.jpa/1.1.0-SNAPSHOT/org.osgi.service.jpa-1.1.0-SNAPSHOT.jar to <https://builds.apache.org/job/Aries-JPA-Trunk-JDK7/ws/jpa-container/target/classes> with includes "org/osgi/service/jpa/**" and excludes ""
> [INFO]
> [INFO] --- retrolambda-maven-plugin:2.5.1:process-main (backport-osgi-api) @ org.apache.aries.jpa.container ---
> [INFO] Downloading: https://repo.maven.apache.org/maven2/net/orfjackal/retrolambda/retrolambda/2.5.1/retrolambda-2.5.1.pom
> [INFO] Downloaded: https://repo.maven.apache.org/maven2/net/orfjackal/retrolambda/retrolambda/2.5.1/retrolambda-2.5.1.pom (5 KB at 50.3 KB/sec)
> [INFO] Downloading: https://repo.maven.apache.org/maven2/org/twdata/maven/mojo-executor/2.2.0/mojo-executor-2.2.0.pom
> [INFO] Downloaded: https://repo.maven.apache.org/maven2/org/twdata/maven/mojo-executor/2.2.0/mojo-executor-2.2.0.pom (3 KB at 108.3 KB/sec)
> [INFO] Downloading: https://repo.maven.apache.org/maven2/org/twdata/maven/mojo-executor-parent/2.2.0/mojo-executor-parent-2.2.0.pom
> [INFO] Downloaded: https://repo.maven.apache.org/maven2/org/twdata/maven/mojo-executor-parent/2.2.0/mojo-executor-parent-2.2.0.pom (10 KB at 503.0 KB/sec)
> [INFO] Downloading: https://repo.maven.apache.org/maven2/net/orfjackal/retrolambda/retrolambda/2.5.1/retrolambda-2.5.1.jar
> [INFO] Downloading: https://repo.maven.apache.org/maven2/org/twdata/maven/mojo-executor/2.2.0/mojo-executor-2.2.0.jar
> [INFO] Downloaded: https://repo.maven.apache.org/maven2/org/twdata/maven/mojo-executor/2.2.0/mojo-executor-2.2.0.jar (12 KB at 510.9 KB/sec)
> [INFO] Downloaded: https://repo.maven.apache.org/maven2/net/orfjackal/retrolambda/retrolambda/2.5.1/retrolambda-2.5.1.jar (232 KB at 828.4 KB/sec)
> [WARNING] Maven is not running under Java 8 - forced to fork the process
> [INFO] Retrieving Retrolambda 2.5.1
> [INFO] Configured Artifact: net.orfjackal.retrolambda:retrolambda:2.5.1:jar
> [INFO] Copying retrolambda-2.5.1.jar to <https://builds.apache.org/job/Aries-JPA-Trunk-JDK7/ws/jpa-container/target/retrolambda/retrolambda.jar>
> [INFO] Processing classes with Retrolambda
> [INFO] Executing tasks
>
> main:
> [exec] Exception in thread "main" java.lang.UnsupportedClassVersionError: net/orfjackal/retrolambda/PreMain : Unsupported major.minor vFATAL ERROR in native method: processing of -javaagent failed
> [exec] ersion 52.0
> [exec] at java.lang.ClassLoader.defineClass1(Native Method)
> [exec] at java.lang.ClassLoader.defineClass(ClassLoader.java:800)
> [exec] at java.security.SecureClassLoader.defineClass(SecureClassLoader.java:142)
> [exec] at java.net.URLClassLoader.defineClass(URLClassLoader.java:449)
> [exec] at java.net.URLClassLoader.access$100(URLClassLoader.java:71)
> [exec] at java.net.URLClassLoader$1.run(URLClassLoader.java:361)
> [exec] at java.net.URLClassLoader$1.run(URLClassLoader.java:355)
> [exec] at java.security.AccessController.doPrivileged(Native Method)
> [exec] at java.net.URLClassLoader.findClass(URLClassLoader.java:354)
> [exec] at java.lang.ClassLoader.loadClass(ClassLoader.java:425)
> [exec] at sun.misc.Launcher$AppClassLoader.loadClass(Launcher.java:308)
> [exec] at java.lang.ClassLoader.loadClass(ClassLoader.java:358)
> [exec] at sun.instrument.InstrumentationImpl.loadClassAndStartAgent(InstrumentationImpl.java:300)
> [exec] at sun.instrument.InstrumentationImpl.loadClassAndCallPremain(InstrumentationImpl.java:397)
> [INFO] ------------------------------------------------------------------------
> [INFO] Reactor Summary:
> [INFO]
> [INFO] Apache Aries JPA parent ............................ SUCCESS [ 4.134 s]
> [INFO] Apache Aries JPA Container API ..................... SUCCESS [ 3.433 s]
> [INFO] Apache Aries JPA container ......................... FAILURE [ 6.217 s]
> [INFO] Apache Aries JPA support ........................... SKIPPED
> [INFO] Apache Aries JPA blueprint ......................... SKIPPED
> [INFO] Apache Aries JPA Container adapter for EclipseLink . SKIPPED
> [INFO] Apache Aries JPA Repository ........................ SKIPPED
> [INFO] Apache Aries JPA example parent .................... SKIPPED
> [INFO] Apache Aries JPA example tasklist model ............ SKIPPED
> [INFO] Apache Aries JPA example tasklist blueprint ........ SKIPPED
> [INFO] Apache Aries JPA example tasklist DS ............... SKIPPED
> [INFO] Apache Aries JPA features .......................... SKIPPED
> [INFO] Apache Aries JPA itests parent ..................... SKIPPED
> [INFO] Apache Aries JPA test bundle container ............. SKIPPED
> [INFO] Apache Aries JPA test bundle blueprint integration . SKIPPED
> [INFO] Apache Aries JPA test bundle Eclipselink ........... SKIPPED
> [INFO] Apache Aries JPA iTests ............................ SKIPPED
> [INFO] Apache Aries JPA iTests on Karaf ................... SKIPPED
> [INFO] Apache Aries JPA parent ............................ SKIPPED
> [INFO] ------------------------------------------------------------------------
> [INFO] BUILD FAILURE
> [INFO] ------------------------------------------------------------------------
> [INFO] Total time: 22.729 s
> [INFO] Finished at: 2017-03-03T12:58:18+00:00
> [INFO] Final Memory: 45M/448M
> [INFO] ------------------------------------------------------------------------
> Waiting for Jenkins to finish collecting data
> [ERROR] Failed to execute goal net.orfjackal.retrolambda:retrolambda-maven-plugin:2.5.1:process-main (backport-osgi-api) on project org.apache.aries.jpa.container: Unable to execute mojo: An Ant BuildException has occured: exec returned: 134
> [ERROR] around Ant part ...<exec executable="/usr/local/asfpackages/java/jdk1.7.0_80/jre/bin/java" failonerror="true">... @ 4:94 in <https://builds.apache.org/job/Aries-JPA-Trunk-JDK7/ws/jpa-container/target/antrun/build-main.xml>
> [ERROR] -> [Help 1]
> org.apache.maven.lifecycle.LifecycleExecutionException: Failed to execute goal net.orfjackal.retrolambda:retrolambda-maven-plugin:2.5.1:process-main (backport-osgi-api) on project org.apache.aries.jpa.container: Unable to execute mojo
> at org.apache.maven.lifecycle.internal.MojoExecutor.execute(MojoExecutor.java:216)
> at org.apache.maven.lifecycle.internal.MojoExecutor.execute(MojoExecutor.java:153)
> at org.apache.maven.lifecycle.internal.MojoExecutor.execute(MojoExecutor.java:145)
> at org.apache.maven.lifecycle.internal.LifecycleModuleBuilder.buildProject(LifecycleModuleBuilder.java:116)
> at org.apache.maven.lifecycle.internal.LifecycleModuleBuilder.buildProject(LifecycleModuleBuilder.java:80)
> at org.apache.maven.lifecycle.internal.builder.singlethreaded.SingleThreadedBuilder.build(SingleThreadedBuilder.java:51)
> at org.apache.maven.lifecycle.internal.LifecycleStarter.execute(LifecycleStarter.java:120)
> at org.apache.maven.DefaultMaven.doExecute(DefaultMaven.java:355)
> at org.apache.maven.DefaultMaven.execute(DefaultMaven.java:155)
> at org.jvnet.hudson.maven3.launcher.Maven32Launcher.main(Maven32Launcher.java:132)
> at sun.reflect.NativeMethodAccessorImpl.invoke0(Native Method)
> at sun.reflect.NativeMethodAccessorImpl.invoke(NativeMethodAccessorImpl.java:57)
> at sun.reflect.DelegatingMethodAccessorImpl.invoke(DelegatingMethodAccessorImpl.java:43)
> at java.lang.reflect.Method.invoke(Method.java:606)
> at org.codehaus.plexus.classworlds.launcher.Launcher.launchStandard(Launcher.java:330)
> at org.codehaus.plexus.classworlds.launcher.Launcher.launch(Launcher.java:238)
> at jenkins.maven3.agent.Maven32Main.launch(Maven32Main.java:186)
> at sun.reflect.NativeMethodAccessorImpl.invoke0(Native Method)
> at sun.reflect.NativeMethodAccessorImpl.invoke(NativeMethodAccessorImpl.java:57)
> at sun.reflect.DelegatingMethodAccessorImpl.invoke(DelegatingMethodAccessorImpl.java:43)
> at java.lang.reflect.Method.invoke(Method.java:606)
> at hudson.maven.Maven3Builder.call(Maven3Builder.java:139)
> at hudson.maven.Maven3Builder.call(Maven3Builder.java:70)
> at hudson.remoting.UserRequest.perform(UserRequest.java:153)
> at hudson.remoting.UserRequest.perform(UserRequest.java:50)
> at hudson.remoting.Request$2.run(Request.java:336)
> at hudson.remoting.InterceptingExecutorService$1.call(InterceptingExecutorService.java:68)
> at java.util.concurrent.FutureTask.run(FutureTask.java:262)
> at java.util.concurrent.ThreadPoolExecutor.runWorker(ThreadPoolExecutor.java:1145)
> at java.util.concurrent.ThreadPoolExecutor$Worker.run(ThreadPoolExecutor.java:615)
> at java.lang.Thread.run(Thread.java:745)
> Caused by: org.apache.maven.plugin.MojoExecutionException: Unable to execute mojo
> at org.twdata.maven.mojoexecutor.MojoExecutor.executeMojo(MojoExecutor.java:96)
> at net.orfjackal.retrolambda.maven.ProcessClassesMojo.processClassesInForkedProcess(ProcessClassesMojo.java:158)
> at net.orfjackal.retrolambda.maven.ProcessClassesMojo.execute(ProcessClassesMojo.java:112)
> at net.orfjackal.retrolambda.maven.ProcessMainClassesMojo.execute(ProcessMainClassesMojo.java:17)
> at org.apache.maven.plugin.DefaultBuildPluginManager.executeMojo(DefaultBuildPluginManager.java:132)
> at org.apache.maven.lifecycle.internal.MojoExecutor.execute(MojoExecutor.java:208)
> ... 30 more
> Caused by: org.apache.maven.plugin.MojoExecutionException: An Ant BuildException has occured: exec returned: 134
> around Ant part ...<exec executable="/usr/local/asfpackages/java/jdk1.7.0_80/jre/bin/java" failonerror="true">... @ 4:94 in <https://builds.apache.org/job/Aries-JPA-Trunk-JDK7/ws/jpa-container/target/antrun/build-main.xml>
> at org.apache.maven.plugin.antrun.AntRunMojo.execute(AntRunMojo.java:355)
> at org.apache.maven.plugin.DefaultBuildPluginManager.executeMojo(DefaultBuildPluginManager.java:132)
> at org.twdata.maven.mojoexecutor.MojoExecutor.executeMojo(MojoExecutor.java:94)
> ... 35 more
> Caused by: <https://builds.apache.org/job/Aries-JPA-Trunk-JDK7/ws/jpa-container/target/antrun/build-main.xml>:4: exec returned: 134
> at org.apache.tools.ant.taskdefs.ExecTask.runExecute(ExecTask.java:646)
> at org.apache.tools.ant.taskdefs.ExecTask.runExec(ExecTask.java:672)
> at org.apache.tools.ant.taskdefs.ExecTask.execute(ExecTask.java:498)
> at org.apache.tools.ant.UnknownElement.execute(UnknownElement.java:291)
> at sun.reflect.NativeMethodAccessorImpl.invoke0(Native Method)
> at sun.reflect.NativeMethodAccessorImpl.invoke(NativeMethodAccessorImpl.java:57)
> at sun.reflect.DelegatingMethodAccessorImpl.invoke(DelegatingMethodAccessorImpl.java:43)
> at java.lang.reflect.Method.invoke(Method.java:606)
> at org.apache.tools.ant.dispatch.DispatchUtils.execute(DispatchUtils.java:106)
> at org.apache.tools.ant.Task.perform(Task.java:348)
> at org.apache.tools.ant.Target.execute(Target.java:390)
> at org.apache.tools.ant.Target.performTasks(Target.java:411)
> at org.apache.tools.ant.Project.executeSortedTargets(Project.java:1399)
> at org.apache.tools.ant.Project.executeTarget(Project.java:1368)
> at org.apache.maven.plugin.antrun.AntRunMojo.execute(AntRunMojo.java:327)
> ... 37 more
> [ERROR]
> [ERROR] Re-run Maven using the -X switch to enable full debug logging.
> [ERROR]
> [ERROR] For more information about the errors and possible solutions, please read the following articles:
> [ERROR] [Help 1] http://cwiki.apache.org/confluence/display/MAVEN/MojoExecutionException
> [ERROR]
> [ERROR] After correcting the problems, you can resume the build with the command
> [ERROR] mvn <goals> -rf :org.apache.aries.jpa.container
> [JENKINS] Archiving <https://builds.apache.org/job/Aries-JPA-Trunk-JDK7/ws/pom.xml> to org.apache.aries.jpa/org.apache.aries.jpa.main/2.7.0-SNAPSHOT/org.apache.aries.jpa.main-2.7.0-SNAPSHOT.pom
> [JENKINS] Archiving <https://builds.apache.org/job/Aries-JPA-Trunk-JDK7/ws/itests/jpa-container-testbundle-eclipselink/pom.xml> to org.apache.aries.jpa/org.apache.aries.jpa.container.itest.bundle.eclipselink/2.7.0-SNAPSHOT/org.apache.aries.jpa.container.itest.bundle.eclipselink-2.7.0-SNAPSHOT.pom
> [JENKINS] Archiving <https://builds.apache.org/job/Aries-JPA-Trunk-JDK7/ws/jpa-api/pom.xml> to org.apache.aries.jpa/org.apache.aries.jpa.api/2.7.0-SNAPSHOT/org.apache.aries.jpa.api-2.7.0-SNAPSHOT.pom
> [JENKINS] Archiving <https://builds.apache.org/job/Aries-JPA-Trunk-JDK7/ws/jpa-api/target/org.apache.aries.jpa.api-2.7.0-SNAPSHOT.jar> to org.apache.aries.jpa/org.apache.aries.jpa.api/2.7.0-SNAPSHOT/org.apache.aries.jpa.api-2.7.0-SNAPSHOT.jar
> [JENKINS] Archiving <https://builds.apache.org/job/Aries-JPA-Trunk-JDK7/ws/examples/tasklist-blueprint/pom.xml> to org.apache.aries.jpa.example/org.apache.aries.jpa.example.tasklist.blueprint/2.7.0-SNAPSHOT/org.apache.aries.jpa.example.tasklist.blueprint-2.7.0-SNAPSHOT.pom
> [JENKINS] Archiving <https://builds.apache.org/job/Aries-JPA-Trunk-JDK7/ws/jpa-support/pom.xml> to org.apache.aries.jpa/org.apache.aries.jpa.support/2.7.0-SNAPSHOT/org.apache.aries.jpa.support-2.7.0-SNAPSHOT.pom
> [JENKINS] Archiving <https://builds.apache.org/job/Aries-JPA-Trunk-JDK7/ws/examples/tasklist-ds/pom.xml> to org.apache.aries.jpa.example/org.apache.aries.jpa.example.tasklist.ds/2.7.0-SNAPSHOT/org.apache.aries.jpa.example.tasklist.ds-2.7.0-SNAPSHOT.pom
> [JENKINS] Archiving <https://builds.apache.org/job/Aries-JPA-Trunk-JDK7/ws/itests/pom.xml> to org.apache.aries.jpa.itest/org.apache.aries.jpa.itest.parent/2.7.0-SNAPSHOT/org.apache.aries.jpa.itest.parent-2.7.0-SNAPSHOT.pom
> [JENKINS] Archiving <https://builds.apache.org/job/Aries-JPA-Trunk-JDK7/ws/itests/jpa-container-blueprint-testbundle/pom.xml> to org.apache.aries.jpa.itest/org.apache.aries.jpa.container.itest.bundle.blueprint/2.7.0-SNAPSHOT/org.apache.aries.jpa.container.itest.bundle.blueprint-2.7.0-SNAPSHOT.pom
> [JENKINS] Archiving <https://builds.apache.org/job/Aries-JPA-Trunk-JDK7/ws/jpa-container/pom.xml> to org.apache.aries.jpa/org.apache.aries.jpa.container/2.7.0-SNAPSHOT/org.apache.aries.jpa.container-2.7.0-SNAPSHOT.pom
> [JENKINS] Archiving <https://builds.apache.org/job/Aries-JPA-Trunk-JDK7/ws/itests/jpa-container-itest/pom.xml> to org.apache.aries.jpa/org.apache.aries.jpa.container.itest/2.7.0-SNAPSHOT/org.apache.aries.jpa.container.itest-2.7.0-SNAPSHOT.pom
> [JENKINS] Archiving <https://builds.apache.org/job/Aries-JPA-Trunk-JDK7/ws/jpa-repository/pom.xml> to org.apache.aries.jpa/jpa-repository/2.7.0-SNAPSHOT/jpa-repository-2.7.0-SNAPSHOT.pom
> [JENKINS] Archiving <https://builds.apache.org/job/Aries-JPA-Trunk-JDK7/ws/jpa-container-eclipselink-adapter/pom.xml> to org.apache.aries.jpa/org.apache.aries.jpa.eclipselink.adapter/2.7.0-SNAPSHOT/org.apache.aries.jpa.eclipselink.adapter-2.7.0-SNAPSHOT.pom
> [JENKINS] Archiving <https://builds.apache.org/job/Aries-JPA-Trunk-JDK7/ws/examples/tasklist-model/pom.xml> to org.apache.aries.jpa.example/org.apache.aries.jpa.example.tasklist.model/2.7.0-SNAPSHOT/org.apache.aries.jpa.example.tasklist.model-2.7.0-SNAPSHOT.pom
> [JENKINS] Archiving <https://builds.apache.org/job/Aries-JPA-Trunk-JDK7/ws/jpa-features/pom.xml> to org.apache.aries.jpa/jpa-features/2.7.0-SNAPSHOT/jpa-features-2.7.0-SNAPSHOT.pom
> [JENKINS] Archiving <https://builds.apache.org/job/Aries-JPA-Trunk-JDK7/ws/itests/jpa-container-itest-karaf/pom.xml> to org.apache.aries.jpa/org.apache.aries.jpa.container.itest.karaf/2.7.0-SNAPSHOT/org.apache.aries.jpa.container.itest.karaf-2.7.0-SNAPSHOT.pom
> [JENKINS] Archiving <https://builds.apache.org/job/Aries-JPA-Trunk-JDK7/ws/jpa-parent/pom.xml> to org.apache.aries.jpa/org.apache.aries.jpa.parent/2.7.0-SNAPSHOT/org.apache.aries.jpa.parent-2.7.0-SNAPSHOT.pom
> [JENKINS] Archiving <https://builds.apache.org/job/Aries-JPA-Trunk-JDK7/ws/examples/pom.xml> to org.apache.aries.jpa.example/org.apache.aries.jpa.example.parent/2.7.0-SNAPSHOT/org.apache.aries.jpa.example.parent-2.7.0-SNAPSHOT.pom
> [JENKINS] Archiving <https://builds.apache.org/job/Aries-JPA-Trunk-JDK7/ws/itests/jpa-container-testbundle/pom.xml> to org.apache.aries.jpa/org.apache.aries.jpa.container.itest.bundle/2.7.0-SNAPSHOT/org.apache.aries.jpa.container.itest.bundle-2.7.0-SNAPSHOT.pom
> [JENKINS] Archiving <https://builds.apache.org/job/Aries-JPA-Trunk-JDK7/ws/jpa-blueprint/pom.xml> to org.apache.aries.jpa/org.apache.aries.jpa.blueprint/2.7.0-SNAPSHOT/org.apache.aries.jpa.blueprint-2.7.0-SNAPSHOT.pom
> channel stopped