You are viewing a plain text version of this content. The canonical link for it is here.
Posted to builds@beam.apache.org by Apache Jenkins Server <je...@builds.apache.org> on 2021/03/16 18:10:51 UTC
Build failed in Jenkins: beam_PostCommit_Py_VR_Dataflow_V2 #1777
See <https://ci-beam.apache.org/job/beam_PostCommit_Py_VR_Dataflow_V2/1777/display/redirect?page=changes>
Changes:
[suztomo] Preparing vendored gRPC 1.36.0
[aromanenko.dev] [BEAM-11726] Bump Clickhouse version to "0.2.6"
[aromanenko.dev] [BEAM-11764] Bump com.amazonaws version to 1.11.974
[noreply] Create 2.30.0 entry in CHANGES.md (#14250)
[noreply] Replacing use of TFT's deprecated dataset_schema.from_feature_spec
------------------------------------------
[...truncated 37.28 KB...]
Using cached fastavro-1.3.3-cp38-cp38-manylinux2014_x86_64.whl (2.6 MB)
Requirement already satisfied: future<1.0.0,>=0.18.2 in <https://ci-beam.apache.org/job/beam_PostCommit_Py_VR_Dataflow_V2/ws/src/build/gradleenv/-1734967051/lib/python3.8/site-packages> (from apache-beam==2.30.0.dev0) (0.18.2)
Requirement already satisfied: grpcio<2,>=1.29.0 in <https://ci-beam.apache.org/job/beam_PostCommit_Py_VR_Dataflow_V2/ws/src/build/gradleenv/-1734967051/lib/python3.8/site-packages> (from apache-beam==2.30.0.dev0) (1.36.1)
Collecting hdfs<3.0.0,>=2.1.0
Using cached hdfs-2.6.0-py3-none-any.whl (33 kB)
Collecting httplib2<0.18.0,>=0.8
Using cached httplib2-0.17.4-py3-none-any.whl (95 kB)
Collecting mock<3.0.0,>=1.0.1
Using cached mock-2.0.0-py2.py3-none-any.whl (56 kB)
> Task :model:job-management:shadowJar
> Task :model:fn-execution:shadowJar
> Task :sdks:python:test-suites:dataflow:py38:installGcpTest
Collecting numpy<1.21.0,>=1.14.3
Using cached numpy-1.20.1-cp38-cp38-manylinux2010_x86_64.whl (15.4 MB)
Collecting pymongo<4.0.0,>=3.8.0
Using cached pymongo-3.11.3-cp38-cp38-manylinux2014_x86_64.whl (531 kB)
Collecting oauth2client<5,>=2.0.1
Using cached oauth2client-4.1.3-py2.py3-none-any.whl (98 kB)
Requirement already satisfied: protobuf<4,>=3.12.2 in <https://ci-beam.apache.org/job/beam_PostCommit_Py_VR_Dataflow_V2/ws/src/build/gradleenv/-1734967051/lib/python3.8/site-packages> (from apache-beam==2.30.0.dev0) (3.15.6)
Collecting pyarrow<4.0.0,>=0.15.1
Using cached pyarrow-3.0.0-cp38-cp38-manylinux2014_x86_64.whl (20.7 MB)
Collecting pydot<2,>=1.2.0
Using cached pydot-1.4.2-py2.py3-none-any.whl (21 kB)
Collecting python-dateutil<3,>=2.8.0
Using cached python_dateutil-2.8.1-py2.py3-none-any.whl (227 kB)
Collecting pytz>=2018.3
Using cached pytz-2021.1-py2.py3-none-any.whl (510 kB)
Collecting requests<3.0.0,>=2.24.0
Using cached requests-2.25.1-py2.py3-none-any.whl (61 kB)
Collecting typing-extensions<3.8.0,>=3.7.0
Using cached typing_extensions-3.7.4.3-py3-none-any.whl (22 kB)
Collecting freezegun>=0.3.12
Using cached freezegun-1.1.0-py2.py3-none-any.whl (16 kB)
Collecting nose>=1.3.7
Using cached nose-1.3.7-py3-none-any.whl (154 kB)
Collecting nose_xunitmp>=0.4.1
Using cached nose_xunitmp-0.4.1-py3-none-any.whl
Collecting pandas<1.3.0,>=1.0
Using cached pandas-1.2.3-cp38-cp38-manylinux1_x86_64.whl (9.7 MB)
Collecting parameterized<0.8.0,>=0.7.1
Using cached parameterized-0.7.5-py2.py3-none-any.whl (17 kB)
Collecting pyhamcrest!=1.10.0,<2.0.0,>=1.9
Using cached PyHamcrest-1.10.1-py3-none-any.whl (48 kB)
Collecting pyyaml<6.0.0,>=3.12
Using cached PyYAML-5.4.1-cp38-cp38-manylinux1_x86_64.whl (662 kB)
Collecting requests_mock<2.0,>=1.7
Using cached requests_mock-1.8.0-py2.py3-none-any.whl (23 kB)
Collecting tenacity<6.0,>=5.0.2
Using cached tenacity-5.1.5-py2.py3-none-any.whl (34 kB)
Collecting pytest<5.0,>=4.4.0
Using cached pytest-4.6.11-py2.py3-none-any.whl (231 kB)
Collecting pytest-xdist<2,>=1.29.0
Using cached pytest_xdist-1.34.0-py2.py3-none-any.whl (36 kB)
Collecting pytest-timeout<2,>=1.3.3
Using cached pytest_timeout-1.4.2-py2.py3-none-any.whl (10 kB)
Collecting sqlalchemy<2.0,>=1.3
Using cached SQLAlchemy-1.4.0-cp38-cp38-manylinux2014_x86_64.whl (1.5 MB)
Collecting psycopg2-binary<3.0.0,>=2.8.5
Using cached psycopg2_binary-2.8.6-cp38-cp38-manylinux1_x86_64.whl (3.0 MB)
Collecting testcontainers<4.0.0,>=3.0.3
Using cached testcontainers-3.3.0-py2.py3-none-any.whl (29 kB)
Collecting boto3>=1.9
Using cached boto3-1.17.28-py2.py3-none-any.whl (131 kB)
Collecting cachetools<5,>=3.1.0
Using cached cachetools-4.2.1-py3-none-any.whl (12 kB)
Collecting google-apitools<0.5.32,>=0.5.31
Using cached google_apitools-0.5.31-py3-none-any.whl
Collecting google-auth<2,>=1.18.0
Using cached google_auth-1.27.1-py2.py3-none-any.whl (136 kB)
Collecting google-cloud-datastore<2,>=1.7.1
Using cached google_cloud_datastore-1.15.3-py2.py3-none-any.whl (134 kB)
Collecting google-cloud-pubsub<2,>=0.39.0
Using cached google_cloud_pubsub-1.7.0-py2.py3-none-any.whl (144 kB)
Collecting google-cloud-bigquery<2,>=1.6.0
Using cached google_cloud_bigquery-1.28.0-py2.py3-none-any.whl (187 kB)
Collecting google-cloud-core<2,>=0.28.1
Using cached google_cloud_core-1.6.0-py2.py3-none-any.whl (28 kB)
Collecting google-cloud-bigtable<2,>=0.31.1
Using cached google_cloud_bigtable-1.7.0-py2.py3-none-any.whl (267 kB)
Collecting google-cloud-spanner<2,>=1.13.0
Using cached google_cloud_spanner-1.19.1-py2.py3-none-any.whl (255 kB)
Collecting grpcio-gcp<1,>=0.2.2
Using cached grpcio_gcp-0.2.2-py2.py3-none-any.whl (9.4 kB)
Collecting google-cloud-dlp<2,>=0.12.0
Using cached google_cloud_dlp-1.0.0-py2.py3-none-any.whl (169 kB)
Collecting google-cloud-language<2,>=1.3.0
Using cached google_cloud_language-1.3.0-py2.py3-none-any.whl (83 kB)
Collecting google-cloud-videointelligence<2,>=1.8.0
Using cached google_cloud_videointelligence-1.16.1-py2.py3-none-any.whl (183 kB)
Collecting google-cloud-vision<2,>=0.38.0
Using cached google_cloud_vision-1.0.0-py2.py3-none-any.whl (435 kB)
Collecting azure-storage-blob>=12.3.2
Using cached azure_storage_blob-12.8.0-py2.py3-none-any.whl (341 kB)
Collecting azure-core>=1.7.0
Using cached azure_core-1.12.0-py2.py3-none-any.whl (130 kB)
Requirement already satisfied: six>=1.11.0 in <https://ci-beam.apache.org/job/beam_PostCommit_Py_VR_Dataflow_V2/ws/src/build/gradleenv/-1734967051/lib/python3.8/site-packages> (from azure-core>=1.7.0->apache-beam==2.30.0.dev0) (1.15.0)
Collecting msrest>=0.6.18
Using cached msrest-0.6.21-py2.py3-none-any.whl (85 kB)
Collecting cryptography>=2.1.4
Using cached cryptography-3.4.6-cp36-abi3-manylinux2014_x86_64.whl (3.2 MB)
Collecting jmespath<1.0.0,>=0.7.1
Using cached jmespath-0.10.0-py2.py3-none-any.whl (24 kB)
Collecting s3transfer<0.4.0,>=0.3.0
Using cached s3transfer-0.3.4-py2.py3-none-any.whl (69 kB)
Collecting botocore<1.21.0,>=1.20.28
Using cached botocore-1.20.28-py2.py3-none-any.whl (7.3 MB)
Collecting urllib3<1.27,>=1.25.4
Using cached urllib3-1.26.4-py2.py3-none-any.whl (153 kB)
Collecting cffi>=1.12
Using cached cffi-1.14.5-cp38-cp38-manylinux1_x86_64.whl (411 kB)
Collecting pycparser
Using cached pycparser-2.20-py2.py3-none-any.whl (112 kB)
Collecting fasteners>=0.14
Using cached fasteners-0.16-py2.py3-none-any.whl (28 kB)
Requirement already satisfied: setuptools>=40.3.0 in <https://ci-beam.apache.org/job/beam_PostCommit_Py_VR_Dataflow_V2/ws/src/build/gradleenv/-1734967051/lib/python3.8/site-packages> (from google-auth<2,>=1.18.0->apache-beam==2.30.0.dev0) (54.1.2)
Collecting pyasn1-modules>=0.2.1
Using cached pyasn1_modules-0.2.8-py2.py3-none-any.whl (155 kB)
Collecting rsa<5,>=3.1.4
Using cached rsa-4.7.2-py3-none-any.whl (34 kB)
Collecting google-resumable-media<2.0dev,>=0.6.0
Using cached google_resumable_media-1.2.0-py2.py3-none-any.whl (75 kB)
Collecting google-api-core<2.0dev,>=1.21.0
Using cached google_api_core-1.26.1-py2.py3-none-any.whl (92 kB)
Requirement already satisfied: packaging>=14.3 in <https://ci-beam.apache.org/job/beam_PostCommit_Py_VR_Dataflow_V2/ws/src/build/gradleenv/-1734967051/lib/python3.8/site-packages> (from google-api-core<2.0dev,>=1.21.0->google-cloud-bigquery<2,>=1.6.0->apache-beam==2.30.0.dev0) (20.9)
Collecting googleapis-common-protos<2.0dev,>=1.6.0
Using cached googleapis_common_protos-1.53.0-py2.py3-none-any.whl (198 kB)
Collecting grpc-google-iam-v1<0.13dev,>=0.12.3
Using cached grpc_google_iam_v1-0.12.3-py3-none-any.whl
Collecting google-crc32c<2.0dev,>=1.0
Using cached google_crc32c-1.1.2-cp38-cp38-manylinux2014_x86_64.whl (38 kB)
Collecting docopt
Using cached docopt-0.6.2-py2.py3-none-any.whl
Collecting pbr>=0.11
Using cached pbr-5.5.1-py2.py3-none-any.whl (106 kB)
Collecting certifi>=2017.4.17
Using cached certifi-2020.12.5-py2.py3-none-any.whl (147 kB)
Collecting requests-oauthlib>=0.5.0
Using cached requests_oauthlib-1.3.0-py2.py3-none-any.whl (23 kB)
Collecting isodate>=0.6.0
Using cached isodate-0.6.0-py2.py3-none-any.whl (45 kB)
Collecting pyasn1>=0.1.7
Using cached pyasn1-0.4.8-py2.py3-none-any.whl (77 kB)
Requirement already satisfied: pyparsing>=2.0.2 in <https://ci-beam.apache.org/job/beam_PostCommit_Py_VR_Dataflow_V2/ws/src/build/gradleenv/-1734967051/lib/python3.8/site-packages> (from packaging>=14.3->google-api-core<2.0dev,>=1.21.0->google-cloud-bigquery<2,>=1.6.0->apache-beam==2.30.0.dev0) (2.4.7)
Collecting attrs>=17.4.0
Using cached attrs-20.3.0-py2.py3-none-any.whl (49 kB)
Collecting wcwidth
Using cached wcwidth-0.2.5-py2.py3-none-any.whl (30 kB)
Collecting atomicwrites>=1.0
Using cached atomicwrites-1.4.0-py2.py3-none-any.whl (6.8 kB)
Collecting more-itertools>=4.0.0
Using cached more_itertools-8.7.0-py3-none-any.whl (48 kB)
Requirement already satisfied: pluggy<1.0,>=0.12 in <https://ci-beam.apache.org/job/beam_PostCommit_Py_VR_Dataflow_V2/ws/src/build/gradleenv/-1734967051/lib/python3.8/site-packages> (from pytest<5.0,>=4.4.0->apache-beam==2.30.0.dev0) (0.13.1)
Requirement already satisfied: py>=1.5.0 in <https://ci-beam.apache.org/job/beam_PostCommit_Py_VR_Dataflow_V2/ws/src/build/gradleenv/-1734967051/lib/python3.8/site-packages> (from pytest<5.0,>=4.4.0->apache-beam==2.30.0.dev0) (1.10.0)
Collecting pytest-forked
Using cached pytest_forked-1.3.0-py2.py3-none-any.whl (4.7 kB)
Collecting execnet>=1.1
Using cached execnet-1.8.0-py2.py3-none-any.whl (39 kB)
Collecting apipkg>=1.4
Using cached apipkg-1.5-py2.py3-none-any.whl (4.9 kB)
Collecting idna<3,>=2.5
Using cached idna-2.10-py2.py3-none-any.whl (58 kB)
Collecting chardet<5,>=3.0.2
Using cached chardet-4.0.0-py2.py3-none-any.whl (178 kB)
Collecting oauthlib>=3.0.0
Using cached oauthlib-3.1.0-py2.py3-none-any.whl (147 kB)
> Task :sdks:java:core:compileJava
> Task :sdks:python:test-suites:dataflow:py38:installGcpTest
Collecting greenlet!=0.4.17
Using cached greenlet-1.0.0-cp38-cp38-manylinux2010_x86_64.whl (165 kB)
Collecting wrapt
Using cached wrapt-1.12.1-cp38-cp38-linux_x86_64.whl
Collecting deprecation
Using cached deprecation-2.1.0-py2.py3-none-any.whl (11 kB)
Collecting docker
Using cached docker-4.4.4-py2.py3-none-any.whl (147 kB)
Collecting websocket-client>=0.32.0
Using cached websocket_client-0.58.0-py2.py3-none-any.whl (61 kB)
Building wheels for collected packages: apache-beam
Building wheel for apache-beam (setup.py): started
Building wheel for apache-beam (setup.py): finished with status 'done'
Created wheel for apache-beam: filename=apache_beam-2.30.0.dev0-py3-none-any.whl size=2428792 sha256=c4f9a812b277af81e3ab3619deb92ca9432c931bee33cedf1d9e70033e94f620
Stored in directory: /home/jenkins/.cache/pip/wheels/b6/87/96/1ac766db2a10e9c5a29ebf4acf40b6a8cb56a183b9a96b0b6b
Successfully built apache-beam
Installing collected packages: pyasn1, urllib3, rsa, pycparser, pyasn1-modules, idna, chardet, certifi, cachetools, wcwidth, requests, pytz, python-dateutil, oauthlib, more-itertools, jmespath, googleapis-common-protos, google-auth, cffi, attrs, atomicwrites, websocket-client, requests-oauthlib, pytest, pbr, numpy, isodate, httplib2, grpcio-gcp, google-crc32c, google-api-core, docopt, botocore, apipkg, wrapt, typing-extensions, s3transfer, pytest-forked, pymongo, pydot, pyarrow, oauth2client, nose, msrest, mock, hdfs, grpc-google-iam-v1, greenlet, google-resumable-media, google-cloud-core, fasteners, fastavro, execnet, docker, dill, deprecation, cryptography, crcmod, azure-core, avro-python3, testcontainers, tenacity, sqlalchemy, requests-mock, pyyaml, pytest-xdist, pytest-timeout, pyhamcrest, psycopg2-binary, parameterized, pandas, nose-xunitmp, google-cloud-vision, google-cloud-videointelligence, google-cloud-spanner, google-cloud-pubsub, google-cloud-language, google-cloud-dlp, google-cloud-datastore, google-cloud-bigtable, google-cloud-bigquery, google-apitools, freezegun, boto3, azure-storage-blob, apache-beam
Successfully installed apache-beam-2.30.0.dev0 apipkg-1.5 atomicwrites-1.4.0 attrs-20.3.0 avro-python3-1.9.2.1 azure-core-1.12.0 azure-storage-blob-12.8.0 boto3-1.17.28 botocore-1.20.28 cachetools-4.2.1 certifi-2020.12.5 cffi-1.14.5 chardet-4.0.0 crcmod-1.7 cryptography-3.4.6 deprecation-2.1.0 dill-0.3.1.1 docker-4.4.4 docopt-0.6.2 execnet-1.8.0 fastavro-1.3.3 fasteners-0.16 freezegun-1.1.0 google-api-core-1.26.1 google-apitools-0.5.31 google-auth-1.27.1 google-cloud-bigquery-1.28.0 google-cloud-bigtable-1.7.0 google-cloud-core-1.6.0 google-cloud-datastore-1.15.3 google-cloud-dlp-1.0.0 google-cloud-language-1.3.0 google-cloud-pubsub-1.7.0 google-cloud-spanner-1.19.1 google-cloud-videointelligence-1.16.1 google-cloud-vision-1.0.0 google-crc32c-1.1.2 google-resumable-media-1.2.0 googleapis-common-protos-1.53.0 greenlet-1.0.0 grpc-google-iam-v1-0.12.3 grpcio-gcp-0.2.2 hdfs-2.6.0 httplib2-0.17.4 idna-2.10 isodate-0.6.0 jmespath-0.10.0 mock-2.0.0 more-itertools-8.7.0 msrest-0.6.21 nose-1.3.7 nose-xunitmp-0.4.1 numpy-1.20.1 oauth2client-4.1.3 oauthlib-3.1.0 pandas-1.2.3 parameterized-0.7.5 pbr-5.5.1 psycopg2-binary-2.8.6 pyarrow-3.0.0 pyasn1-0.4.8 pyasn1-modules-0.2.8 pycparser-2.20 pydot-1.4.2 pyhamcrest-1.10.1 pymongo-3.11.3 pytest-4.6.11 pytest-forked-1.3.0 pytest-timeout-1.4.2 pytest-xdist-1.34.0 python-dateutil-2.8.1 pytz-2021.1 pyyaml-5.4.1 requests-2.25.1 requests-mock-1.8.0 requests-oauthlib-1.3.0 rsa-4.7.2 s3transfer-0.3.4 sqlalchemy-1.4.0 tenacity-5.1.5 testcontainers-3.3.0 typing-extensions-3.7.4.3 urllib3-1.26.4 wcwidth-0.2.5 websocket-client-0.58.0 wrapt-1.12.1
> Task :sdks:java:core:compileJava
Note: Some input files use or override a deprecated API.
Note: Recompile with -Xlint:deprecation for details.
Note: Some input files use unchecked or unsafe operations.
Note: Recompile with -Xlint:unchecked for details.
> Task :sdks:java:core:classes
> Task :sdks:java:core:shadowJar
> Task :sdks:java:extensions:protobuf:extractIncludeProto
> Task :sdks:java:extensions:protobuf:generateProto NO-SOURCE
> Task :sdks:java:fn-execution:compileJava
warning: Memory constraints are impeding performance; please increase max heap size.
error: warnings found and -Werror specified
> Task :sdks:java:extensions:protobuf:compileJava
> Task :sdks:java:fn-execution:compileJava
Note: <https://ci-beam.apache.org/job/beam_PostCommit_Py_VR_Dataflow_V2/ws/src/sdks/java/fn-execution/src/main/java/org/apache/beam/sdk/fn/data/BeamFnDataSizeBasedBufferingOutboundObserver.java> uses or overrides a deprecated API.
Note: Recompile with -Xlint:deprecation for details.
Note: Some input files use unchecked or unsafe operations.
Note: Recompile with -Xlint:unchecked for details.
1 error
1 warning
> Task :sdks:java:fn-execution:compileJava FAILED
> Task :sdks:java:extensions:protobuf:compileJava
Note: Some input files use or override a deprecated API.
Note: Recompile with -Xlint:deprecation for details.
Note: Some input files use unchecked or unsafe operations.
Note: Recompile with -Xlint:unchecked for details.
> Task :sdks:java:extensions:protobuf:classes
> Task :sdks:java:extensions:protobuf:jar
FAILURE: Build failed with an exception.
* What went wrong:
Execution failed for task ':sdks:java:fn-execution:compileJava'.
> Compilation failed; see the compiler error output for details.
* Try:
Run with --stacktrace option to get the stack trace. Run with --info or --debug option to get more log output. Run with --scan to get full insights.
* Get more help at https://help.gradle.org
Deprecated Gradle features were used in this build, making it incompatible with Gradle 7.0.
Use '--warning-mode all' to show the individual deprecation warnings.
See https://docs.gradle.org/6.8/userguide/command_line_interface.html#sec:command_line_warnings
BUILD FAILED in 10m 16s
56 actionable tasks: 55 executed, 1 from cache
Publishing build scan...
https://gradle.com/s/arwa2pp75nu6k
Build step 'Invoke Gradle script' changed build result to FAILURE
Build step 'Invoke Gradle script' marked build as failure
---------------------------------------------------------------------
To unsubscribe, e-mail: builds-unsubscribe@beam.apache.org
For additional commands, e-mail: builds-help@beam.apache.org
Jenkins build is back to normal : beam_PostCommit_Py_VR_Dataflow_V2
#1778
Posted by Apache Jenkins Server <je...@builds.apache.org>.
See <https://ci-beam.apache.org/job/beam_PostCommit_Py_VR_Dataflow_V2/1778/display/redirect?page=changes>
---------------------------------------------------------------------
To unsubscribe, e-mail: builds-unsubscribe@beam.apache.org
For additional commands, e-mail: builds-help@beam.apache.org