You are viewing a plain text version of this content. The canonical link for it is here.
Posted to dev@lucene.apache.org by Policeman Jenkins Server <je...@thetaphi.de> on 2015/10/10 20:43:57 UTC

[JENKINS] Lucene-Solr-trunk-Solaris (64bit/jdk1.8.0) - Build # 113 - Still Failing!

Build: http://jenkins.thetaphi.de/job/Lucene-Solr-trunk-Solaris/113/
Java: 64bit/jdk1.8.0 -XX:-UseCompressedOops -XX:+UseConcMarkSweepGC

3 tests failed.
FAILED:  junit.framework.TestSuite.org.apache.solr.core.TestLazyCores

Error Message:
ERROR: SolrIndexSearcher opens=51 closes=50

Stack Trace:
java.lang.AssertionError: ERROR: SolrIndexSearcher opens=51 closes=50
	at __randomizedtesting.SeedInfo.seed([9EBD8092C4109BB8]:0)
	at org.junit.Assert.fail(Assert.java:93)
	at org.apache.solr.SolrTestCaseJ4.endTrackingSearchers(SolrTestCaseJ4.java:467)
	at org.apache.solr.SolrTestCaseJ4.afterClass(SolrTestCaseJ4.java:233)
	at sun.reflect.NativeMethodAccessorImpl.invoke0(Native Method)
	at sun.reflect.NativeMethodAccessorImpl.invoke(NativeMethodAccessorImpl.java:62)
	at sun.reflect.DelegatingMethodAccessorImpl.invoke(DelegatingMethodAccessorImpl.java:43)
	at java.lang.reflect.Method.invoke(Method.java:497)
	at com.carrotsearch.randomizedtesting.RandomizedRunner.invoke(RandomizedRunner.java:1665)
	at com.carrotsearch.randomizedtesting.RandomizedRunner$7.evaluate(RandomizedRunner.java:827)
	at com.carrotsearch.randomizedtesting.rules.StatementAdapter.evaluate(StatementAdapter.java:36)
	at com.carrotsearch.randomizedtesting.rules.SystemPropertiesRestoreRule$1.evaluate(SystemPropertiesRestoreRule.java:57)
	at org.apache.lucene.util.AbstractBeforeAfterRule$1.evaluate(AbstractBeforeAfterRule.java:46)
	at com.carrotsearch.randomizedtesting.rules.StatementAdapter.evaluate(StatementAdapter.java:36)
	at org.apache.lucene.util.TestRuleStoreClassName$1.evaluate(TestRuleStoreClassName.java:42)
	at com.carrotsearch.randomizedtesting.rules.NoShadowingOrOverridesOnMethodsRule$1.evaluate(NoShadowingOrOverridesOnMethodsRule.java:39)
	at com.carrotsearch.randomizedtesting.rules.NoShadowingOrOverridesOnMethodsRule$1.evaluate(NoShadowingOrOverridesOnMethodsRule.java:39)
	at com.carrotsearch.randomizedtesting.rules.StatementAdapter.evaluate(StatementAdapter.java:36)
	at com.carrotsearch.randomizedtesting.rules.StatementAdapter.evaluate(StatementAdapter.java:36)
	at com.carrotsearch.randomizedtesting.rules.StatementAdapter.evaluate(StatementAdapter.java:36)
	at org.apache.lucene.util.TestRuleAssertionsRequired$1.evaluate(TestRuleAssertionsRequired.java:54)
	at org.apache.lucene.util.TestRuleMarkFailure$1.evaluate(TestRuleMarkFailure.java:48)
	at org.apache.lucene.util.TestRuleIgnoreAfterMaxFailures$1.evaluate(TestRuleIgnoreAfterMaxFailures.java:65)
	at org.apache.lucene.util.TestRuleIgnoreTestSuites$1.evaluate(TestRuleIgnoreTestSuites.java:55)
	at com.carrotsearch.randomizedtesting.rules.StatementAdapter.evaluate(StatementAdapter.java:36)
	at com.carrotsearch.randomizedtesting.ThreadLeakControl$StatementRunner.run(ThreadLeakControl.java:367)
	at java.lang.Thread.run(Thread.java:745)


FAILED:  junit.framework.TestSuite.org.apache.solr.core.TestLazyCores

Error Message:
1 thread leaked from SUITE scope at org.apache.solr.core.TestLazyCores:     1) Thread[id=483, name=searcherExecutor-185-thread-1, state=WAITING, group=TGRP-TestLazyCores]         at sun.misc.Unsafe.park(Native Method)         at java.util.concurrent.locks.LockSupport.park(LockSupport.java:175)         at java.util.concurrent.locks.AbstractQueuedSynchronizer$ConditionObject.await(AbstractQueuedSynchronizer.java:2039)         at java.util.concurrent.LinkedBlockingQueue.take(LinkedBlockingQueue.java:442)         at java.util.concurrent.ThreadPoolExecutor.getTask(ThreadPoolExecutor.java:1067)         at java.util.concurrent.ThreadPoolExecutor.runWorker(ThreadPoolExecutor.java:1127)         at java.util.concurrent.ThreadPoolExecutor$Worker.run(ThreadPoolExecutor.java:617)         at java.lang.Thread.run(Thread.java:745)

Stack Trace:
com.carrotsearch.randomizedtesting.ThreadLeakError: 1 thread leaked from SUITE scope at org.apache.solr.core.TestLazyCores: 
   1) Thread[id=483, name=searcherExecutor-185-thread-1, state=WAITING, group=TGRP-TestLazyCores]
        at sun.misc.Unsafe.park(Native Method)
        at java.util.concurrent.locks.LockSupport.park(LockSupport.java:175)
        at java.util.concurrent.locks.AbstractQueuedSynchronizer$ConditionObject.await(AbstractQueuedSynchronizer.java:2039)
        at java.util.concurrent.LinkedBlockingQueue.take(LinkedBlockingQueue.java:442)
        at java.util.concurrent.ThreadPoolExecutor.getTask(ThreadPoolExecutor.java:1067)
        at java.util.concurrent.ThreadPoolExecutor.runWorker(ThreadPoolExecutor.java:1127)
        at java.util.concurrent.ThreadPoolExecutor$Worker.run(ThreadPoolExecutor.java:617)
        at java.lang.Thread.run(Thread.java:745)
	at __randomizedtesting.SeedInfo.seed([9EBD8092C4109BB8]:0)


FAILED:  junit.framework.TestSuite.org.apache.solr.core.TestLazyCores

Error Message:
There are still zombie threads that couldn't be terminated:    1) Thread[id=483, name=searcherExecutor-185-thread-1, state=WAITING, group=TGRP-TestLazyCores]         at sun.misc.Unsafe.park(Native Method)         at java.util.concurrent.locks.LockSupport.park(LockSupport.java:175)         at java.util.concurrent.locks.AbstractQueuedSynchronizer$ConditionObject.await(AbstractQueuedSynchronizer.java:2039)         at java.util.concurrent.LinkedBlockingQueue.take(LinkedBlockingQueue.java:442)         at java.util.concurrent.ThreadPoolExecutor.getTask(ThreadPoolExecutor.java:1067)         at java.util.concurrent.ThreadPoolExecutor.runWorker(ThreadPoolExecutor.java:1127)         at java.util.concurrent.ThreadPoolExecutor$Worker.run(ThreadPoolExecutor.java:617)         at java.lang.Thread.run(Thread.java:745)

Stack Trace:
com.carrotsearch.randomizedtesting.ThreadLeakError: There are still zombie threads that couldn't be terminated:
   1) Thread[id=483, name=searcherExecutor-185-thread-1, state=WAITING, group=TGRP-TestLazyCores]
        at sun.misc.Unsafe.park(Native Method)
        at java.util.concurrent.locks.LockSupport.park(LockSupport.java:175)
        at java.util.concurrent.locks.AbstractQueuedSynchronizer$ConditionObject.await(AbstractQueuedSynchronizer.java:2039)
        at java.util.concurrent.LinkedBlockingQueue.take(LinkedBlockingQueue.java:442)
        at java.util.concurrent.ThreadPoolExecutor.getTask(ThreadPoolExecutor.java:1067)
        at java.util.concurrent.ThreadPoolExecutor.runWorker(ThreadPoolExecutor.java:1127)
        at java.util.concurrent.ThreadPoolExecutor$Worker.run(ThreadPoolExecutor.java:617)
        at java.lang.Thread.run(Thread.java:745)
	at __randomizedtesting.SeedInfo.seed([9EBD8092C4109BB8]:0)




Build Log:
[...truncated 20479 lines...]
   [junit4] Suite: org.apache.solr.core.TestLazyCores
   [junit4]   2> Creating dataDir: /export/home/jenkins/workspace/Lucene-Solr-trunk-Solaris/solr/build/solr-core/test/J0/temp/solr.core.TestLazyCores_9EBD8092C4109BB8-001/init-core-data-001
   [junit4]   2> 68873 INFO  (SUITE-TestLazyCores-seed#[9EBD8092C4109BB8]-worker) [    ] o.a.s.SolrTestCaseJ4 Randomized ssl (true) and clientAuth (false)
   [junit4]   2> 68877 INFO  (TEST-TestLazyCores.testLazyLoad-seed#[9EBD8092C4109BB8]) [    ] o.a.s.SolrTestCaseJ4 ###Starting testLazyLoad
   [junit4]   2> 68923 INFO  (TEST-TestLazyCores.testLazyLoad-seed#[9EBD8092C4109BB8]) [    ] o.a.s.c.SolrResourceLoader new SolrResourceLoader for directory: '/export/home/jenkins/workspace/Lucene-Solr-trunk-Solaris/solr/build/solr-core/test/J0/temp/solr.core.TestLazyCores_9EBD8092C4109BB8-001/tempDir-001/'
   [junit4]   2> 68923 INFO  (TEST-TestLazyCores.testLazyLoad-seed#[9EBD8092C4109BB8]) [    ] o.a.s.c.SolrResourceLoader JNDI not configured for solr (NoInitialContextEx)
   [junit4]   2> 68923 INFO  (TEST-TestLazyCores.testLazyLoad-seed#[9EBD8092C4109BB8]) [    ] o.a.s.c.SolrResourceLoader solr home defaulted to 'solr/' (could not find system property or JNDI)
   [junit4]   2> 68939 INFO  (TEST-TestLazyCores.testLazyLoad-seed#[9EBD8092C4109BB8]) [    ] o.a.s.c.CoreContainer New CoreContainer 1541558305
   [junit4]   2> 68939 INFO  (TEST-TestLazyCores.testLazyLoad-seed#[9EBD8092C4109BB8]) [    ] o.a.s.c.CoreContainer Loading cores into CoreContainer [instanceDir=/export/home/jenkins/workspace/Lucene-Solr-trunk-Solaris/solr/build/solr-core/test/J0/temp/solr.core.TestLazyCores_9EBD8092C4109BB8-001/tempDir-001/]
   [junit4]   2> 68939 INFO  (TEST-TestLazyCores.testLazyLoad-seed#[9EBD8092C4109BB8]) [    ] o.a.s.c.CoreContainer loading shared library: /export/home/jenkins/workspace/Lucene-Solr-trunk-Solaris/solr/build/solr-core/test/J0/temp/solr.core.TestLazyCores_9EBD8092C4109BB8-001/tempDir-001/lib
   [junit4]   2> 68939 WARN  (TEST-TestLazyCores.testLazyLoad-seed#[9EBD8092C4109BB8]) [    ] o.a.s.c.SolrResourceLoader Can't find (or read) directory to add to classloader: lib (resolved as: /export/home/jenkins/workspace/Lucene-Solr-trunk-Solaris/solr/build/solr-core/test/J0/temp/solr.core.TestLazyCores_9EBD8092C4109BB8-001/tempDir-001/lib).
   [junit4]   2> 68947 INFO  (TEST-TestLazyCores.testLazyLoad-seed#[9EBD8092C4109BB8]) [    ] o.a.s.h.c.HttpShardHandlerFactory created with socketTimeout : 600000,connTimeout : 60000,maxConnectionsPerHost : 20,maxConnections : 10000,corePoolSize : 0,maximumPoolSize : 2147483647,maxThreadIdleTime : 5,sizeOfQueue : -1,fairnessPolicy : false,useRetries : false,
   [junit4]   2> 68952 INFO  (TEST-TestLazyCores.testLazyLoad-seed#[9EBD8092C4109BB8]) [    ] o.a.s.u.UpdateShardHandler Creating UpdateShardHandler HTTP client with params: socketTimeout=600000&connTimeout=60000&retry=true
   [junit4]   2> 68955 INFO  (TEST-TestLazyCores.testLazyLoad-seed#[9EBD8092C4109BB8]) [    ] o.a.s.c.CoreContainer Allocating transient cache for 4 transient cores
   [junit4]   2> 68956 INFO  (TEST-TestLazyCores.testLazyLoad-seed#[9EBD8092C4109BB8]) [    ] o.a.s.l.LogWatcher SLF4J impl is org.slf4j.impl.Log4jLoggerFactory
   [junit4]   2> 68956 INFO  (TEST-TestLazyCores.testLazyLoad-seed#[9EBD8092C4109BB8]) [    ] o.a.s.l.LogWatcher Registering Log Listener [Log4j (org.slf4j.impl.Log4jLoggerFactory)]
   [junit4]   2> 68956 INFO  (TEST-TestLazyCores.testLazyLoad-seed#[9EBD8092C4109BB8]) [    ] o.a.s.c.CoreContainer Security conf doesn't exist. Skipping setup for authorization module.
   [junit4]   2> 68956 INFO  (TEST-TestLazyCores.testLazyLoad-seed#[9EBD8092C4109BB8]) [    ] o.a.s.c.CoreContainer No authentication plugin used.
   [junit4]   2> 68957 INFO  (TEST-TestLazyCores.testLazyLoad-seed#[9EBD8092C4109BB8]) [    ] o.a.s.c.SolrCore Created CoreDescriptor: {name=collection1, config=solrconfig.xml, transient=false, schema=schema.xml, loadOnStartup=true, configSetProperties=configsetprops.json, instanceDir=collection1, absoluteInstDir=/export/home/jenkins/workspace/Lucene-Solr-trunk-Solaris/solr/build/solr-core/test/J0/temp/solr.core.TestLazyCores_9EBD8092C4109BB8-001/tempDir-001/collection1/, dataDir=data/}
   [junit4]   2> 68958 INFO  (TEST-TestLazyCores.testLazyLoad-seed#[9EBD8092C4109BB8]) [    ] o.a.s.c.SolrCore Created CoreDescriptor: {name=collectionLazy2, config=solrconfig.xml, transient=true, schema=schema.xml, loadOnStartup=true, configSetProperties=configsetprops.json, instanceDir=collection2, absoluteInstDir=/export/home/jenkins/workspace/Lucene-Solr-trunk-Solaris/solr/build/solr-core/test/J0/temp/solr.core.TestLazyCores_9EBD8092C4109BB8-001/tempDir-001/collection2/, dataDir=data/}
   [junit4]   2> 68958 INFO  (TEST-TestLazyCores.testLazyLoad-seed#[9EBD8092C4109BB8]) [    ] o.a.s.c.SolrCore Created CoreDescriptor: {name=collectionLazy3, config=solrconfig.xml, transient=on, schema=schema.xml, loadOnStartup=false, configSetProperties=configsetprops.json, instanceDir=collection3, absoluteInstDir=/export/home/jenkins/workspace/Lucene-Solr-trunk-Solaris/solr/build/solr-core/test/J0/temp/solr.core.TestLazyCores_9EBD8092C4109BB8-001/tempDir-001/collection3/, dataDir=data/}
   [junit4]   2> 68959 INFO  (TEST-TestLazyCores.testLazyLoad-seed#[9EBD8092C4109BB8]) [    ] o.a.s.c.SolrCore Created CoreDescriptor: {name=collectionLazy4, config=solrconfig.xml, transient=false, schema=schema.xml, loadOnStartup=false, configSetProperties=configsetprops.json, instanceDir=collection4, absoluteInstDir=/export/home/jenkins/workspace/Lucene-Solr-trunk-Solaris/solr/build/solr-core/test/J0/temp/solr.core.TestLazyCores_9EBD8092C4109BB8-001/tempDir-001/collection4/, dataDir=data/}
   [junit4]   2> 68959 INFO  (TEST-TestLazyCores.testLazyLoad-seed#[9EBD8092C4109BB8]) [    ] o.a.s.c.SolrCore Created CoreDescriptor: {name=collectionLazy5, config=solrconfig.xml, transient=false, schema=schema.xml, loadOnStartup=true, configSetProperties=configsetprops.json, instanceDir=collection5, absoluteInstDir=/export/home/jenkins/workspace/Lucene-Solr-trunk-Solaris/solr/build/solr-core/test/J0/temp/solr.core.TestLazyCores_9EBD8092C4109BB8-001/tempDir-001/collection5/, dataDir=data/}
   [junit4]   2> 68959 INFO  (TEST-TestLazyCores.testLazyLoad-seed#[9EBD8092C4109BB8]) [    ] o.a.s.c.SolrCore Created CoreDescriptor: {name=collectionLazy6, config=solrconfig.xml, transient=true, schema=schema.xml, loadOnStartup=false, configSetProperties=configsetprops.json, instanceDir=collection6, absoluteInstDir=/export/home/jenkins/workspace/Lucene-Solr-trunk-Solaris/solr/build/solr-core/test/J0/temp/solr.core.TestLazyCores_9EBD8092C4109BB8-001/tempDir-001/collection6/, dataDir=data/}
   [junit4]   2> 68959 INFO  (TEST-TestLazyCores.testLazyLoad-seed#[9EBD8092C4109BB8]) [    ] o.a.s.c.SolrCore Created CoreDescriptor: {name=collectionLazy7, config=solrconfig.xml, transient=true, schema=schema.xml, loadOnStartup=false, configSetProperties=configsetprops.json, instanceDir=collection7, absoluteInstDir=/export/home/jenkins/workspace/Lucene-Solr-trunk-Solaris/solr/build/solr-core/test/J0/temp/solr.core.TestLazyCores_9EBD8092C4109BB8-001/tempDir-001/collection7/, dataDir=data/}
   [junit4]   2> 68960 INFO  (TEST-TestLazyCores.testLazyLoad-seed#[9EBD8092C4109BB8]) [    ] o.a.s.c.SolrCore Created CoreDescriptor: {name=collectionLazy8, config=solrconfig.xml, transient=true, schema=schema.xml, loadOnStartup=false, configSetProperties=configsetprops.json, instanceDir=collection8, absoluteInstDir=/export/home/jenkins/workspace/Lucene-Solr-trunk-Solaris/solr/build/solr-core/test/J0/temp/solr.core.TestLazyCores_9EBD8092C4109BB8-001/tempDir-001/collection8/, dataDir=data/}
   [junit4]   2> 68960 INFO  (TEST-TestLazyCores.testLazyLoad-seed#[9EBD8092C4109BB8]) [    ] o.a.s.c.SolrCore Created CoreDescriptor: {name=collectionLazy9, config=solrconfig.xml, transient=true, schema=schema.xml, loadOnStartup=false, configSetProperties=configsetprops.json, instanceDir=collection9, absoluteInstDir=/export/home/jenkins/workspace/Lucene-Solr-trunk-Solaris/solr/build/solr-core/test/J0/temp/solr.core.TestLazyCores_9EBD8092C4109BB8-001/tempDir-001/collection9/, dataDir=data/}
   [junit4]   2> 68960 INFO  (coreLoadExecutor-157-thread-1) [    ] o.a.s.c.SolrResourceLoader new SolrResourceLoader for directory: '/export/home/jenkins/workspace/Lucene-Solr-trunk-Solaris/solr/build/solr-core/test/J0/temp/solr.core.TestLazyCores_9EBD8092C4109BB8-001/tempDir-001/collection1/'
   [junit4]   2> 68961 INFO  (coreLoadExecutor-157-thread-1) [    ] o.a.s.c.SolrResourceLoader JNDI not configured for solr (NoInitialContextEx)
   [junit4]   2> 68961 INFO  (coreLoadExecutor-157-thread-1) [    ] o.a.s.c.SolrResourceLoader solr home defaulted to 'solr/' (could not find system property or JNDI)
   [junit4]   2> 68962 INFO  (coreLoadExecutor-157-thread-2) [    ] o.a.s.c.SolrResourceLoader new SolrResourceLoader for directory: '/export/home/jenkins/workspace/Lucene-Solr-trunk-Solaris/solr/build/solr-core/test/J0/temp/solr.core.TestLazyCores_9EBD8092C4109BB8-001/tempDir-001/collection2/'
   [junit4]   2> 68962 INFO  (coreLoadExecutor-157-thread-2) [    ] o.a.s.c.SolrResourceLoader JNDI not configured for solr (NoInitialContextEx)
   [junit4]   2> 68962 INFO  (coreLoadExecutor-157-thread-2) [    ] o.a.s.c.SolrResourceLoader solr home defaulted to 'solr/' (could not find system property or JNDI)
   [junit4]   2> 68963 INFO  (coreLoadExecutor-157-thread-3) [    ] o.a.s.c.SolrResourceLoader new SolrResourceLoader for directory: '/export/home/jenkins/workspace/Lucene-Solr-trunk-Solaris/solr/build/solr-core/test/J0/temp/solr.core.TestLazyCores_9EBD8092C4109BB8-001/tempDir-001/collection5/'
   [junit4]   2> 68963 INFO  (coreLoadExecutor-157-thread-3) [    ] o.a.s.c.SolrResourceLoader JNDI not configured for solr (NoInitialContextEx)
   [junit4]   2> 68963 INFO  (coreLoadExecutor-157-thread-3) [    ] o.a.s.c.SolrResourceLoader solr home defaulted to 'solr/' (could not find system property or JNDI)
   [junit4]   2> 68993 INFO  (coreLoadExecutor-157-thread-1) [    ] o.a.s.c.SolrConfig current version of requestparams : -1
   [junit4]   2> 68999 INFO  (coreLoadExecutor-157-thread-1) [    ] o.a.s.c.SolrConfig Using Lucene MatchVersion: 6.0.0
   [junit4]   2> 69022 INFO  (coreLoadExecutor-157-thread-2) [    ] o.a.s.c.SolrConfig current version of requestparams : -1
   [junit4]   2> 69029 INFO  (coreLoadExecutor-157-thread-2) [    ] o.a.s.c.SolrConfig Using Lucene MatchVersion: 6.0.0
   [junit4]   2> 69063 INFO  (coreLoadExecutor-157-thread-2) [    ] o.a.s.c.Config Loaded SolrConfig: solrconfig.xml
   [junit4]   2> 69063 INFO  (coreLoadExecutor-157-thread-3) [    ] o.a.s.c.SolrConfig current version of requestparams : -1
   [junit4]   2> 69063 INFO  (coreLoadExecutor-157-thread-2) [    ] o.a.s.s.IndexSchema Reading Solr Schema from /export/home/jenkins/workspace/Lucene-Solr-trunk-Solaris/solr/build/solr-core/test/J0/temp/solr.core.TestLazyCores_9EBD8092C4109BB8-001/tempDir-001/collection2/conf/schema.xml
   [junit4]   2> 69067 INFO  (coreLoadExecutor-157-thread-3) [    ] o.a.s.c.SolrConfig Using Lucene MatchVersion: 6.0.0
   [junit4]   2> 69088 INFO  (coreLoadExecutor-157-thread-3) [    ] o.a.s.c.Config Loaded SolrConfig: solrconfig.xml
   [junit4]   2> 69089 INFO  (coreLoadExecutor-157-thread-3) [    ] o.a.s.s.IndexSchema Reading Solr Schema from /export/home/jenkins/workspace/Lucene-Solr-trunk-Solaris/solr/build/solr-core/test/J0/temp/solr.core.TestLazyCores_9EBD8092C4109BB8-001/tempDir-001/collection5/conf/schema.xml
   [junit4]   2> 69094 INFO  (coreLoadExecutor-157-thread-3) [    ] o.a.s.s.IndexSchema [collectionLazy5] Schema name=tiny
   [junit4]   2> 69111 INFO  (coreLoadExecutor-157-thread-2) [    ] o.a.s.s.IndexSchema [collectionLazy2] Schema name=tiny
   [junit4]   2> 69113 INFO  (coreLoadExecutor-157-thread-1) [    ] o.a.s.c.Config Loaded SolrConfig: solrconfig.xml
   [junit4]   2> 69114 INFO  (coreLoadExecutor-157-thread-1) [    ] o.a.s.s.IndexSchema Reading Solr Schema from /export/home/jenkins/workspace/Lucene-Solr-trunk-Solaris/solr/build/solr-core/test/J0/temp/solr.core.TestLazyCores_9EBD8092C4109BB8-001/tempDir-001/collection1/conf/schema.xml
   [junit4]   2> 69115 INFO  (coreLoadExecutor-157-thread-2) [    ] o.a.s.s.IndexSchema unique key field: id
   [junit4]   2> 69142 INFO  (coreLoadExecutor-157-thread-2) [    ] o.a.s.c.ConfigSetProperties Did not find ConfigSet properties, assuming default properties: Can't find resource 'configsetprops.json' in classpath or '/export/home/jenkins/workspace/Lucene-Solr-trunk-Solaris/solr/build/solr-core/test/J0/temp/solr.core.TestLazyCores_9EBD8092C4109BB8-001/tempDir-001/collection2/conf'
   [junit4]   2> 69142 INFO  (coreLoadExecutor-157-thread-3) [    ] o.a.s.s.IndexSchema unique key field: id
   [junit4]   2> 69142 INFO  (coreLoadExecutor-157-thread-2) [    ] o.a.s.c.CoreContainer Creating SolrCore 'collectionLazy2' using configuration from instancedir /export/home/jenkins/workspace/Lucene-Solr-trunk-Solaris/solr/build/solr-core/test/J0/temp/solr.core.TestLazyCores_9EBD8092C4109BB8-001/tempDir-001/collection2/
   [junit4]   2> 69142 INFO  (coreLoadExecutor-157-thread-2) [    x:collectionLazy2] o.a.s.c.SolrCore org.apache.solr.core.MockDirectoryFactory
   [junit4]   2> 69142 INFO  (coreLoadExecutor-157-thread-2) [    x:collectionLazy2] o.a.s.c.SolrCore [[collectionLazy2] ] Opening new SolrCore at [/export/home/jenkins/workspace/Lucene-Solr-trunk-Solaris/solr/build/solr-core/test/J0/temp/solr.core.TestLazyCores_9EBD8092C4109BB8-001/tempDir-001/collection2/], dataDir=[null]
   [junit4]   2> 69142 INFO  (coreLoadExecutor-157-thread-2) [    x:collectionLazy2] o.a.s.c.SolrCore JMX monitoring not detected for core: collectionLazy2
   [junit4]   2> 69143 INFO  (coreLoadExecutor-157-thread-2) [    x:collectionLazy2] o.a.s.c.CachingDirectoryFactory return new directory for /export/home/jenkins/workspace/Lucene-Solr-trunk-Solaris/solr/build/solr-core/test/J0/temp/solr.core.TestLazyCores_9EBD8092C4109BB8-001/tempDir-001/collection2/data
   [junit4]   2> 69143 INFO  (coreLoadExecutor-157-thread-2) [    x:collectionLazy2] o.a.s.c.SolrCore New index directory detected: old=null new=/export/home/jenkins/workspace/Lucene-Solr-trunk-Solaris/solr/build/solr-core/test/J0/temp/solr.core.TestLazyCores_9EBD8092C4109BB8-001/tempDir-001/collection2/data/index/
   [junit4]   2> 69143 WARN  (coreLoadExecutor-157-thread-2) [    x:collectionLazy2] o.a.s.c.SolrCore [collectionLazy2] Solr index directory '/export/home/jenkins/workspace/Lucene-Solr-trunk-Solaris/solr/build/solr-core/test/J0/temp/solr.core.TestLazyCores_9EBD8092C4109BB8-001/tempDir-001/collection2/data/index' doesn't exist. Creating new index...
   [junit4]   2> 69143 INFO  (coreLoadExecutor-157-thread-2) [    x:collectionLazy2] o.a.s.c.CachingDirectoryFactory return new directory for /export/home/jenkins/workspace/Lucene-Solr-trunk-Solaris/solr/build/solr-core/test/J0/temp/solr.core.TestLazyCores_9EBD8092C4109BB8-001/tempDir-001/collection2/data/index
   [junit4]   2> 69143 INFO  (coreLoadExecutor-157-thread-3) [    ] o.a.s.c.ConfigSetProperties Did not find ConfigSet properties, assuming default properties: Can't find resource 'configsetprops.json' in classpath or '/export/home/jenkins/workspace/Lucene-Solr-trunk-Solaris/solr/build/solr-core/test/J0/temp/solr.core.TestLazyCores_9EBD8092C4109BB8-001/tempDir-001/collection5/conf'
   [junit4]   2> 69143 INFO  (coreLoadExecutor-157-thread-3) [    ] o.a.s.c.CoreContainer Creating SolrCore 'collectionLazy5' using configuration from instancedir /export/home/jenkins/workspace/Lucene-Solr-trunk-Solaris/solr/build/solr-core/test/J0/temp/solr.core.TestLazyCores_9EBD8092C4109BB8-001/tempDir-001/collection5/
   [junit4]   2> 69143 INFO  (coreLoadExecutor-157-thread-2) [    x:collectionLazy2] o.a.s.u.RandomMergePolicy RandomMergePolicy wrapping class org.apache.lucene.index.TieredMergePolicy: [TieredMergePolicy: maxMergeAtOnce=22, maxMergeAtOnceExplicit=37, maxMergedSegmentMB=75.79296875, floorSegmentMB=0.2412109375, forceMergeDeletesPctAllowed=7.3984261078756655, segmentsPerTier=23.0, maxCFSSegmentSizeMB=8.796093022207999E12, noCFSRatio=0.0
   [junit4]   2> 69144 INFO  (coreLoadExecutor-157-thread-3) [    x:collectionLazy5] o.a.s.c.SolrCore org.apache.solr.core.MockDirectoryFactory
   [junit4]   2> 69144 INFO  (coreLoadExecutor-157-thread-1) [    ] o.a.s.s.IndexSchema [collection1] Schema name=tiny
   [junit4]   2> 69144 INFO  (coreLoadExecutor-157-thread-2) [    x:collectionLazy2] o.a.s.c.SolrCore SolrDeletionPolicy.onCommit: commits: num=1
   [junit4]   2> 	commit{dir=MockDirectoryWrapper(RAMDirectory@199c2433 lockFactory=org.apache.lucene.store.SingleInstanceLockFactory@15a07ff9),segFN=segments_1,generation=1}
   [junit4]   2> 69144 INFO  (coreLoadExecutor-157-thread-2) [    x:collectionLazy2] o.a.s.c.SolrCore newest commit generation = 1
   [junit4]   2> 69146 INFO  (coreLoadExecutor-157-thread-2) [    x:collectionLazy2] o.a.s.c.SolrCore no updateRequestProcessorChain defined as default, creating implicit default
   [junit4]   2> 69147 INFO  (coreLoadExecutor-157-thread-1) [    ] o.a.s.s.IndexSchema unique key field: id
   [junit4]   2> 69148 INFO  (coreLoadExecutor-157-thread-2) [    x:collectionLazy2] o.a.s.h.l.XMLLoader xsltCacheLifetimeSeconds=60
   [junit4]   2> 69148 INFO  (coreLoadExecutor-157-thread-1) [    ] o.a.s.c.ConfigSetProperties Did not find ConfigSet properties, assuming default properties: Can't find resource 'configsetprops.json' in classpath or '/export/home/jenkins/workspace/Lucene-Solr-trunk-Solaris/solr/build/solr-core/test/J0/temp/solr.core.TestLazyCores_9EBD8092C4109BB8-001/tempDir-001/collection1/conf'
   [junit4]   2> 69148 INFO  (coreLoadExecutor-157-thread-1) [    ] o.a.s.c.CoreContainer Creating SolrCore 'collection1' using configuration from instancedir /export/home/jenkins/workspace/Lucene-Solr-trunk-Solaris/solr/build/solr-core/test/J0/temp/solr.core.TestLazyCores_9EBD8092C4109BB8-001/tempDir-001/collection1/
   [junit4]   2> 69148 INFO  (coreLoadExecutor-157-thread-1) [    x:collection1] o.a.s.c.SolrCore org.apache.solr.core.MockDirectoryFactory
   [junit4]   2> 69149 INFO  (coreLoadExecutor-157-thread-1) [    x:collection1] o.a.s.c.SolrCore [[collection1] ] Opening new SolrCore at [/export/home/jenkins/workspace/Lucene-Solr-trunk-Solaris/solr/build/solr-core/test/J0/temp/solr.core.TestLazyCores_9EBD8092C4109BB8-001/tempDir-001/collection1/], dataDir=[null]
   [junit4]   2> 69149 INFO  (coreLoadExecutor-157-thread-1) [    x:collection1] o.a.s.c.SolrCore JMX monitoring not detected for core: collection1
   [junit4]   2> 69149 INFO  (coreLoadExecutor-157-thread-2) [    x:collectionLazy2] o.a.s.h.l.XMLLoader xsltCacheLifetimeSeconds=60
   [junit4]   2> 69149 INFO  (coreLoadExecutor-157-thread-1) [    x:collection1] o.a.s.c.CachingDirectoryFactory return new directory for /export/home/jenkins/workspace/Lucene-Solr-trunk-Solaris/solr/build/solr-core/test/J0/temp/solr.core.TestLazyCores_9EBD8092C4109BB8-001/tempDir-001/collection1/data
   [junit4]   2> 69149 INFO  (coreLoadExecutor-157-thread-1) [    x:collection1] o.a.s.c.SolrCore New index directory detected: old=null new=/export/home/jenkins/workspace/Lucene-Solr-trunk-Solaris/solr/build/solr-core/test/J0/temp/solr.core.TestLazyCores_9EBD8092C4109BB8-001/tempDir-001/collection1/data/index/
   [junit4]   2> 69149 WARN  (coreLoadExecutor-157-thread-1) [    x:collection1] o.a.s.c.SolrCore [collection1] Solr index directory '/export/home/jenkins/workspace/Lucene-Solr-trunk-Solaris/solr/build/solr-core/test/J0/temp/solr.core.TestLazyCores_9EBD8092C4109BB8-001/tempDir-001/collection1/data/index' doesn't exist. Creating new index...
   [junit4]   2> 69151 INFO  (coreLoadExecutor-157-thread-1) [    x:collection1] o.a.s.c.CachingDirectoryFactory return new directory for /export/home/jenkins/workspace/Lucene-Solr-trunk-Solaris/solr/build/solr-core/test/J0/temp/solr.core.TestLazyCores_9EBD8092C4109BB8-001/tempDir-001/collection1/data/index
   [junit4]   2> 69144 INFO  (coreLoadExecutor-157-thread-3) [    x:collectionLazy5] o.a.s.c.SolrCore [[collectionLazy5] ] Opening new SolrCore at [/export/home/jenkins/workspace/Lucene-Solr-trunk-Solaris/solr/build/solr-core/test/J0/temp/solr.core.TestLazyCores_9EBD8092C4109BB8-001/tempDir-001/collection5/], dataDir=[null]
   [junit4]   2> 69152 INFO  (coreLoadExecutor-157-thread-3) [    x:collectionLazy5] o.a.s.c.SolrCore JMX monitoring not detected for core: collectionLazy5
   [junit4]   2> 69152 INFO  (coreLoadExecutor-157-thread-3) [    x:collectionLazy5] o.a.s.c.CachingDirectoryFactory return new directory for /export/home/jenkins/workspace/Lucene-Solr-trunk-Solaris/solr/build/solr-core/test/J0/temp/solr.core.TestLazyCores_9EBD8092C4109BB8-001/tempDir-001/collection5/data
   [junit4]   2> 69153 INFO  (coreLoadExecutor-157-thread-3) [    x:collectionLazy5] o.a.s.c.SolrCore New index directory detected: old=null new=/export/home/jenkins/workspace/Lucene-Solr-trunk-Solaris/solr/build/solr-core/test/J0/temp/solr.core.TestLazyCores_9EBD8092C4109BB8-001/tempDir-001/collection5/data/index/
   [junit4]   2> 69153 WARN  (coreLoadExecutor-157-thread-3) [    x:collectionLazy5] o.a.s.c.SolrCore [collectionLazy5] Solr index directory '/export/home/jenkins/workspace/Lucene-Solr-trunk-Solaris/solr/build/solr-core/test/J0/temp/solr.core.TestLazyCores_9EBD8092C4109BB8-001/tempDir-001/collection5/data/index' doesn't exist. Creating new index...
   [junit4]   2> 69153 INFO  (coreLoadExecutor-157-thread-3) [    x:collectionLazy5] o.a.s.c.CachingDirectoryFactory return new directory for /export/home/jenkins/workspace/Lucene-Solr-trunk-Solaris/solr/build/solr-core/test/J0/temp/solr.core.TestLazyCores_9EBD8092C4109BB8-001/tempDir-001/collection5/data/index
   [junit4]   2> 69153 INFO  (coreLoadExecutor-157-thread-3) [    x:collectionLazy5] o.a.s.u.RandomMergePolicy RandomMergePolicy wrapping class org.apache.lucene.index.TieredMergePolicy: [TieredMergePolicy: maxMergeAtOnce=22, maxMergeAtOnceExplicit=37, maxMergedSegmentMB=75.79296875, floorSegmentMB=0.2412109375, forceMergeDeletesPctAllowed=7.3984261078756655, segmentsPerTier=23.0, maxCFSSegmentSizeMB=8.796093022207999E12, noCFSRatio=0.0
   [junit4]   2> 69151 INFO  (coreLoadExecutor-157-thread-2) [    x:collectionLazy2] o.a.s.h.l.XMLLoader xsltCacheLifetimeSeconds=60
   [junit4]   2> 69158 INFO  (coreLoadExecutor-157-thread-2) [    x:collectionLazy2] o.a.s.h.l.XMLLoader xsltCacheLifetimeSeconds=60
   [junit4]   2> 69160 INFO  (coreLoadExecutor-157-thread-2) [    x:collectionLazy2] o.a.s.c.RequestHandlers Registered paths: /admin/mbeans,/update/csv,/update/json/docs,/admin/luke,/select,/admin/segments,/get,/admin/system,/replication,/admin/properties,/config,/schema,/admin/plugins,/admin/logging,/update/json,/admin/threads,/admin/ping,/update,/admin/file
   [junit4]   2> 69160 INFO  (coreLoadExecutor-157-thread-2) [    x:collectionLazy2] o.a.s.c.SolrCore Using default statsCache cache: org.apache.solr.search.stats.LocalStatsCache
   [junit4]   2> 69160 INFO  (coreLoadExecutor-157-thread-2) [    x:collectionLazy2] o.a.s.c.SolrCore Hard AutoCommit: disabled
   [junit4]   2> 69160 INFO  (coreLoadExecutor-157-thread-2) [    x:collectionLazy2] o.a.s.c.SolrCore Soft AutoCommit: disabled
   [junit4]   2> 69161 INFO  (coreLoadExecutor-157-thread-2) [    x:collectionLazy2] o.a.s.u.RandomMergePolicy RandomMergePolicy wrapping class org.apache.lucene.index.LogDocMergePolicy: [LogDocMergePolicy: minMergeSize=1000, mergeFactor=23, maxMergeSize=9223372036854775807, maxMergeSizeForForcedMerge=9223372036854775807, calibrateSizeByDeletes=false, maxMergeDocs=2147483647, maxCFSSegmentSizeMB=8.796093022207999E12, noCFSRatio=1.0]
   [junit4]   2> 69161 INFO  (coreLoadExecutor-157-thread-2) [    x:collectionLazy2] o.a.s.c.SolrCore SolrDeletionPolicy.onInit: commits: num=1
   [junit4]   2> 	commit{dir=MockDirectoryWrapper(RAMDirectory@199c2433 lockFactory=org.apache.lucene.store.SingleInstanceLockFactory@15a07ff9),segFN=segments_1,generation=1}
   [junit4]   2> 69161 INFO  (coreLoadExecutor-157-thread-2) [    x:collectionLazy2] o.a.s.c.SolrCore newest commit generation = 1
   [junit4]   2> 69161 INFO  (coreLoadExecutor-157-thread-2) [    x:collectionLazy2] o.a.s.s.SolrIndexSearcher Opening Searcher@757c1832[collectionLazy2] main
   [junit4]   2> 69162 INFO  (coreLoadExecutor-157-thread-2) [    x:collectionLazy2] o.a.s.r.ManagedResourceStorage File-based storage initialized to use dir: /export/home/jenkins/workspace/Lucene-Solr-trunk-Solaris/solr/build/solr-core/test/J0/temp/solr.core.TestLazyCores_9EBD8092C4109BB8-001/tempDir-001/collection2/conf
   [junit4]   2> 69162 INFO  (coreLoadExecutor-157-thread-2) [    x:collectionLazy2] o.a.s.r.RestManager Initializing RestManager with initArgs: {storageDir=/export/home/jenkins/workspace/Lucene-Solr-trunk-Solaris/solr/build/solr-core/test/J0/temp/solr.core.TestLazyCores_9EBD8092C4109BB8-001/tempDir-001/collection2/conf}
   [junit4]   2> 69162 INFO  (coreLoadExecutor-157-thread-2) [    x:collectionLazy2] o.a.s.r.ManagedResourceStorage Reading _rest_managed.json using file:dir=/export/home/jenkins/workspace/Lucene-Solr-trunk-Solaris/solr/build/solr-core/test/J0/temp/solr.core.TestLazyCores_9EBD8092C4109BB8-001/tempDir-001/collection2/conf
   [junit4]   2> 69162 INFO  (coreLoadExecutor-157-thread-2) [    x:collectionLazy2] o.a.s.r.RestManager Initializing 0 registered ManagedResources
   [junit4]   2> 69162 INFO  (coreLoadExecutor-157-thread-2) [    x:collectionLazy2] o.a.s.h.ReplicationHandler Commits will be reserved for  10000
   [junit4]   2> 69163 INFO  (searcherExecutor-158-thread-1-processing-x:collectionLazy2) [    x:collectionLazy2] o.a.s.c.SolrCore [collectionLazy2] Registered new searcher Searcher@757c1832[collectionLazy2] main{ExitableDirectoryReader(UninvertingDirectoryReader())}
   [junit4]   2> 69163 INFO  (coreLoadExecutor-157-thread-2) [    x:collectionLazy2] o.a.s.c.CoreContainer Opening transient core collectionLazy2
   [junit4]   2> 69163 INFO  (coreLoadExecutor-157-thread-2) [    x:collectionLazy2] o.a.s.c.CoreContainer registering core: collectionLazy2
   [junit4]   2> 69149 INFO  (OldIndexDirectoryCleanupThreadForCore-collectionLazy2) [    x:collectionLazy2] o.a.s.c.SolrCore Looking for old index directories to cleanup for core collectionLazy2 in /export/home/jenkins/workspace/Lucene-Solr-trunk-Solaris/solr/build/solr-core/test/J0/temp/solr.core.TestLazyCores_9EBD8092C4109BB8-001/tempDir-001/collection2/data/
   [junit4]   2> 69163 WARN  (OldIndexDirectoryCleanupThreadForCore-collectionLazy2) [    x:collectionLazy2] o.a.s.c.DirectoryFactory /export/home/jenkins/workspace/Lucene-Solr-trunk-Solaris/solr/build/solr-core/test/J0/temp/solr.core.TestLazyCores_9EBD8092C4109BB8-001/tempDir-001/collection2/data/ does not point to a valid data directory; skipping clean-up of old index directories.
   [junit4]   2> 69165 INFO  (coreLoadExecutor-157-thread-3) [    x:collectionLazy5] o.a.s.c.SolrCore SolrDeletionPolicy.onCommit: commits: num=1
   [junit4]   2> 	commit{dir=MockDirectoryWrapper(RAMDirectory@63350209 lockFactory=org.apache.lucene.store.SingleInstanceLockFactory@69cc3309),segFN=segments_1,generation=1}
   [junit4]   2> 69165 INFO  (coreLoadExecutor-157-thread-3) [    x:collectionLazy5] o.a.s.c.SolrCore newest commit generation = 1
   [junit4]   2> 69166 INFO  (OldIndexDirectoryCleanupThreadForCore-collectionLazy5) [    x:collectionLazy5] o.a.s.c.SolrCore Looking for old index directories to cleanup for core collectionLazy5 in /export/home/jenkins/workspace/Lucene-Solr-trunk-Solaris/solr/build/solr-core/test/J0/temp/solr.core.TestLazyCores_9EBD8092C4109BB8-001/tempDir-001/collection5/data/
   [junit4]   2> 69168 INFO  (coreLoadExecutor-157-thread-1) [    x:collection1] o.a.s.u.RandomMergePolicy RandomMergePolicy wrapping class org.apache.lucene.index.TieredMergePolicy: [TieredMergePolicy: maxMergeAtOnce=22, maxMergeAtOnceExplicit=37, maxMergedSegmentMB=75.79296875, floorSegmentMB=0.2412109375, forceMergeDeletesPctAllowed=7.3984261078756655, segmentsPerTier=23.0, maxCFSSegmentSizeMB=8.796093022207999E12, noCFSRatio=0.0
   [junit4]   2> 69169 INFO  (coreLoadExecutor-157-thread-3) [    x:collectionLazy5] o.a.s.c.SolrCore no updateRequestProcessorChain defined as default, creating implicit default
   [junit4]   2> 69169 INFO  (coreLoadExecutor-157-thread-1) [    x:collection1] o.a.s.c.SolrCore SolrDeletionPolicy.onCommit: commits: num=1
   [junit4]   2> 	commit{dir=MockDirectoryWrapper(RAMDirectory@674d0567 lockFactory=org.apache.lucene.store.SingleInstanceLockFactory@5df8d79e),segFN=segments_1,generation=1}
   [junit4]   2> 69169 INFO  (coreLoadExecutor-157-thread-1) [    x:collection1] o.a.s.c.SolrCore newest commit generation = 1
   [junit4]   2> 69170 INFO  (OldIndexDirectoryCleanupThreadForCore-collection1) [    x:collection1] o.a.s.c.SolrCore Looking for old index directories to cleanup for core collection1 in /export/home/jenkins/workspace/Lucene-Solr-trunk-Solaris/solr/build/solr-core/test/J0/temp/solr.core.TestLazyCores_9EBD8092C4109BB8-001/tempDir-001/collection1/data/
   [junit4]   2> 69170 INFO  (coreLoadExecutor-157-thread-3) [    x:collectionLazy5] o.a.s.h.l.XMLLoader xsltCacheLifetimeSeconds=60
   [junit4]   2> 69170 WARN  (OldIndexDirectoryCleanupThreadForCore-collection1) [    x:collection1] o.a.s.c.DirectoryFactory /export/home/jenkins/workspace/Lucene-Solr-trunk-Solaris/solr/build/solr-core/test/J0/temp/solr.core.TestLazyCores_9EBD8092C4109BB8-001/tempDir-001/collection1/data/ does not point to a valid data directory; skipping clean-up of old index directories.
   [junit4]   2> 69171 INFO  (coreLoadExecutor-157-thread-3) [    x:collectionLazy5] o.a.s.h.l.XMLLoader xsltCacheLifetimeSeconds=60
   [junit4]   2> 69167 WARN  (OldIndexDirectoryCleanupThreadForCore-collectionLazy5) [    x:collectionLazy5] o.a.s.c.DirectoryFactory /export/home/jenkins/workspace/Lucene-Solr-trunk-Solaris/solr/build/solr-core/test/J0/temp/solr.core.TestLazyCores_9EBD8092C4109BB8-001/tempDir-001/collection5/data/ does not point to a valid data directory; skipping clean-up of old index directories.
   [junit4]   2> 69177 INFO  (coreLoadExecutor-157-thread-3) [    x:collectionLazy5] o.a.s.h.l.XMLLoader xsltCacheLifetimeSeconds=60
   [junit4]   2> 69178 INFO  (coreLoadExecutor-157-thread-3) [    x:collectionLazy5] o.a.s.h.l.XMLLoader xsltCacheLifetimeSeconds=60
   [junit4]   2> 69184 INFO  (coreLoadExecutor-157-thread-3) [    x:collectionLazy5] o.a.s.c.RequestHandlers Registered paths: /admin/mbeans,/update/csv,/update/json/docs,/admin/luke,/select,/admin/segments,/get,/admin/system,/replication,/admin/properties,/config,/schema,/admin/plugins,/admin/logging,/update/json,/admin/threads,/admin/ping,/update,/admin/file
   [junit4]   2> 69185 INFO  (coreLoadExecutor-157-thread-3) [    x:collectionLazy5] o.a.s.c.SolrCore Using default statsCache cache: org.apache.solr.search.stats.LocalStatsCache
   [junit4]   2> 69186 INFO  (coreLoadExecutor-157-thread-3) [    x:collectionLazy5] o.a.s.c.SolrCore Hard AutoCommit: disabled
   [junit4]   2> 69186 INFO  (coreLoadExecutor-157-thread-3) [    x:collectionLazy5] o.a.s.c.SolrCore Soft AutoCommit: disabled
   [junit4]   2> 69186 INFO  (coreLoadExecutor-157-thread-3) [    x:collectionLazy5] o.a.s.u.RandomMergePolicy RandomMergePolicy wrapping class org.apache.lucene.index.LogDocMergePolicy: [LogDocMergePolicy: minMergeSize=1000, mergeFactor=23, maxMergeSize=9223372036854775807, maxMergeSizeForForcedMerge=9223372036854775807, calibrateSizeByDeletes=false, maxMergeDocs=2147483647, maxCFSSegmentSizeMB=8.796093022207999E12, noCFSRatio=1.0]
   [junit4]   2> 69187 INFO  (coreLoadExecutor-157-thread-3) [    x:collectionLazy5] o.a.s.c.SolrCore SolrDeletionPolicy.onInit: commits: num=1
   [junit4]   2> 	commit{dir=MockDirectoryWrapper(RAMDirectory@63350209 lockFactory=org.apache.lucene.store.SingleInstanceLockFactory@69cc3309),segFN=segments_1,generation=1}
   [junit4]   2> 69187 INFO  (coreLoadExecutor-157-thread-3) [    x:collectionLazy5] o.a.s.c.SolrCore newest commit generation = 1
   [junit4]   2> 69188 INFO  (coreLoadExecutor-157-thread-3) [    x:collectionLazy5] o.a.s.s.SolrIndexSearcher Opening Searcher@1f1c1811[collectionLazy5] main
   [junit4]   2> 69188 INFO  (coreLoadExecutor-157-thread-3) [    x:collectionLazy5] o.a.s.r.ManagedResourceStorage File-based storage initialized to use dir: /export/home/jenkins/workspace/Lucene-Solr-trunk-Solaris/solr/build/solr-core/test/J0/temp/solr.core.TestLazyCores_9EBD8092C4109BB8-001/tempDir-001/collection5/conf
   [junit4]   2> 69188 INFO  (coreLoadExecutor-157-thread-3) [    x:collectionLazy5] o.a.s.r.RestManager Initializing RestManager with initArgs: {storageDir=/export/home/jenkins/workspace/Lucene-Solr-trunk-Solaris/solr/build/solr-core/test/J0/temp/solr.core.TestLazyCores_9EBD8092C4109BB8-001/tempDir-001/collection5/conf}
   [junit4]   2> 69188 INFO  (coreLoadExecutor-157-thread-3) [    x:collectionLazy5] o.a.s.r.ManagedResourceStorage Reading _rest_managed.json using file:dir=/export/home/jenkins/workspace/Lucene-Solr-trunk-Solaris/solr/build/solr-core/test/J0/temp/solr.core.TestLazyCores_9EBD8092C4109BB8-001/tempDir-001/collection5/conf
   [junit4]   2> 69188 INFO  (coreLoadExecutor-157-thread-3) [    x:collectionLazy5] o.a.s.r.RestManager Initializing 0 registered ManagedResources
   [junit4]   2> 69188 INFO  (coreLoadExecutor-157-thread-3) [    x:collectionLazy5] o.a.s.h.ReplicationHandler Commits will be reserved for  10000
   [junit4]   2> 69189 INFO  (coreLoadExecutor-157-thread-3) [    x:collectionLazy5] o.a.s.c.CoreContainer registering core: collectionLazy5
   [junit4]   2> 69189 INFO  (searcherExecutor-159-thread-1-processing-x:collectionLazy5) [    x:collectionLazy5] o.a.s.c.SolrCore [collectionLazy5] Registered new searcher Searcher@1f1c1811[collectionLazy5] main{ExitableDirectoryReader(UninvertingDirectoryReader())}
   [junit4]   2> 69214 INFO  (coreLoadExecutor-157-thread-1) [    x:collection1] o.a.s.c.SolrCore no updateRequestProcessorChain defined as default, creating implicit default
   [junit4]   2> 69220 INFO  (coreLoadExecutor-157-thread-1) [    x:collection1] o.a.s.h.l.XMLLoader xsltCacheLifetimeSeconds=60
   [junit4]   2> 69221 INFO  (coreLoadExecutor-157-thread-1) [    x:collection1] o.a.s.h.l.XMLLoader xsltCacheLifetimeSeconds=60
   [junit4]   2> 69223 INFO  (coreLoadExecutor-157-thread-1) [    x:collection1] o.a.s.h.l.XMLLoader xsltCacheLifetimeSeconds=60
   [junit4]   2> 69225 INFO  (coreLoadExecutor-157-thread-1) [    x:collection1] o.a.s.h.l.XMLLoader xsltCacheLifetimeSeconds=60
   [junit4]   2> 69232 INFO  (coreLoadExecutor-157-thread-1) [    x:collection1] o.a.s.c.RequestHandlers Registered paths: /admin/mbeans,/update/csv,/update/json/docs,/admin/luke,/select,/admin/segments,/get,/admin/system,/replication,/admin/properties,/config,/schema,/admin/plugins,/admin/logging,/update/json,/admin/threads,/admin/ping,/update,/admin/file
   [junit4]   2> 69232 INFO  (coreLoadExecutor-157-thread-1) [    x:collection1] o.a.s.c.SolrCore Using default statsCache cache: org.apache.solr.search.stats.LocalStatsCache
   [junit4]   2> 69233 INFO  (coreLoadExecutor-157-thread-1) [    x:collection1] o.a.s.c.SolrCore Hard AutoCommit: disabled
   [junit4]   2> 69233 INFO  (coreLoadExecutor-157-thread-1) [    x:collection1] o.a.s.c.SolrCore Soft AutoCommit: disabled
   [junit4]   2> 69233 INFO  (coreLoadExecutor-157-thread-1) [    x:collection1] o.a.s.u.RandomMergePolicy RandomMergePolicy wrapping class org.apache.lucene.index.LogDocMergePolicy: [LogDocMergePolicy: minMergeSize=1000, mergeFactor=23, maxMergeSize=9223372036854775807, maxMergeSizeForForcedMerge=9223372036854775807, calibrateSizeByDeletes=false, maxMergeDocs=2147483647, maxCFSSegmentSizeMB=8.796093022207999E12, noCFSRatio=1.0]
   [junit4]   2> 69234 INFO  (coreLoadExecutor-157-thread-1) [    x:collection1] o.a.s.c.SolrCore SolrDeletionPolicy.onInit: commits: num=1
   [junit4]   2> 	commit{dir=MockDirectoryWrapper(RAMDirectory@674d0567 lockFactory=org.apache.lucene.store.SingleInstanceLockFactory@5df8d79e),segFN=segments_1,generation=1}
   [junit4]   2> 69234 INFO  (coreLoadExecutor-157-thread-1) [    x:collection1] o.a.s.c.SolrCore newest commit generation = 1
   [junit4]   2> 69234 INFO  (coreLoadExecutor-157-thread-1) [    x:collection1] o.a.s.s.SolrIndexSearcher Opening Searcher@6bc4a27f[collection1] main
   [junit4]   2> 69234 INFO  (coreLoadExecutor-157-thread-1) [    x:collection1] o.a.s.r.ManagedResourceStorage File-based storage initialized to use dir: /export/home/jenkins/workspace/Lucene-Solr-trunk-Solaris/solr/build/solr-core/test/J0/temp/solr.core.TestLazyCores_9EBD8092C4109BB8-001/tempDir-001/collection1/conf
   [junit4]   2> 69235 INFO  (coreLoadExecutor-157-thread-1) [    x:collection1] o.a.s.r.RestManager Initializing RestManager with initArgs: {storageDir=/export/home/jenkins/workspace/Lucene-Solr-trunk-Solaris/solr/build/solr-core/test/J0/temp/solr.core.TestLazyCores_9EBD8092C4109BB8-001/tempDir-001/collection1/conf}
   [junit4]   2> 69236 INFO  (coreLoadExecutor-157-thread-1) [    x:collection1] o.a.s.r.ManagedResourceStorage Reading _rest_managed.json using file:dir=/export/home/jenkins/workspace/Lucene-Solr-trunk-Solaris/solr/build/solr-core/test/J0/temp/solr.core.TestLazyCores_9EBD8092C4109BB8-001/tempDir-001/collection1/conf
   [junit4]   2> 69237 INFO  (coreLoadExecutor-157-thread-1) [    x:collection1] o.a.s.r.RestManager Initializing 0 registered ManagedResources
   [junit4]   2> 69237 INFO  (coreLoadExecutor-157-thread-1) [    x:collection1] o.a.s.h.ReplicationHandler Commits will be reserved for  10000
   [junit4]   2> 69237 INFO  (coreLoadExecutor-157-thread-1) [    x:collection1] o.a.s.c.CoreContainer registering core: collection1
   [junit4]   2> 69237 INFO  (searcherExecutor-160-thread-1-processing-x:collection1) [    x:collection1] o.a.s.c.SolrCore [collection1] Registered new searcher Searcher@6bc4a27f[collection1] main{ExitableDirectoryReader(UninvertingDirectoryReader())}
   [junit4]   2> 69239 INFO  (TEST-TestLazyCores.testLazyLoad-seed#[9EBD8092C4109BB8]) [    ] o.a.s.c.SolrResourceLoader new SolrResourceLoader for directory: '/export/home/jenkins/workspace/Lucene-Solr-trunk-Solaris/solr/build/solr-core/test/J0/temp/solr.core.TestLazyCores_9EBD8092C4109BB8-001/tempDir-001/collection3/'
   [junit4]   2> 69240 INFO  (TEST-TestLazyCores.testLazyLoad-seed#[9EBD8092C4109BB8]) [    ] o.a.s.c.SolrResourceLoader JNDI not configured for solr (NoInitialContextEx)
   [junit4]   2> 69240 INFO  (TEST-TestLazyCores.testLazyLoad-seed#[9EBD8092C4109BB8]) [    ] o.a.s.c.SolrResourceLoader solr home defaulted to 'solr/' (could not find system property or JNDI)
   [junit4]   2> 69259 INFO  (TEST-TestLazyCores.testLazyLoad-seed#[9EBD8092C4109BB8]) [    ] o.a.s.c.SolrConfig current version of requestparams : -1
   [junit4]   2> 69267 INFO  (TEST-TestLazyCores.testLazyLoad-seed#[9EBD8092C4109BB8]) [    ] o.a.s.c.SolrConfig Using Lucene MatchVersion: 6.0.0
   [junit4]   2> 69277 INFO  (TEST-TestLazyCores.testLazyLoad-seed#[9EBD8092C4109BB8]) [    ] o.a.s.c.Config Loaded SolrConfig: solrconfig.xml
   [junit4]   2> 69277 INFO  (TEST-TestLazyCores.testLazyLoad-seed#[9EBD8092C4109BB8]) [    ] o.a.s.s.IndexSchema Reading Solr Schema from /export/home/jenkins/workspace/Lucene-Solr-trunk-Solaris/solr/build/solr-core/test/J0/temp/solr.core.TestLazyCores_9EBD8092C4109BB8-001/tempDir-001/collection3/conf/schema.xml
   [junit4]   2> 69280 INFO  (TEST-TestLazyCores.testLazyLoad-seed#[9EBD8092C4109BB8]) [    ] o.a.s.s.IndexSchema [collectionLazy3] Schema name=tiny
   [junit4]   2> 69288 INFO  (TEST-TestLazyCores.testLazyLoad-seed#[9EBD8092C4109BB8]) [    ] o.a.s.s.IndexSchema unique key field: id
   [junit4]   2> 69288 INFO  (TEST-TestLazyCores.testLazyLoad-seed#[9EBD8092C4109BB8]) [    ] o.a.s.c.ConfigSetProperties Did not find ConfigSet properties, assuming default properties: Can't find resource 'configsetprops.json' in classpath or '/export/home/jenkins/workspace/Lucene-Solr-trunk-Solaris/solr/build/solr-core/test/J0/temp/solr.core.TestLazyCores_9EBD8092C4109BB8-001/tempDir-001/collection3/conf'
   [junit4]   2> 69289 INFO  (TEST-TestLazyCores.testLazyLoad-seed#[9EBD8092C4109BB8]) [    ] o.a.s.c.CoreContainer Creating SolrCore 'collectionLazy3' using configuration from instancedir /export/home/jenkins/workspace/Lucene-Solr-trunk-Solaris/solr/build/solr-core/test/J0/temp/solr.core.TestLazyCores_9EBD8092C4109BB8-001/tempDir-001/collection3/
   [junit4]   2> 69289 INFO  (TEST-TestLazyCores.testLazyLoad-seed#[9EBD8092C4109BB8]) [    x:collectionLazy3] o.a.s.c.SolrCore org.apache.solr.core.MockDirectoryFactory
   [junit4]   2> 69289 INFO  (TEST-TestLazyCores.testLazyLoad-seed#[9EBD8092C4109BB8]) [    x:collectionLazy3] o.a.s.c.SolrCore [[collectionLazy3] ] Opening new SolrCore at [/export/home/jenkins/workspace/Lucene-Solr-trunk-Solaris/solr/build/solr-core/test/J0/temp/solr.core.TestLazyCores_9EBD8092C4109BB8-001/tempDir-001/collection3/], dataDir=[null]
   [junit4]   2> 69289 INFO  (TEST-TestLazyCores.testLazyLoad-seed#[9EBD8092C4109BB8]) [    x:collectionLazy3] o.a.s.c.SolrCore JMX monitoring not detected for core: collectionLazy3
   [junit4]   2> 69290 INFO  (TEST-TestLazyCores.testLazyLoad-seed#[9EBD8092C4109BB8]) [    x:collectionLazy3] o.a.s.c.CachingDirectoryFactory return new directory for /export/home/jenkins/workspace/Lucene-Solr-trunk-Solaris/solr/build/solr-core/test/J0/temp/solr.core.TestLazyCores_9EBD8092C4109BB8-001/tempDir-001/collection3/data
   [junit4]   2> 69290 INFO  (TEST-TestLazyCores.testLazyLoad-seed#[9EBD8092C4109BB8]) [    x:collectionLazy3] o.a.s.c.SolrCore New index directory detected: old=null new=/export/home/jenkins/workspace/Lucene-Solr-trunk-Solaris/solr/build/solr-core/test/J0/temp/solr.core.TestLazyCores_9EBD8092C4109BB8-001/tempDir-001/collection3/data/index/
   [junit4]   2> 69290 WARN  (TEST-TestLazyCores.testLazyLoad-seed#[9EBD8092C4109BB8]) [    x:collectionLazy3] o.a.s.c.SolrCore [collectionLazy3] Solr index directory '/export/home/jenkins/workspace/Lucene-Solr-trunk-Solaris/solr/build/solr-core/test/J0/temp/solr.core.TestLazyCores_9EBD8092C4109BB8-001/tempDir-001/collection3/data/index' doesn't exist. Creating new index...
   [junit4]   2> 69291 INFO  (TEST-TestLazyCores.testLazyLoad-seed#[9EBD8092C4109BB8]) [    x:collectionLazy3] o.a.s.c.CachingDirectoryFactory return new directory for /export/home/jenkins/workspace/Lucene-Solr-trunk-Solaris/solr/build/solr-core/test/J0/temp/solr.core.TestLazyCores_9EBD8092C4109BB8-001/tempDir-001/collection3/data/index
   [junit4]   2> 69291 INFO  (TEST-TestLazyCores.testLazyLoad-seed#[9EBD8092C4109BB8]) [    x:collectionLazy3] o.a.s.u.RandomMergePolicy RandomMergePolicy wrapping class org.apache.lucene.index.TieredMergePolicy: [TieredMergePolicy: maxMergeAtOnce=22, maxMergeAtOnceExplicit=35, maxMergedSegmentMB=7.3173828125, floorSegmentMB=1.1025390625, forceMergeDeletesPctAllowed=10.112610846639425, segmentsPerTier=49.0, maxCFSSegmentSizeMB=8.796093022207999E12, noCFSRatio=1.0
   [junit4]   2> 69291 INFO  (TEST-TestLazyCores.testLazyLoad-seed#[9EBD8092C4109BB8]) [    x:collectionLazy3] o.a.s.c.SolrCore SolrDeletionPolicy.onCommit: commits: num=1
   [junit4]   2> 	commit{dir=MockDirectoryWrapper(RAMDirectory@19966845 lockFactory=org.apache.lucene.store.SingleInstanceLockFactory@6678e657),segFN=segments_1,generation=1}
   [junit4]   2> 69291 INFO  (TEST-TestLazyCores.testLazyLoad-seed#[9EBD8092C4109BB8]) [    x:collectionLazy3] o.a.s.c.SolrCore newest commit generation = 1
   [junit4]   2> 69292 INFO  (OldIndexDirectoryCleanupThreadForCore-collectionLazy3) [    x:collectionLazy3] o.a.s.c.SolrCore Looking for old index directories to cleanup for core collectionLazy3 in /export/home/jenkins/workspace/Lucene-Solr-trunk-Solaris/solr/build/solr-core/test/J0/temp/solr.core.TestLazyCores_9EBD8092C4109BB8-001/tempDir-001/collection3/data/
   [junit4]   2> 69292 WARN  (OldIndexDirectoryCleanupThreadForCore-collectionLazy3) [    x:collectionLazy3] o.a.s.c.DirectoryFactory /export/home/jenkins/workspace/Lucene-Solr-trunk-Solaris/solr/build/solr-core/test/J0/temp/solr.core.TestLazyCores_9EBD8092C4109BB8-001/tempDir-001/collection3/data/ does not point to a valid data directory; skipping clean-up of old index directories.
   [junit4]   2> 69294 INFO  (TEST-TestLazyCores.testLazyLoad-seed#[9EBD8092C4109BB8]) [    x:collectionLazy3] o.a.s.c.SolrCore no updateRequestProcessorChain defined as default, creating implicit default
   [junit4]   2> 69296 INFO  (TEST-TestLazyCores.testLazyLoad-seed#[9EBD8092C4109BB8]) [    x:collectionLazy3] o.a.s.h.l.XMLLoader xsltCacheLifetimeSeconds=60
   [junit4]   2> 69297 INFO  (TEST-TestLazyCores.testLazyLoad-seed#[9EBD8092C4109BB8]) [    x:collectionLazy3] o.a.s.h.l.XMLLoader xsltCacheLifetimeSeconds=60
   [junit4]   2> 69298 INFO  (TEST-TestLazyCores.testLazyLoad-seed#[9EBD8092C4109BB8]) [    x:collectionLazy3] o.a.s.h.l.XMLLoader xsltCacheLifetimeSeconds=60
   [junit4]   2> 69299 INFO  (TEST-TestLazyCores.testLazyLoad-seed#[9EBD8092C4109BB8]) [    x:collectionLazy3] o.a.s.h.l.XMLLoader xsltCacheLifetimeSeconds=60
   [junit4]   2> 69301 INFO  (TEST-TestLazyCores.testLazyLoad-seed#[9EBD8092C4109BB8]) [    x:collectionLazy3] o.a.s.c.RequestHandlers Registered paths: /admin/mbeans,/update/csv,/update/json/docs,/admin/luke,/select,/admin/segments,/get,/admin/system,/replication,/admin/properties,/config,/schema,/admin/plugins,/admin/logging,/update/json,/admin/threads,/admin/ping,/update,/admin/file
   [junit4]   2> 69302 INFO  (TEST-TestLazyCores.testLazyLoad-seed#[9EBD8092C4109BB8]) [    x:collectionLazy3] o.a.s.c.SolrCore Using default statsCache cache: org.apache.solr.search.stats.LocalStatsCache
   [junit4]   2> 69302 INFO  (TEST-TestLazyCores.testLazyLoad-seed#[9EBD8092C4109BB8]) [    x:collectionLazy3] o.a.s.c.SolrCore Hard AutoCommit: disabled
   [junit4]   2> 69303 INFO  (TEST-TestLazyCores.testLazyLoad-seed#[9EBD8092C4109BB8]) [    x:collectionLazy3] o.a.s.c.SolrCore Soft AutoCommit: disabled
   [junit4]   2> 69303 INFO  (TEST-TestLazyCores.testLazyLoad-seed#[9EBD8092C4109BB8]) [    x:collectionLazy3] o.a.s.u.RandomMergePolicy RandomMergePolicy wrapping class org.apache.lucene.index.TieredMergePolicy: [TieredMergePolicy: maxMergeAtOnce=18, maxMergeAtOnceExplicit=44, maxMergedSegmentMB=56.5126953125, floorSegmentMB=1.6513671875, forceMergeDeletesPctAllowed=19.172348253491744, segmentsPerTier=37.0, maxCFSSegmentSizeMB=8.796093022207999E12, noCFSRatio=1.0
   [junit4]   2> 69303 INFO  (TEST-TestLazyCores.testLazyLoad-seed#[9EBD8092C4109BB8]) [    x:collectionLazy3] o.a.s.c.SolrCore SolrDeletionPolicy.onInit: commits: num=1
   [junit4]   2> 	commit{dir=MockDirectoryWrapper(RAMDirectory@19966845 lockFactory=org.apache.lucene.store.SingleInstanceLockFactory@6678e657),segFN=segments_1,generation=1}
   [junit4]   2> 69303 INFO  (TEST-TestLazyCores.testLazyLoad-seed#[9EBD8092C4109BB8]) [    x:collectionLazy3] o.a.s.c.SolrCore newest commit generation = 1
   [junit4]   2> 69304 INFO  (TEST-TestLazyCores.testLazyLoad-seed#[9EBD8092C4109BB8]) [    x:collectionLazy3] o.a.s.s.SolrIndexSearcher Opening Searcher@f7c22d1[collectionLazy3] main
   [junit4]   2> 69304 INFO  (TEST-TestLazyCores.testLazyLoad-seed#[9EBD8092C4109BB8]) [    x:collectionLazy3] o.a.s.r.ManagedResourceStorage File-based storage initialized to use dir: /export/home/jenkins/workspace/Lucene-Solr-trunk-Solaris/solr/build/solr-core/test/J0/temp/solr.core.TestLazyCores_9EBD8092C4109BB8-001/tempDir-001/collection3/conf
   [junit4]   2> 69304 INFO  (TEST-TestLazyCores.testLazyLoad-seed#[9EBD8092C4109BB8]) [    x:collectionLazy3] o.a.s.r.RestManager Initializing RestManager with initArgs: {storageDir=/export/home/jenkins/workspace/Lucene-Solr-trunk-Solaris/solr/build/solr-core/test/J0/temp/solr.core.TestLazyCores_9EBD8092C4109BB8-001/tempDir-001/collection3/conf}
   [junit4]   2> 69304 INFO  (TEST-TestLazyCores.testLazyLoad-seed#[9EBD8092C4109BB8]) [    x:collectionLazy3] o.a.s.r.ManagedResourceStorage Reading _rest_managed.json using file:dir=/export/home/jenkins/workspace/Lucene-Solr-trunk-Solaris/solr/build/solr-core/test/J0/temp/solr.core.TestLazyCores_9EBD8092C4109BB8-001/tempDir-001/collection3/conf
   [junit4]   2> 69304 INFO  (TEST-TestLazyCores.testLazyLoad-seed#[9EBD8092C4109BB8]) [    x:collectionLazy3] o.a.s.r.RestManager Initializing 0 registered ManagedResources
   [junit4]   2> 69304 INFO  (TEST-TestLazyCores.testLazyLoad-seed#[9EBD8092C4109BB8]) [    x:collectionLazy3] o.a.s.h.ReplicationHandler Commits will be reserved for  10000
   [junit4]   2> 69305 INFO  (TEST-TestLazyCores.testLazyLoad-seed#[9EBD8092C4109BB8]) [    x:collectionLazy3] o.a.s.c.CoreContainer Opening transient core collectionLazy3
   [junit4]   2> 69305 INFO  (TEST-TestLazyCores.testLazyLoad-seed#[9EBD8092C4109BB8]) [    x:collectionLazy3] o.a.s.c.CoreContainer registering core: collectionLazy3
   [junit4]   2> 69305 INFO  (searcherExecutor-170-thread-1-processing-x:collectionLazy3) [    x:collectionLazy3] o.a.s.c.SolrCore [collectionLazy3] Registered new searcher Searcher@f7c22d1[collectionLazy3] main{ExitableDirectoryReader(UninvertingDirectoryReader())}
   [junit4]   2> 69305 INFO  (TEST-TestLazyCores.testLazyLoad-seed#[9EBD8092C4109BB8]) [    x:collectionLazy3] o.a.s.c.SolrResourceLoader new SolrResourceLoader for directory: '/export/home/jenkins/workspace/Lucene-Solr-trunk-Solaris/solr/build/solr-core/test/J0/temp/solr.core.TestLazyCores_9EBD8092C4109BB8-001/tempDir-001/collection4/'
   [junit4]   2> 69305 INFO  (TEST-TestLazyCores.testLazyLoad-seed#[9EBD8092C4109BB8]) [    x:collectionLazy3] o.a.s.c.SolrResourceLoader JNDI not configured for solr (NoInitialContextEx)
   [junit4]   2> 69305 INFO  (TEST-TestLazyCores.testLazyLoad-seed#[9EBD8092C4109BB8]) [    x:collectionLazy3] o.a.s.c.SolrResourceLoader solr home defaulted to 'solr/' (could not find system property or JNDI)
   [junit4]   2> 69324 INFO  (TEST-TestLazyCores.testLazyLoad-seed#[9EBD8092C4109BB8]) [    x:collectionLazy3] o.a.s.c.SolrConfig current version of requestparams : -1
   [junit4]   2> 69336 INFO  (TEST-TestLazyCores.testLazyLoad-seed#[9EBD8092C4109BB8]) [    x:collectionLazy3] o.a.s.c.SolrConfig Using Lucene MatchVersion: 6.0.0
   [junit4]   2> 69348 INFO  (TEST-TestLazyCores.testLazyLoad-seed#[9EBD8092C4109BB8]) [    x:collectionLazy3] o.a.s.c.Config Loaded SolrConfig: solrconfig.xml
   [junit4]   2> 69348 INFO  (TEST-TestLazyCores.testLazyLoad-seed#[9EBD8092C4109BB8]) [    x:collectionLazy3] o.a.s.s.IndexSchema Reading Solr Schema from /export/home/jenkins/workspace/Lucene-Solr-trunk-Solaris/solr/build/solr-core/test/J0/temp/solr.core.TestLazyCores_9EBD8092C4109BB8-001/tempDir-001/collection4/conf/schema.xml
   [junit4]   2> 69351 INFO  (TEST-TestLazyCores.testLazyLoad-seed#[9EBD8092C4109BB8]) [    x:collectionLazy3] o.a.s.s.IndexSchema [collectionLazy4] Schema name=tiny
   [junit4]   2> 69353 INFO  (TEST-TestLazyCores.testLazyLoad-seed#[9EBD8092C4109BB8]) [    x:collectionLazy3] o.a.s.s.IndexSchema unique key field: id
   [junit4]   2> 69354 INFO  (TEST-TestLazyCores.testLazyLoad-seed#[9EBD8092C4109BB8]) [    x:collectionLazy3] o.a.s.c.ConfigSetProperties Did not find ConfigSet properties, assuming default properties: Can't find resource 'configsetprops.json' in classpath or '/export/home/jenkins/workspace/Lucene-Solr-trunk-Solaris/solr/build/solr-core/test/J0/temp/solr.core.TestLazyCores_9EBD8092C4109BB8-001/tempDir-001/collection4/conf'
   [junit4]   2> 69355 INFO  (TEST-TestLazyCores.testLazyLoad-seed#[9EBD8092C4109BB8]) [    x:collectionLazy3] o.a.s.c.CoreContainer Creating SolrCore 'collectionLazy4' using configuration from instancedir /export/home/jenkins/workspace/Lucene-Solr-trunk-Solaris/solr/build/solr-core/test/J0/temp/solr.core.TestLazyCores_9EBD8092C4109BB8-001/tempDir-001/collection4/
   [junit4]   2> 69355 INFO  (TEST-TestLazyCores.testLazyLoad-seed#[9EBD8092C4109BB8]) [    x:collectionLazy4] o.a.s.c.SolrCore org.apache.solr.core.MockDirectoryFactory
   [junit4]   2> 69355 INFO  (TEST-TestLazyCores.testLazyLoad-seed#[9EBD8092C4109BB8]) [    x:collectionLazy4] o.a.s.c.SolrCore [[collectionLazy4] ] Opening new SolrCore at [/export/home/jenkins/workspace/Lucene-Solr-trunk-Solaris/solr/build/solr-core/test/J0/temp/solr.core.TestLazyCores_9EBD8092C4109BB8-001/tempDir-001/collection4/], dataDir=[null]
   [junit4]   2> 69355 INFO  (TEST-TestLazyCores.testLazyLoad-seed#[9EBD8092C4109BB8]) [    x:collectionLazy4] o.a.s.c.SolrCore JMX monitoring not detected for core: collectionLazy4
   [junit4]   2> 69355 INFO  (TEST-TestLazyCores.testLazyLoad-seed#[9EBD8092C4109BB8]) [    x:collectionLazy4] o.a.s.c.CachingDirectoryFactory return new directory for /export/home/jenkins/workspace/Lucene-Solr-trunk-Solaris/solr/build/solr-core/test/J0/temp/solr.core.TestLazyCores_9EBD8092C4109BB8-001/tempDir-001/collection4/data
   [junit4]   2> 69355 INFO  (TEST-TestLazyCores.testLazyLoad-seed#[9EBD8092C4109BB8]) [    x:collectionLazy4] o.a.s.c.SolrCore New index directory detected: old=null new=/export/home/jenkins/workspace/Lucene-Solr-trunk-Solaris/solr/build/solr-core/test/J0/temp/solr.core.TestLazyCores_9EBD8092C4109BB8-001/tempDir-001/collection4/data/index/
   [junit4]   2> 69355 WARN  (TEST-TestLazyCores.testLazyLoad-seed#[9EBD8092C4109BB8]) [    x:collectionLazy4] o.a.s.c.SolrCore [collectionLazy4] Solr index directory '/export/home/jenkins/workspace/Lucene-Solr-trunk-Solaris/solr/build/solr-core/test/J0/temp/solr.core.TestLazyCores_9EBD8092C4109BB8-001/tempDir-001/collection4/data/index' doesn't exist. Creating new index...
   [junit4]   2> 69356 INFO  (TEST-TestLazyCores.testLazyLoad-seed#[9EBD8092C4109BB8]) [    x:collectionLazy4] o.a.s.c.CachingDirectoryFactory return new directory for /export/home/jenkins/workspace/Lucene-Solr-trunk-Solaris/solr/build/solr-core/test/J0/temp/solr.core.TestLazyCores_9EBD8092C4109BB8-001/tempDir-001/collection4/data/index
   [junit4]   2> 69356 INFO  (TEST-TestLazyCores.testLazyLoad-seed#[9EBD8092C4109BB8]) [    x:collectionLazy4] o.a.s.u.RandomMergePolicy RandomMergePolicy wrapping class org.apache.lucene.index.LogDocMergePolicy: [LogDocMergePolicy: minMergeSize=1000, mergeFactor=30, maxMergeSize=9223372036854775807, maxMergeSizeForForcedMerge=9223372036854775807, calibrateSizeByDeletes=false, maxMergeDocs=2147483647, maxCFSSegmentSizeMB=8.796093022207999E12, noCFSRatio=1.0]
   [junit4]   2> 69356 INFO  (TEST-TestLazyCores.testLazyLoad-seed#[9EBD8092C4109BB8]) [    x:collectionLazy4] o.a.s.c.SolrCore SolrDeletionPolicy.onCommit: commits: num=1
   [junit4]   2> 	commit{dir=MockDirectoryWrapper(RAMDirectory@79b460d5 lockFactory=org.apache.lucene.store.SingleInstanceLockFactory@314c845e),segFN=segments_1,generation=1}
   [junit4]   2> 69356 INFO  (TEST-TestLazyCores.testLazyLoad-seed#[9EBD8092C4109BB8]) [    x:collectionLazy4] o.a.s.c.SolrCore newest commit generation = 1
   [junit4]   2> 69357 INFO  (OldIndexDirectoryCleanupThreadForCore-collectionLazy4) [    x:collectionLazy4] o.a.s.c.SolrCore Looking for old index directories to cleanup for core collectionLazy4 in /export/home/jenkins/workspace/Lucene-Solr-trunk-Solaris/solr/build/solr-core/test/J0/temp/solr.core.TestLazyCores_9EBD8092C4109BB8-001/tempDir-001/collection4/data/
   [junit4]   2> 69357 WARN  (OldIndexDirectoryCleanupThreadForCore-collectionLazy4) [    x:collectionLazy4] o.a.s.c.DirectoryFactory /export/home/jenkins/workspace/Lucene-Solr-trunk-Solaris/solr/build/solr-core/test/J0/temp/solr.core.TestLazyCores_9EBD8092C4109BB8-001/tempDir-001/collection4/data/ does not point to a valid data directory; skipping clean-up of old index directories.
   [junit4]   2> 69359 INFO  (TEST-TestLazyCores.testLazyLoad-seed#[9EBD8092C4109BB8]) [    x:collectionLazy4] o.a.s.c.SolrCore no updateRequestProcessorChain defined as default, creating implicit default
   [junit4]   2> 69360 INFO  (TEST-TestLazyCores.testLazyLoad-seed#[9EBD8092C4109BB8]) [    x:collectionLazy4] o.a.s.h.l.XMLLoader xsltCacheLifetimeSeconds=60
   [junit4]   2> 69361 INFO  (TEST-TestLazyCores.testLazyLoad-seed#[9EBD8092C4109BB8]) [    x:collectionLazy4] o.a.s.h.l.XMLLoader xsltCacheLifetimeSeconds=60
   [junit4]   2> 69362 INFO  (TEST-TestLazyCores.testLazyLoad-seed#[9EBD8092C4109BB8]) [    x:collectionLazy4] o.a.s.h.l.XMLLoader xsltCacheLifetimeSeconds=60
   [junit4]   2> 69363 INFO  (TEST-TestLazyCores.testLazyLoad-seed#[9EBD8092C4109BB8]) [    x:collectionLazy4] o.a.s.h.l.XMLLoader xsltCacheLifetimeSeconds=60
   [junit4]   2> 69364 INFO  (TEST-TestLazyCores.testLazyLoad-seed#[9EBD8092C4109BB8]) [    x:collectionLazy4] o.a.s.c.RequestHandlers Registered paths: /admin/mbeans,/update/csv,/update/json/docs,/admin/luke,/select,/admin/segments,/get,/admin/system,/replication,/admin/properties,/config,/schema,/admin/plugins,/admin/logging,/update/json,/admin/threads,/admin/ping,/update,/admin/file
   [junit4]   2> 69365 INFO  (TEST-TestLazyCores.testLazyLoad-seed#[9EBD8092C4109BB8]) [    x:collectionLazy4] o.a.s.c.SolrCore Using default statsCache cache: org.apache.solr.search.stats.LocalStatsCache
   [junit4]   2> 69365 INFO  (TEST-TestLazyCores.testLazyLoad-seed#[9EBD8092C4109BB8]) [    x:collectionLazy4] o.a.s.c.SolrCore Hard AutoCommit: disabled
   [junit4]   2> 69365 INFO  (TEST-TestLazyCores.testLazyLoad-seed#[9EBD8092C4109BB8]) [    x:collectionLazy4] o.a.s.c.SolrCore Soft AutoCommit: disabled
   [junit4]   2> 69365 INFO  (TEST-TestLazyCores.testLazyLoad-seed#[9EBD8092C4109BB8]) [    x:collectionLazy4] o.a.s.u.RandomMergePolicy RandomMergePolicy wrapping class org.apache.lucene.index.LogByteSizeMergePolicy: [LogByteSizeMergePolicy: minMergeSize=1677721, mergeFactor=44, maxMergeSize=2147483648, maxMergeSizeForForcedMerge=9223372036854775807, calibrateSizeByDeletes=false, maxMergeDocs=2147483647, maxCFSSegmentSizeMB=8.796093022207999E12, noCFSRatio=1.0]
   [junit4]   2> 69365 INFO  (TEST-TestLazyCores.testLazyLoad-seed#[9EBD8092C4109BB8]) [    x:collectionLazy4] o.a.s.c.SolrCore SolrDeletionPolicy.onInit: commits: num=1
   [junit4]   2> 	commit{dir=MockDirectoryWrapper(RAMDirectory@79b460d5 lockFactory=org.apache.lucene.store.SingleInstanceLockFactory@314c845e),segFN=segments_1,generation=1}
   [junit4]   2> 69366 INFO  (TEST-TestLazyCores.testLazyLoad-seed#[9EBD8092C4109BB8]) [    x:collectionLazy4] o.a.s.c.SolrCore newest commit generation = 1
   [junit4]   2> 69366 INFO  (TEST-TestLazyCores.testLazyLoad-seed#[9EBD8092C4109BB8]) [    x:collectionLazy4] o.a.s.s.SolrIndexSearcher Opening Searcher@e68674c[collectionLazy4] main
   [junit4]   2> 69366 INFO  (TEST-TestLazyCores.testLazyLoad-seed#[9EBD8092C4109BB8]) [    x:collectionLazy4] o.a.s.r.ManagedResourceStorage File-based storage initialized to use dir: /export/home/jenkins/workspace/Lucene-Solr-trunk-Solaris/solr/build/solr-core/test/J0/temp/solr.core.TestLazyCores_9EBD8092C4109BB8-001/tempDir-001/collection4/conf
   [junit4]   2> 69367 INFO  (TEST-TestLazyCores.testLazyLoad-seed#[9EBD8092C4109BB8]) [    x:collectionLazy4] o.a.s.r.RestManager Initializing RestManager with initArgs: {storageDir=/export/home/jenkins/workspace/Lucene-Solr-trunk-Solaris/solr/build/solr-core/test/J0/temp/solr.core.TestLazyCores_9EBD8092C4109BB8-001/tempDir-001/collection4/conf}
   [junit4]   2> 69367 INFO  (TEST-TestLazyCores.testLazyLoad-seed#[9EBD8092C4109BB8]) [    x:collectionLazy4] o.a.s.r.ManagedResourceStorage Reading _rest_managed.json using file:dir=/export/home/jenkins/workspace/Lucene-Solr-trunk-Solaris/solr/build/solr-core/test/J0/temp/solr.core.TestLazyCores_9EBD8092C4109BB8-001/tempDir-001/collection4/conf
   [junit4]   2> 69367 INFO  (TEST-TestLazyCores.testLazyLoad-seed#[9EBD8092C4109BB8]) [    x:collectionLazy4] o.a.s.r.RestManager Initializing 0 registered ManagedResources
   [junit4]   2> 69367 INFO  (TEST-TestLazyCores.testLazyLoad-seed#[9EBD8092C4109BB8]) [    x:collectionLazy4] o.a.s.h.ReplicationHandler Commits will be reserved for  10000
   [junit4]   2> 69367 INFO  (TEST-TestLazyCores.testLazyLoad-seed#[9EBD8092C4109BB8]) [    x:collectionLazy4] o.a.s.c.CoreContainer registering core: collectionLazy4
   [junit4]   2> 69367 INFO  (searcherExecutor-174-thread-1-processing-x:collectionLazy4) [    x:collectionLazy4] o.a.s.c.SolrCore [collectionLazy4] Registered new searcher Searcher@e68674c[collectionLazy4] main{ExitableDirectoryReader(UninvertingDirectoryReader())}
   [junit4]   2> 69367 INFO  (TEST-TestLazyCores.testLazyLoad-seed#[9EBD8092C4109BB8]) [    x:collectionLazy4] o.a.s.c.CoreContainer Shutting down CoreContainer instance=1541558305
   [junit4]   2> 69367 INFO  (TEST-TestLazyCores.testLazyLoad-seed#[9EBD8092C4109BB8]) [    x:collectionLazy5] o.a.s.c.SolrCore [collectionLazy5]  CLOSING SolrCore org.apache.solr.core.SolrCore@22625ebe
   [junit4]   2> 69368 INFO  (TEST-TestLazyCores.testLazyLoad-seed#[9EBD8092C4109BB8]) [    x:collectionLazy5] o.a.s.u.UpdateHandler closing DirectUpdateHandler2{commits=0,autocommits=0,soft autocommits=0,optimizes=0,rollbacks=0,expungeDeletes=0,docsPending=0,adds=0,deletesById=0,deletesByQuery=0,errors=0,cumulative_adds=0,cumulative_deletesById=0,cumulative_deletesByQuery=0,cumulative_errors=0}
   [junit4]   2> 69368 INFO  (TEST-TestLazyCores.testLazyLoad-seed#[9EBD8092C4109BB8]) [    x:collectionLazy5] o.a.s.u.SolrCoreState Closing SolrCoreState
   [junit4]   2> 69368 INFO  (TEST-TestLazyCores.testLazyLoad-seed#[9EBD8092C4109BB8]) [    x:collectionLazy5] o.a.s.u.DefaultSolrCoreState SolrCoreState ref count has reached 0 - closing IndexWriter
   [junit4]   2> 69368 INFO  (TEST-TestLazyCores.testLazyLoad-seed#[9EBD8092C4109BB8]) [    x:collectionLazy5] o.a.s.u.DefaultSolrCoreState closing IndexWriter with IndexWriterCloser
   [junit4]   2> 69371 INFO  (TEST-TestLazyCores.testLazyLoad-seed#[9EBD8092C4109BB8]) [    x:collectionLazy5] o.a.s.c.SolrCore [collectionLazy5] Closing main searcher on request.
   [junit4]   2> 69372 INFO  (TEST-TestLazyCores.testLazyLoad-seed#[9EBD8092C4109BB8]) [    x:collectionLazy5] o.a.s.c.CachingDirectoryFactory Closing MockDirectoryFactory - 2 directories currently being tracked
   [junit4]   2> 69372 INFO  (TEST-TestLazyCores.testLazyLoad-seed#[9EBD8092C4109BB8]) [    x:collectionLazy5] o.a.s.c.CachingDirectoryFactory looking to close /export/home/jenkins/workspace/Lucene-Solr-trunk-Solaris/solr/build/solr-core/test/J0/temp/solr.core.TestLazyCores_9EBD8092C4109BB8-001/tempDir-001/collection5/data [CachedDir<<refCount=0;path=/export/home/jenkins/workspace/Lucene-Solr-trunk-Solaris/solr/build/solr-core/test/J0/temp/solr.core.TestLazyCores_9EBD8092C4109BB8-001/tempDir-001/collection5/data;done=false>>]
   [junit4]   2> 69372 INFO  (TEST-TestLazyCores.testLazyLoad-seed#[9EBD8092C4109BB8]) [    x:collectionLazy5] o.a.s.c.CachingDirectoryFactory Closing directory: /export/home/jenkins/workspace/Lucene-Solr-trunk-Solaris/solr/build/solr-core/test/J0/temp/solr.core.TestLazyCores_9EBD8092C4109BB8-001/tempDir-001/collection5/data
   [junit4]   2> 69372 INFO  (TEST-TestLazyCores.testLazyLoad-seed#[9EBD8092C4109BB8]) [    x:collectionLazy5] o.a.s.c.CachingDirectoryFactory looking to close /export/home/jenkins/workspace/Lucene-Solr-trunk-Solaris/solr/build/solr-core/test/J0/temp/solr.core.TestLazyCores_9EBD8092C4109BB8-001/tempDir-001/collection5/data/index [CachedDir<<refCount=0;path=/export/home/jenkins/workspace/Lucene-Solr-trunk-Solaris/solr/build/solr-core/test/J0/temp/solr.core.TestLazyCores_9EBD8092C4109BB8-001/tempDir-001/collection5/data/index;done=false>>]
   [junit4]   2> 69372 INFO  (TEST-TestLazyCores.testLazyLoad-seed#[9EBD8092C4109BB8]) [    x:collectionLazy5] o.a.s.c.CachingDirectoryFactory Closing directory: /export/home/jenkins/workspace/Lucene-Solr-trunk-Solaris/solr/build/solr-core/test/J0/temp/solr.core.TestLazyCores_9EBD8092C4109BB8-001/tempDir-001/collection5/data/index
   [junit4]   2> 69372 INFO  (TEST-TestLazyCores.testLazyLoad-seed#[9EBD8092C4109BB8]) [    x:collection1] o.a.s.c.SolrCore [collection1]  CLOSING SolrCore org.apache.solr.core.SolrCore@40fc8cba
   [junit4]   2> 69372 INFO  (TEST-TestLazyCores.testLazyLoad-seed#[9EBD8092C4109BB8]) [    x:collection1] o.a.s.u.UpdateHandler closing DirectUpdateHandler2{commits=0,autocommits=0,soft autocommits=0,optimizes=0,rollbacks=0,expungeDeletes=0,docsPending=0,adds=0,deletesById=0,deletesByQuery=0,errors=0,cumulative_adds=0,cumulative_deletesById=0,cumulative_deletesByQuery=0,cumulative_errors=0}
   [junit4]   2> 69373 INFO  (TEST-TestLazyCores.testLazyLoad-seed#[9EBD8092C4109BB8]) [    x:collection1] o.a.s.u.SolrCoreState Closing SolrCoreState
   [junit4]   2> 69373 INFO  (TEST-TestLazyCores.testLazyLoad-seed#[9EBD8092C4109BB8]) [    x:collection1] o.a.s.u.DefaultSolrCoreState SolrCoreState ref count has reached 0 - closing IndexWriter
   [junit4]   2> 69373 INFO  (TEST-TestLazyCores.testLazyLoad-seed#[9EBD8092C4109BB8]) [    x:collection1] o.a.s.u.DefaultSolrCoreState closing IndexWriter with IndexWriterCloser
   [junit4]   2> 69375 INFO  (TEST-TestLazyCores.testLazyLoad-seed#[9EBD8092C4109BB8]) [    x:collection1] o.a.s.c.SolrCore [collection1] Closing main searcher on request.
   [junit4]   2> 69375 INFO  (TEST-TestLazyCores.testLazyLoad-seed#[9EBD8092C4109BB8]) [    x:collection1] o.a.s.c.CachingDirectoryFactory Closing MockDirectoryFactory - 2 directories currently being tracked
   [junit4]   2> 69375 INFO  (TEST-TestLazyCores.testLazyLoad-seed#[9EBD8092C4109BB8]) [    x:collection1] o.a.s.c.CachingDirectoryFactory looking to close /export/home/jenkins/workspace/Lucene-Solr-trunk-Solaris/solr/build/solr-core/test/J0/temp/solr.core.TestLazyCores_9EBD8092C4109BB8-001/tempDir-001/collection1/data [CachedDir<<refCount=0;path=/export/home/jenkins/workspace/Lucene-Solr-trunk-Solaris/solr/build/solr-core/test/J0/temp/solr.core.TestLazyCores_9EBD8092C4109BB8-001/tempDir-001/collection1/data;done=false>>]
   [junit4]   2> 69375 INFO  (TEST-TestLazyCores.testLazyLoad-seed#[9EBD8092C4109BB8]) [    x:collection1] o.a.s.c.CachingDirectoryFactory Closing directory: /export/home/jenkins/workspace/Lucene-Solr-trunk-Solaris/solr/build/solr-core/test/J0/temp/solr.core.TestLazyCores_9EBD8092C4109BB8-001/tempDir-001/collection1/data
   [junit4]   2> 69375 INFO  (TEST-TestLazyCores.testLazyLoad-seed#[9EBD8092C4109BB8]) [    x:collection1] o.a.s.c.CachingDirectoryFactory looking to close /export/home/jenkins/workspace/Lucene-Solr-trunk-Solaris/solr/build/solr-core/test/J0/temp/solr.core.TestLazyCores_9EBD8092C4109BB8-001/tempDir-001/collection1/data/index [CachedDir<<refCount=0;path=/export/home/jenkins/workspace/Lucene-Solr-trunk-Solaris/solr/build/solr-core/test/J0/temp/solr.core.TestLazyCores_9EBD8092C4109BB8-001/tempDir-001/collection1/data/index;done=false>>]
   [junit4]   2> 69375 INFO  (TEST-TestLazyCores.testLazyLoad-seed#[9EBD8092C4109BB8]) [    x:collection1] o.a.s.c.CachingDirectoryFactory Closing directory: /export/home/jenkins/workspace/Lucene-Solr-trunk-Solaris/solr/build/solr-core/test/J0/temp/solr.core.TestLazyCores_9EBD8092C4109BB8-001/tempDir-001/collection1/data/index
   [junit4]   2> 69375 INFO  (TEST-TestLazyCores.testLazyLoad-seed#[9EBD8092C4109BB8]) [    x:collectionLazy4] o.a.s.c.SolrCore [collectionLazy4]  CLOSING SolrCore org.apache.solr.core.SolrCore@5376af30
   [junit4]   2> 69375 INFO  (TEST-TestLazyCores.testLazyLoad-seed#[9EBD8092C4109BB8]) [    x:collectionLazy4] o.a.s.u.UpdateHandler closing DirectUpdateHandler2{commits=0,autocommits=0,soft autocommits=0,optimizes=0,rollbacks=0,expungeDeletes=0,docsPending=0,adds=0,deletesById=0,deletesByQuery=0,errors=0,cumulative_adds=0,cumulative_deletesById=0,cumulative_deletesByQuery=0,cumulative_errors=0}
   [junit4]   2> 69375 INFO  (TEST-TestLazyCores.testLazyLoad-seed#[9EBD8092C4109BB8]) [    x:collectionLazy4] o.a.s.u.SolrCoreState Closing SolrCoreState
   [junit4]   2> 69375 INFO  (TEST-TestLazyCores.testLazyLoad-seed#[9EBD8092C4109BB8]) [    x:collectionLazy4] o.a.s.u.DefaultSolrCoreState SolrCoreState ref count has reached 0 - closing IndexWriter
   [junit4]   2> 69375 INFO  (TEST-TestLazyCores.testLazyLoad-seed#[9EBD8092C4109BB8]) [    x:collectionLazy4] o.a.s.u.DefaultSolrCoreState closing IndexWriter with IndexWriterCloser
   [junit4]   2> 69376 INFO  (TEST-TestLazyCores.testLazyLoad-seed#[9EBD8092C4109BB8]) [    x:collectionLazy4] o.a.s.c.SolrCore [collectionLazy4] Closing main searcher on request.
   [junit4]   2> 69376 INFO  (TEST-TestLazyCores.testLazyLoad-seed#[9EBD8092C4109BB8]) [    x:collectionLazy4] o.a.s.c.CachingDirectoryFactory Closing MockDirectoryFactory - 2 directories currently being tracked
   [junit4]   2> 69376 INFO  (TEST-TestLazyCores.testLazyLoad-seed#[9EBD8092C4109BB8]) [    x:collectionLazy4] o.a.s.c.CachingDirectoryFactory looking to close /export/home/jenkins/workspace/Lucene-Solr-trunk-Solaris/solr/build/solr-core/test/J0/temp/solr.core.TestLazyCores_9EBD8092C4109BB8-001/tempDir-001/collection4/data [CachedDir<<refCount=0;path=/export/home/jenkins/workspace/Lucene-Solr-trunk-Solaris/solr/build/solr-core/test/J0/temp/solr.core.TestLazyCores_9EBD8092C4109BB8-001/tempDir-001/collection4/data;done=false>>]
   [junit4]   2> 69376 INFO  (TEST-TestLazyCores.testLazyLoad-seed#[9EBD8092C4109BB8]) [    x:collectionLazy4] o.a.s.c.CachingDirectoryFactory Closing directory: /export/home/jenkins/workspace/Lucene-Solr-trunk-Solaris/solr/build/solr-core/test/J0/temp/solr.core.TestLazyCores_9EBD8092C4109BB8-001/tempDir-001/collection4/data
   [junit4]   2> 69376 INFO  (TEST-TestLazyCores.testLazyLoad-seed#[9EBD8092C4109BB8]) [    x:collectionLazy4] o.a.s.c.CachingDirectoryFactory looking to close /export/home/jenkins/workspace/Lucene-Solr-trunk-Solaris/solr/build/solr-core/test/J0/temp/solr.core.TestLazyCores_9EBD8092C4109BB8-001/tempDir-001/collection4/data/index [CachedDir<<refCount=0;path=/export/home/jenkins/workspace/Lucene-Solr-trunk-Solaris/solr/build/solr-core/test/J0/temp/solr.core.TestLazyCores_9EBD8092C4109BB8-001/tempDir-001/collection4/data/index;done=false>>]
   [junit4]   2> 69376 INFO  (TEST-TestLazyCores.testLazyLoad-seed#[9EBD8092C4109BB8]) [    x:collectionLazy4] o.a.s.c.CachingDirectoryFactory Closing directory: /export/home/jenkins/workspace/Lucene-Solr-trunk-Solaris/solr/build/solr-core/test/J0/temp/solr.core.TestLazyCores_9EBD8092C4109BB8-001/tempDir-001/collection4/data/index
   [junit4]   2> 69376 INFO  (TEST-TestLazyCores.testLazyLoad-seed#[9EBD8092C4109BB8]) [    x:collectionLazy2] o.a.s.c.SolrCore [collectionLazy2]  CLOSING SolrCore org.apache.solr.core.SolrCore@1ee9f015
   [junit4]   2> 69376 INFO  (TEST-TestLazyCores.testLazyLoad-seed#[9EBD8092C4109BB8]) [    x:collectionLazy2] o.a.s.u.UpdateHandler closing DirectUpdateHandler2{commits=0,autocommits=0,soft autocommits=0,optimizes=0,rollbacks=0,expungeDeletes=0,docsPending=0,adds=0,deletesById=0,deletesByQuery=0,errors=0,cumulative_adds=0,cumulative_deletesById=0,cumulative_deletesByQuery=0,cumulative_errors=0}
   [junit4]   2> 69377 INFO  (TEST-TestLazyCores.testLazyLoad-seed#[9EBD8092C4109BB8]) [    x:collectionLazy2] o.a.s.u.SolrCoreState Closing SolrCoreState
   [junit4]   2> 69377 INFO  (TEST-TestLazyCores.testLazyLoad-seed#[9EBD8092C4109BB8]) [    x:collectionLazy2] o.a.s.u.DefaultSolrCoreState SolrCoreState ref count has reached 0 - closing IndexWriter
   [junit4]   2> 69377 INFO  (TEST-TestLazyCores.testLazyLoad-seed#[9EBD8092C4109BB8]) [    x:collectionLazy2] o.a.s.u.DefaultSolrCoreState closing IndexWriter with IndexWriterCloser
   [junit4]   2> 69379 INFO  (TEST-TestLazyCores.testLazyLoad-seed#[9EBD8092C4109BB8]) [    x:collectionLazy2] o.a.s.c.SolrCore [collectionLazy2] Closing main searcher on request.
   [junit4]   2> 69379 INFO  (TEST-TestLazyCores.testLazyLoad-seed#[9EBD8092C4109BB8]) [    x:collectionLazy2] o.a.s.c.CachingDirectoryFactory Closing MockDirectoryFactory - 2 directories currently being tracked
   [junit4]   2> 69379 INFO  (TEST-TestLazyCores.testLazyLoad-seed#[9EBD8092C4109BB8]) [    x:collectionLazy2] o.a.s.c.CachingDirectoryFactory looking to close /export/home/jenkins/workspace/Lucene-Solr-trunk-Solaris/solr/build/solr-core/test/J0/temp/solr.core.TestLazyCores_9EBD8092C4109BB8-001/tempDir-001/collection2/data/index [CachedDir<<refCount=0;path=/export/home/jenkins/workspace/Lucene-Solr-trunk-Solaris/solr/build/solr-core/test/J0/temp/solr.core.TestLazyCores_9EBD8092C4109BB8-001/tempDir-001/collection2/data/index;done=false>>]
   [junit4]   2> 69379 INFO  (TEST-TestLazyCores.testLazyLoad-seed#[9EBD8092C4109BB8]) [    x:collectionLazy2] o.a.s.c.CachingDirectoryFactory Closing directory: /export/home/jenkins/workspace/Lucene-Solr-trunk-Solaris/solr/build/solr-core/test/J0/temp/solr.core.TestLazyCores_9EBD8092C4109BB8-001/tempDir-001/collection2/data/index
   [junit4]   2> 69379 INFO  (TEST-TestLazyCores.testLazyLoad-seed#[9EBD8092C4109BB8]) [    x:collectionLazy2] o.a.s.c.CachingDirectoryFactory looking to close /export/home/jenkins/workspace/Lucene-Solr-trunk-Solaris/solr/build/solr-core/test/J0/temp/solr.core.TestLazyCores_9EBD8092C4109BB8-001/tempDir-001/collection2/data [CachedDir<<refCount=0;path=/export/home/jenkins/workspace/Lucene-Solr-trunk-Solaris/solr/build/solr-core/test/J0/temp/solr.core.TestLazyCores_9EBD8092C4109BB8-001/tempDir-001/collection2/data;done=false>>]
   [junit4]   2> 69379 INFO  (TEST-TestLazyCores.testLazyLoad-seed#[9EBD8092C4109BB8]) [    x:collectionLazy2] o.a.s.c.CachingDirectoryFactory Closing directory: /export/home/jenkins/workspace/Lucene-Solr-trunk-Solaris/solr/build/solr-core/test/J0/temp/solr.core.TestLazyCores_9EBD8092C4109BB8-001/tempDir-001/collection2/data
   [junit4]   2> 69380 INFO  (TEST-TestLazyCores.testLazyLoad-seed#[9EBD8092C4109BB8]) [    x:collectionLazy3] o.a.s.c.SolrCore [collectionLazy3]  CLOSING SolrCore org.apache.solr.core.SolrCore@2ecedad8
   [junit4]   2> 69380 INFO  (TEST-TestLazyCores.testLazyLoad-seed#[9EBD8092C4109BB8]) [    x:collectionLazy3] o.a.s.u.UpdateHandler closing DirectUpdateHandler2{commits=0,autocommits=0,soft autocommits=0,optimizes=0,rollbacks=0,expungeDeletes=0,docsPending=0,adds=0,deletesById=0,deletesByQuery=0,errors=0,cumulative_adds=0,cumulative_deletesById=0,cumulative_deletesByQuery=0,cumulative_errors=0}
   [junit4]   2> 69380 INFO  (TEST-TestLazyCores.testLazyLoad-seed#[9EBD8092C4109BB8]) [    x:collectionLazy3] o.a.s.u.SolrCoreState Closing SolrCoreState
   [junit4]   2> 69380 INFO  (TEST-TestLazyCores.testLazyLoad-seed#[9EBD8092C4109BB8]) [    x:collectionLazy3] o.a.s.u.DefaultSolrCoreState SolrCoreState ref count has reached 0 - closing IndexWriter
   [junit4]   2> 69380 INFO  (TEST-TestLazyCores.testLazyLoad-seed#[9EBD8092C4109BB8]) [    x:collectionLazy3] o.a.s.u.DefaultSolrCoreState closing IndexWriter with IndexWriterCloser
   [junit4]   2> 69380 INFO  (TEST-TestLazyCores.testLazyLoad-seed#[9EBD8092C4109BB8]) [    x:collectionLazy3] o.a.s.c.SolrCore [collectionLazy3] Closing main searcher on request.
   [junit4]   2> 69380 INFO  (TEST-TestLazyCores.testLazyLoad-seed#[9EBD8092C4109BB8]) [    x:collectionLazy3] o.a.s.c.CachingDirectoryFactory Closing MockDirectoryFactory - 2 directories currently being tracked
   [junit4]   2> 69380 INFO  (TEST-TestLazyCores.testLazyLoad-seed#[9EBD8092C4109BB8]) [    x:collectionLazy3] o.a.s.c.CachingDirectoryFactory looking to close /export/home/jenkins/workspace/Lucene-Solr-trunk-Solaris/solr/build/solr-core/test/J0/temp/solr.core.TestLazyCores_9EBD8092C4109BB8-001/tempDir-001/collection3/data/index [CachedDir<<refCount=0;path=/export/home/jenkins/workspace/Lucene-Solr-trunk-Solaris/solr/build/solr-core/test/J0/temp/solr.core.TestLazyCores_9EBD8092C4109BB8-001/tempDir-001/collection3/data/index;done=false>>]
   [junit4]   2> 69380 INFO  (TEST-TestLazyCores.testLazyLoad-seed#[9EBD8092C4109BB8]) [    x:collectionLazy3] o.a.s.c.CachingDirectoryFactory Closing directory: /export/home/jenkins/workspace/Lucene-Solr-trunk-Solaris/solr/build/solr-core/test/J0/temp/solr.core.TestLazyCores_9EBD8092C4109BB8-001/tempDir-001/collection3/data/index
   [junit4]   2> 69380 INFO  (TEST-TestLazyCores.testLazyLoad-seed#[9EBD8092C4109BB8]) [    x:collectionLazy3] o.a.s.c.CachingDirectoryFactory looking to close /export/home/jenkins/workspace/Lucene-Solr-trunk-Solaris/solr/build/solr-core/test/J0/temp/solr.core.TestLazyCores_9EBD8092C4109BB8-001/tempDir-001/collection3/data [CachedDir<<refCount=0;path=/export/home/jenkins/workspace/Lucene-Solr-trunk-Solaris/solr/build/solr-core/test/J0/temp/solr.core.TestLazyCores_9EBD8092C4109BB8-001/tempDir-001/collection3/data;done=false>>]
   [junit4]   2> 69380 INFO  (TEST-TestLazyCores.testLazyLoad-seed#[9EBD8092C4109BB8]) [    x:collectionLazy3] o.a.s.c.CachingDirectoryFactory Closing directory: /export/home/jenkins/workspace/Lucene-Solr-trunk-Solaris/solr/build/solr-core/test/J0/temp/solr.core.TestLazyCores_9EBD8092C4109BB8-001/tempDir-001/collection3/data
   [junit4]   2> 69380 INFO  (TEST-TestLazyCores.testLazyLoad-seed#[9EBD8092C4109BB8]) [    x:collectionLazy3] o.a.s.SolrTestCaseJ4 ###Ending testLazyLoad
   [junit4]   2> 69383 INFO  (TEST-TestLazyCores.testCachingLimit-seed#[9EBD8092C4109BB8]) [    x:collectionLazy3] o.a.s.SolrTestCaseJ4 ###Starting testCachingLimit
   [junit4]   2> 69406 INFO  (TEST-TestLazyCores.testCachingLimit-seed#[9EBD8092C4109BB8]) [    x:collectionLazy3] o.a.s.c.SolrResourceLoader new SolrResourceLoader for directory: '/export/home/jenkins/workspace/Lucene-Solr-trunk-Solaris/solr/build/solr-core/test/J0/temp/solr.core.TestLazyCores_9EBD8092C4109BB8-001/tempDir-002/'
   [junit4]   2> 69406 INFO  (TEST-TestLazyCores.testCachingLimit-seed#[9EBD8092C4109BB8]) [    x:collectionLazy3] o.a.s.c.SolrResourceLoader JNDI not configured for solr (NoInitialContextEx)
   [junit4]   2> 69406 INFO  (TEST-TestLazyCores.testCachingLimit-seed#[9EBD8092C4109BB8]) [    x:collectionLazy3] o.a.s.c.SolrResourceLoader solr home defaulted to 'solr/' (could not find system property or JNDI)
   [junit4]   2> 69425 INFO  (TEST-TestLazyCores.testCachingLimit-seed#[9EBD8092C4109BB8]) [    x:collectionLazy3] o.a.s.c.CoreContainer New CoreContainer 1047713696
   [junit4]   2> 69425 INFO  (TEST-TestLazyCores.testCachingLimit-seed#[9EBD8092C4109BB8]) [    x:collectionLazy3] o.a.s.c.CoreContainer Loading cores into CoreContainer [instanceDir=/export/home/jenkins/workspace/Lucene-Solr-trunk-Solaris/solr/build/solr-core/test/J0/temp/solr.core.TestLazyCores_9EBD8092C4109BB8-001/tempDir-002/]
   [junit4]   2> 69425 INFO  (TEST-TestLazyCores.testCachingLimit-seed#[9EBD8092C4109BB8]) [    x:collectionLazy3] o.a.s.c.CoreContainer loading shared library: /export/home/jenkins/workspace/Lucene-Solr-trunk-Solaris/solr/build/solr-core/test/J0/temp/solr.core.TestLazyCores_9EBD8092C4109BB8-001/tempDir-002/lib
   [junit4]   2> 69426 WARN  (TEST-TestLazyCores.testCachingLimit-seed#[9EBD8092C4109BB8]) [    x:collectionLazy3] o.a.s.c.SolrResourceLoader Can't find (or read) directory to add to classloader: lib (resolved as: /export/home/jenkins/workspace/Lucene-Solr-trunk-Solaris/solr/build/solr-core/test/J0/temp/solr.core.TestLazyCores_9EBD8092C4109BB8-001/tempDir-002/lib).
   [junit4]   2> 69435 INFO  (TEST-TestLazyCores.testCachingLimit-seed#[9EBD8092C4109BB8]) [    x:collectionLazy3] o.a.s.h.c.HttpShardHandlerFactory created with socketTimeout : 600000,connTimeout : 60000,maxConnectionsPerHost : 20,maxConnections : 10000,corePoolSize : 0,maximumPoolSize : 2147483647,maxThreadIdleTime : 5,sizeOfQueue : -1,fairnessPolicy : false,useRetries : false,
   [junit4]   2> 69439 INFO  (TEST-TestLazyCores.testCachingLimit-seed#[9EBD8092C4109BB8]) [    x:collectionLazy3] o.a.s.u.UpdateShardHandler Creating UpdateShardHandler HTTP client with params: socketTimeout=600000&connTimeout=60000&retry=true
   [junit4]   2> 69444 INFO  (TEST-TestLazyCores.testCachingLimit-seed#[9EBD8092C4109BB8]) [    x:collectionLazy3] o.a.s.c.CoreContainer Allocating transient cache for 4 transient cores
   [junit4]   2> 69444 INFO  (TEST-TestLazyCores.testCachingLimit-seed#[9EBD8092C4109BB8]) [    x:collectionLazy3] o.a.s.l.LogWatcher SLF4J impl is org.slf4j.impl.Log4jLoggerFactory
   [junit4]   2> 69444 INFO  (TEST-TestLazyCores.testCachingLimit-seed#[9EBD8092C4109BB8]) [    x:collectionLazy3] o.a.s.l.LogWatcher Registering Log Listener [Log4j (org.slf4j.impl.Log4jLoggerFactory)]
   [junit4]   2> 69444 INFO  (TEST-TestLazyCores.testCachingLimit-seed#[9EBD8092C4109BB8]) [    x:collectionLazy3] o.a.s.c.CoreContainer Security conf doesn't exist. Skipping setup for authorization module.
   [junit4]   2> 69445 INFO  (TEST-TestLazyCores.testCachingLimit-seed#[9EBD8092C4109BB8]) [    x:collectionLazy3] o.a.s.c.CoreContainer No authentication plugin used.
   [junit4]   2> 69446 INFO  (TEST-TestLazyCores.testCachingLimit-seed#[9EBD8092C4109BB8]) [    x:collectionLazy3] o.a.s.c.SolrCore Created CoreDescriptor: {name=collection1, config=solrconfig.xml, transient=false, schema=schema.xml, loadOnStartup=true, configSetProperties=configsetprops.json, instanceDir=collection1, absoluteInstDir=/export/home/jenkins/workspace/Lucene-Solr-trunk-Solaris/solr/build/solr-core/test/J0/temp/solr.core.TestLazyCores_9EBD8092C4109BB8-001/tempDir-002/collection1/, dataDir=data/}
   [junit4]   2> 69446 INFO  (TEST-TestLazyCores.testCachingLimit-seed#[9EBD8092C4109BB8]) [    x:collectionLazy3] o.a.s.c.SolrCore Created CoreDescriptor: {name=collectionLazy2, config=solrconfig.xml, transient=true, schema=schema.xml, loadOnStartup=true, configSetProperties=configsetprops.json, instanceDir=collection2, absoluteInstDir=/export/home/jenkins/workspace/Lucene-Solr-trunk-Solaris/solr/build/solr-core/test/J0/temp/solr.core.TestLazyCores_9EBD8092C4109BB8-001/tempDir-002/collection2/, dataDir=data/}
   [junit4]   2> 69446 INFO  (TEST-TestLazyCores.testCachingLimit-seed#[9EBD8092C4109BB8]) [    x:collectionLazy3] o.a.s.c.SolrCore Created CoreDescriptor: {name=collectionLazy3, config=solrconfig.xml, transient=on, schema=schema.xml, loadOnStartup=false, configSetProperties=configsetprops.json, instanceDir=collection3, absoluteInstDir=/export/home/jenkins/workspace/Lucene-Solr-trunk-Solaris/solr/build/solr-core/test/J0/temp/solr.core.TestLazyCores_9EBD8092C4109BB8-001/tempDir-002/collection3/, dataDir=data/}
   [junit4]   2> 69446 INFO  (TEST-TestLazyCores.testCachingLimit-seed#[9EBD8092C4109BB8]) [    x:collectionLazy3] o.a.s.c.SolrCore Created CoreDescriptor: {name=collectionLazy4, config=solrconfig.xml, transient=false, schema=schema.xml, loadOnStartup=false, configSetProperties=configsetprops.json, instanceDir=collection4, absoluteInstDir=/export/home/jenkins/workspace/Lucene-Solr-trunk-Solaris/solr/build/solr-core/test/J0/temp/solr.core.TestLazyCores_9EBD8092C4109BB8-001/tempDir-002/collection4/, dataDir=data/}
   [junit4]   2> 69447 INFO  (TEST-TestLazyCores.testCachingLimit-seed#[9EBD8092C4109BB8]) [    x:collectionLazy3] o.a.s.c.SolrCore Created CoreDescriptor: {name=collectionLazy5, config=solrconfig.xml, transient=false, schema=schema.xml, loadOnStartup=true, configSetProperties=configsetprops.json, instanceDir=collection5, absoluteInstDir=/export/home/jenkins/workspace/Lucene-Solr-trunk-Solaris/solr/build/solr-core/test/J0/temp/solr.core.TestLazyCores_9EBD8092C4109BB8-001/tempDir-002/collection5/, dataDir=data/}
   [junit4]   2> 69447 INFO  (TEST-T

[...truncated too long message...]

azy6] o.a.s.c.CachingDirectoryFactory Closing MockDirectoryFactory - 2 directories currently being tracked
   [junit4]   2> 74033 INFO  (TEST-TestLazyCores.testCreateSame-seed#[9EBD8092C4109BB8]) [    x:collectionLazy6] o.a.s.c.CachingDirectoryFactory looking to close /export/home/jenkins/workspace/Lucene-Solr-trunk-Solaris/solr/build/solr-core/test/J0/temp/solr.core.TestLazyCores_9EBD8092C4109BB8-001/tempDir-007/collection6/data [CachedDir<<refCount=0;path=/export/home/jenkins/workspace/Lucene-Solr-trunk-Solaris/solr/build/solr-core/test/J0/temp/solr.core.TestLazyCores_9EBD8092C4109BB8-001/tempDir-007/collection6/data;done=false>>]
   [junit4]   2> 74033 INFO  (TEST-TestLazyCores.testCreateSame-seed#[9EBD8092C4109BB8]) [    x:collectionLazy6] o.a.s.c.CachingDirectoryFactory Closing directory: /export/home/jenkins/workspace/Lucene-Solr-trunk-Solaris/solr/build/solr-core/test/J0/temp/solr.core.TestLazyCores_9EBD8092C4109BB8-001/tempDir-007/collection6/data
   [junit4]   2> 74033 INFO  (TEST-TestLazyCores.testCreateSame-seed#[9EBD8092C4109BB8]) [    x:collectionLazy6] o.a.s.c.CachingDirectoryFactory looking to close /export/home/jenkins/workspace/Lucene-Solr-trunk-Solaris/solr/build/solr-core/test/J0/temp/solr.core.TestLazyCores_9EBD8092C4109BB8-001/tempDir-007/collection6/data/index [CachedDir<<refCount=0;path=/export/home/jenkins/workspace/Lucene-Solr-trunk-Solaris/solr/build/solr-core/test/J0/temp/solr.core.TestLazyCores_9EBD8092C4109BB8-001/tempDir-007/collection6/data/index;done=false>>]
   [junit4]   2> 74033 INFO  (TEST-TestLazyCores.testCreateSame-seed#[9EBD8092C4109BB8]) [    x:collectionLazy6] o.a.s.c.CachingDirectoryFactory Closing directory: /export/home/jenkins/workspace/Lucene-Solr-trunk-Solaris/solr/build/solr-core/test/J0/temp/solr.core.TestLazyCores_9EBD8092C4109BB8-001/tempDir-007/collection6/data/index
   [junit4]   2> 74033 INFO  (TEST-TestLazyCores.testCreateSame-seed#[9EBD8092C4109BB8]) [    x:collectionLazy6] o.a.s.SolrTestCaseJ4 ###Ending testCreateSame
   [junit4]   2> 74033 INFO  (SUITE-TestLazyCores-seed#[9EBD8092C4109BB8]-worker) [    x:collectionLazy6] o.a.s.SolrTestCaseJ4 ###deleteCore
   [junit4]   2> 74033 INFO  (SUITE-TestLazyCores-seed#[9EBD8092C4109BB8]-worker) [    x:collectionLazy6] o.a.s.c.CoreContainer Shutting down CoreContainer instance=1793649330
   [junit4]   2> 195215 ERROR (SUITE-TestLazyCores-seed#[9EBD8092C4109BB8]-worker) [    x:collectionLazy6] o.a.s.SolrTestCaseJ4 ERROR: SolrIndexSearcher opens=51 closes=50
   [junit4]   2> Oct 10, 2015 6:21:42 PM com.carrotsearch.randomizedtesting.ThreadLeakControl checkThreadLeaks
   [junit4]   2> WARNING: Will linger awaiting termination of 1 leaked thread(s).
   [junit4]   2> Oct 10, 2015 6:22:02 PM com.carrotsearch.randomizedtesting.ThreadLeakControl checkThreadLeaks
   [junit4]   2> SEVERE: 1 thread leaked from SUITE scope at org.apache.solr.core.TestLazyCores: 
   [junit4]   2>    1) Thread[id=483, name=searcherExecutor-185-thread-1, state=WAITING, group=TGRP-TestLazyCores]
   [junit4]   2>         at sun.misc.Unsafe.park(Native Method)
   [junit4]   2>         at java.util.concurrent.locks.LockSupport.park(LockSupport.java:175)
   [junit4]   2>         at java.util.concurrent.locks.AbstractQueuedSynchronizer$ConditionObject.await(AbstractQueuedSynchronizer.java:2039)
   [junit4]   2>         at java.util.concurrent.LinkedBlockingQueue.take(LinkedBlockingQueue.java:442)
   [junit4]   2>         at java.util.concurrent.ThreadPoolExecutor.getTask(ThreadPoolExecutor.java:1067)
   [junit4]   2>         at java.util.concurrent.ThreadPoolExecutor.runWorker(ThreadPoolExecutor.java:1127)
   [junit4]   2>         at java.util.concurrent.ThreadPoolExecutor$Worker.run(ThreadPoolExecutor.java:617)
   [junit4]   2>         at java.lang.Thread.run(Thread.java:745)
   [junit4]   2> Oct 10, 2015 6:22:02 PM com.carrotsearch.randomizedtesting.ThreadLeakControl tryToInterruptAll
   [junit4]   2> INFO: Starting to interrupt leaked threads:
   [junit4]   2>    1) Thread[id=483, name=searcherExecutor-185-thread-1, state=WAITING, group=TGRP-TestLazyCores]
   [junit4]   2> Oct 10, 2015 6:22:05 PM com.carrotsearch.randomizedtesting.ThreadLeakControl tryToInterruptAll
   [junit4]   2> SEVERE: There are still zombie threads that couldn't be terminated:
   [junit4]   2>    1) Thread[id=483, name=searcherExecutor-185-thread-1, state=WAITING, group=TGRP-TestLazyCores]
   [junit4]   2>         at sun.misc.Unsafe.park(Native Method)
   [junit4]   2>         at java.util.concurrent.locks.LockSupport.park(LockSupport.java:175)
   [junit4]   2>         at java.util.concurrent.locks.AbstractQueuedSynchronizer$ConditionObject.await(AbstractQueuedSynchronizer.java:2039)
   [junit4]   2>         at java.util.concurrent.LinkedBlockingQueue.take(LinkedBlockingQueue.java:442)
   [junit4]   2>         at java.util.concurrent.ThreadPoolExecutor.getTask(ThreadPoolExecutor.java:1067)
   [junit4]   2>         at java.util.concurrent.ThreadPoolExecutor.runWorker(ThreadPoolExecutor.java:1127)
   [junit4]   2>         at java.util.concurrent.ThreadPoolExecutor$Worker.run(ThreadPoolExecutor.java:617)
   [junit4]   2>         at java.lang.Thread.run(Thread.java:745)
   [junit4]   2> NOTE: test params are: codec=CheapBastard, sim=ClassicSimilarity, locale=sr_RS, timezone=America/Puerto_Rico
   [junit4]   2> NOTE: SunOS 5.11 amd64/Oracle Corporation 1.8.0_60 (64-bit)/cpus=3,threads=2,free=27420440,total=113434624
   [junit4]   2> NOTE: All tests run in this JVM: [TestSort, DOMUtilTest, PathHierarchyTokenizerFactoryTest, SOLR749Test, XmlUpdateRequestHandlerTest, ShardRoutingTest, TestLazyCores]
   [junit4]   2> NOTE: reproduce with: ant test  -Dtestcase=TestLazyCores -Dtests.seed=9EBD8092C4109BB8 -Dtests.slow=true -Dtests.locale=sr_RS -Dtests.timezone=America/Puerto_Rico -Dtests.asserts=true -Dtests.file.encoding=UTF-8
   [junit4] ERROR   0.00s J0 | TestLazyCores (suite) <<<
   [junit4]    > Throwable #1: java.lang.AssertionError: ERROR: SolrIndexSearcher opens=51 closes=50
   [junit4]    > 	at __randomizedtesting.SeedInfo.seed([9EBD8092C4109BB8]:0)
   [junit4]    > 	at org.apache.solr.SolrTestCaseJ4.endTrackingSearchers(SolrTestCaseJ4.java:467)
   [junit4]    > 	at org.apache.solr.SolrTestCaseJ4.afterClass(SolrTestCaseJ4.java:233)
   [junit4]    > 	at java.lang.Thread.run(Thread.java:745)Throwable #2: com.carrotsearch.randomizedtesting.ThreadLeakError: 1 thread leaked from SUITE scope at org.apache.solr.core.TestLazyCores: 
   [junit4]    >    1) Thread[id=483, name=searcherExecutor-185-thread-1, state=WAITING, group=TGRP-TestLazyCores]
   [junit4]    >         at sun.misc.Unsafe.park(Native Method)
   [junit4]    >         at java.util.concurrent.locks.LockSupport.park(LockSupport.java:175)
   [junit4]    >         at java.util.concurrent.locks.AbstractQueuedSynchronizer$ConditionObject.await(AbstractQueuedSynchronizer.java:2039)
   [junit4]    >         at java.util.concurrent.LinkedBlockingQueue.take(LinkedBlockingQueue.java:442)
   [junit4]    >         at java.util.concurrent.ThreadPoolExecutor.getTask(ThreadPoolExecutor.java:1067)
   [junit4]    >         at java.util.concurrent.ThreadPoolExecutor.runWorker(ThreadPoolExecutor.java:1127)
   [junit4]    >         at java.util.concurrent.ThreadPoolExecutor$Worker.run(ThreadPoolExecutor.java:617)
   [junit4]    >         at java.lang.Thread.run(Thread.java:745)
   [junit4]    > 	at __randomizedtesting.SeedInfo.seed([9EBD8092C4109BB8]:0)Throwable #3: com.carrotsearch.randomizedtesting.ThreadLeakError: There are still zombie threads that couldn't be terminated:
   [junit4]    >    1) Thread[id=483, name=searcherExecutor-185-thread-1, state=WAITING, group=TGRP-TestLazyCores]
   [junit4]    >         at sun.misc.Unsafe.park(Native Method)
   [junit4]    >         at java.util.concurrent.locks.LockSupport.park(LockSupport.java:175)
   [junit4]    >         at java.util.concurrent.locks.AbstractQueuedSynchronizer$ConditionObject.await(AbstractQueuedSynchronizer.java:2039)
   [junit4]    >         at java.util.concurrent.LinkedBlockingQueue.take(LinkedBlockingQueue.java:442)
   [junit4]    >         at java.util.concurrent.ThreadPoolExecutor.getTask(ThreadPoolExecutor.java:1067)
   [junit4]    >         at java.util.concurrent.ThreadPoolExecutor.runWorker(ThreadPoolExecutor.java:1127)
   [junit4]    >         at java.util.concurrent.ThreadPoolExecutor$Worker.run(ThreadPoolExecutor.java:617)
   [junit4]    >         at java.lang.Thread.run(Thread.java:745)
   [junit4]    > 	at __randomizedtesting.SeedInfo.seed([9EBD8092C4109BB8]:0)
   [junit4] Completed [32/548] on J0 in 149.53s, 7 tests, 1 failure, 2 errors <<< FAILURES!

[...truncated 1590 lines...]
BUILD FAILED
/export/home/jenkins/workspace/Lucene-Solr-trunk-Solaris/build.xml:775: The following error occurred while executing this line:
/export/home/jenkins/workspace/Lucene-Solr-trunk-Solaris/build.xml:719: The following error occurred while executing this line:
/export/home/jenkins/workspace/Lucene-Solr-trunk-Solaris/build.xml:59: The following error occurred while executing this line:
/export/home/jenkins/workspace/Lucene-Solr-trunk-Solaris/solr/build.xml:233: The following error occurred while executing this line:
/export/home/jenkins/workspace/Lucene-Solr-trunk-Solaris/solr/common-build.xml:516: The following error occurred while executing this line:
/export/home/jenkins/workspace/Lucene-Solr-trunk-Solaris/lucene/common-build.xml:1432: The following error occurred while executing this line:
/export/home/jenkins/workspace/Lucene-Solr-trunk-Solaris/lucene/common-build.xml:987: There were test failures: 548 suites (8 ignored), 2150 tests, 3 suite-level errors, 1545 ignored (25 assumptions) [seed: 9EBD8092C4109BB8]

Total time: 47 minutes 15 seconds
Build step 'Invoke Ant' marked build as failure
Archiving artifacts
[WARNINGS] Skipping publisher since build result is FAILURE
Recording test results
Email was triggered for: Failure - Any
Sending email for trigger: Failure - Any