You are viewing a plain text version of this content. The canonical link for it is here.
Posted to dev@pdfbox.apache.org by Apache Jenkins Server <je...@builds.apache.org> on 2014/02/08 17:05:13 UTC

Build failed in Jenkins: PDFBox 1.8.x » Apache PDFBox #62

See <https://builds.apache.org/job/PDFBox%201.8.x/org.apache.pdfbox$pdfbox/62/changes>

Changes:

[tilman] PDFBOX-1887: Bugfixes + Optimization of Gouraud Shading

------------------------------------------
[INFO]                                                                         
[INFO] ------------------------------------------------------------------------
[INFO] Building Apache PDFBox 1.8.5-SNAPSHOT
[INFO] ------------------------------------------------------------------------
[INFO] 
[INFO] --- maven-clean-plugin:2.4.1:clean (default-clean) @ pdfbox ---
[INFO] Deleting <https://builds.apache.org/job/PDFBox%201.8.x/org.apache.pdfbox$pdfbox/ws/target>
[INFO] 
[INFO] --- maven-remote-resources-plugin:1.2.1:process (default) @ pdfbox ---
[INFO] 
[INFO] --- maven-antrun-plugin:1.6:run (default) @ pdfbox ---
[INFO] Executing tasks

main:

find.adobefiles:

get.adobefiles:

testexist:

downloadfile:
    [unjar] Expanding: <https://builds.apache.org/job/PDFBox%201.8.x/org.apache.pdfbox$pdfbox/ws/download/pcfi-2010.08.09.jar> into <https://builds.apache.org/job/PDFBox%201.8.x/org.apache.pdfbox$pdfbox/ws/target/classes/org/apache/pdfbox/resources/afm>
    [unjar] Expanding: <https://builds.apache.org/job/PDFBox%201.8.x/org.apache.pdfbox$pdfbox/ws/download/pcfi-2010.08.09.jar> into <https://builds.apache.org/job/PDFBox%201.8.x/org.apache.pdfbox$pdfbox/ws/target/classes/org/apache/pdfbox/resources>
[INFO] Executed tasks
[INFO] 
[INFO] --- maven-resources-plugin:2.5:resources (default-resources) @ pdfbox ---
[debug] execute contextualize
[INFO] Using 'ISO-8859-1' encoding to copy filtered resources.
[INFO] Copying 191 resources
[INFO] Copying 3 resources
[INFO] 
[INFO] --- maven-compiler-plugin:2.3.2:compile (default-compile) @ pdfbox ---
[INFO] Compiling 522 source files to <https://builds.apache.org/job/PDFBox%201.8.x/org.apache.pdfbox$pdfbox/ws/target/classes>
[INFO] -------------------------------------------------------------
[ERROR] COMPILATION ERROR : 
[INFO] -------------------------------------------------------------
[ERROR] <https://builds.apache.org/job/PDFBox%201.8.x/org.apache.pdfbox$pdfbox/ws/src/main/java/org/apache/pdfbox/pdmodel/graphics/shading/GouraudShadingContext.java>:[223,5] method does not override a method from its superclass
[ERROR] <https://builds.apache.org/job/PDFBox%201.8.x/org.apache.pdfbox$pdfbox/ws/src/main/java/org/apache/pdfbox/pdmodel/graphics/shading/GouraudShadingContext.java>:[236,5] method does not override a method from its superclass
[ERROR] <https://builds.apache.org/job/PDFBox%201.8.x/org.apache.pdfbox$pdfbox/ws/src/main/java/org/apache/pdfbox/pdmodel/graphics/shading/GouraudShadingContext.java>:[259,5] method does not override a method from its superclass
[INFO] 3 errors 
[INFO] -------------------------------------------------------------

Jenkins build is back to normal : PDFBox 1.8.x » Apache PDFBox #63

Posted by Apache Jenkins Server <je...@builds.apache.org>.
See <https://builds.apache.org/job/PDFBox%201.8.x/org.apache.pdfbox$pdfbox/63/changes>