You are viewing a plain text version of this content. The canonical link for it is here.
Posted to yarn-dev@hadoop.apache.org by Apache Jenkins Server <je...@builds.apache.org> on 2013/10/05 05:23:06 UTC
Failed: YARN-1254 PreCommit Build #2116
Jira: https://issues.apache.org/jira/browse/YARN-1254
Build: https://builds.apache.org/job/PreCommit-YARN-Build/2116/
###################################################################################
########################## LAST 60 LINES OF THE CONSOLE ###########################
Started by user vinodkv
Building remotely on hadoop7 in workspace /home/jenkins/jenkins-slave/workspace/PreCommit-YARN-Build
Reverting /home/jenkins/jenkins-slave/workspace/PreCommit-YARN-Build/trunk to depth infinity with ignoreExternals: false
Updating http://svn.apache.org/repos/asf/hadoop/common/trunk at revision '2013-10-05T03:22:43.454 +0000'
At revision 1529381
Reverting /home/jenkins/jenkins-slave/workspace/PreCommit-YARN-Build/nightly to depth infinity with ignoreExternals: false
Updating http://svn.apache.org/repos/asf/hadoop/nightly at revision '2013-10-05T03:22:43.454 +0000'
At revision 1529381
no change for http://svn.apache.org/repos/asf/hadoop/common/trunk since the previous build
no change for http://svn.apache.org/repos/asf/hadoop/nightly since the previous build
No emails were triggered.
[PreCommit-YARN-Build] $ /bin/bash /tmp/hudson3754970359216201995.sh
32768
Running in Jenkins mode
======================================================================
======================================================================
Testing patch for YARN-1254.
======================================================================
======================================================================
At revision 1529381.
YARN-1254 is not "Patch Available". Exiting.
======================================================================
======================================================================
Finished build.
======================================================================
======================================================================
Archiving artifacts
Description set: YARN-1254
Recording test results
No test report files were found. Configuration error?
Build step 'Publish JUnit test result report' changed build result to FAILURE
Email was triggered for: Failure
Sending email for trigger: Failure
###################################################################################
############################## FAILED TESTS (if any) ##############################
No tests ran.
Success: YARN-1272 PreCommit Build #2117
Posted by Apache Jenkins Server <je...@builds.apache.org>.
Jira: https://issues.apache.org/jira/browse/YARN-1272
Build: https://builds.apache.org/job/PreCommit-YARN-Build/2117/
###################################################################################
########################## LAST 60 LINES OF THE CONSOLE ###########################
[...truncated 3049 lines...]
/bin/kill -9 11476
kill: No such process
NOP
{color:green}+1 overall{color}. Here are the results of testing the latest attachment
http://issues.apache.org/jira/secure/attachment/12606967/YARN-1272.patch
against trunk revision .
{color:green}+1 @author{color}. The patch does not contain any @author tags.
{color:green}+1 tests included{color}. The patch appears to include 1 new or modified test files.
{color:green}+1 javac{color}. The applied patch does not increase the total number of javac compiler warnings.
{color:green}+1 javadoc{color}. The javadoc tool did not generate any warning messages.
{color:green}+1 eclipse:eclipse{color}. The patch built with eclipse:eclipse.
{color:green}+1 findbugs{color}. The patch does not introduce any new Findbugs (version 1.3.9) warnings.
{color:green}+1 release audit{color}. The applied patch does not increase the total number of release audit warnings.
{color:green}+1 core tests{color}. The patch passed unit tests in hadoop-yarn-project/hadoop-yarn/hadoop-yarn-server/hadoop-yarn-server-nodemanager.
{color:green}+1 contrib tests{color}. The patch passed contrib unit tests.
Test results: https://builds.apache.org/job/PreCommit-YARN-Build/2117//testReport/
Console output: https://builds.apache.org/job/PreCommit-YARN-Build/2117//console
This message is automatically generated.
======================================================================
======================================================================
Adding comment to Jira.
======================================================================
======================================================================
Comment added.
9531d8df73e1a173209a371fd3fbb37bf4decfee logged out
======================================================================
======================================================================
Finished build.
======================================================================
======================================================================
Archiving artifacts
Description set: YARN-1272
Recording test results
Email was triggered for: Success
Sending email for trigger: Success
###################################################################################
############################## FAILED TESTS (if any) ##############################
All tests passed