You are viewing a plain text version of this content. The canonical link for it is here.
Posted to builds@beam.apache.org by Apache Jenkins Server <je...@builds.apache.org> on 2021/09/22 16:02:35 UTC

Build failed in Jenkins: beam_PerformanceTests_PubsubIOIT_Python_Streaming #471

See <https://ci-beam.apache.org/job/beam_PerformanceTests_PubsubIOIT_Python_Streaming/471/display/redirect?page=changes>

Changes:

[noreply] [BEAM-12919] Removed IBM Streams from runner matrix (#15542)

[danthev] Fix 2.32.0 release notes.

[noreply] [BEAM-12258] Re-throw exception from forked thread in

[kawaigin] [BEAM-10708] Added an example notebook for beam_sql magic

[noreply] Add a timeout for BQ streaming_insert RPCS (#15541)

[noreply] Merge pull request #15537 from [BEAM-12908] Add a sleep to the IT after


------------------------------------------
[...truncated 61.32 KB...]
  Using cached google_cloud_bigtable-1.2.0-py2.py3-none-any.whl (234 kB)
  Using cached google_cloud_bigtable-1.1.0-py2.py3-none-any.whl (234 kB)
  Using cached google_cloud_bigtable-1.0.0-py2.py3-none-any.whl (232 kB)
  Using cached google_cloud_bigtable-0.34.0-py2.py3-none-any.whl (232 kB)
  Using cached google_cloud_bigtable-0.33.0-py2.py3-none-any.whl (230 kB)
  Using cached google_cloud_bigtable-0.32.2-py2.py3-none-any.whl (156 kB)
  Using cached google_cloud_bigtable-0.32.1-py2.py3-none-any.whl (156 kB)
  Using cached google_cloud_bigtable-0.32.0-py2.py3-none-any.whl (155 kB)
  Using cached google_cloud_bigtable-0.31.1-py2.py3-none-any.whl (154 kB)
INFO: pip is looking at multiple versions of google-api-core[grpc] to determine which version is compatible with other requirements. This could take a while.
Collecting google-api-core[grpc]<3.0.0dev,>=1.29.0
  Using cached google_api_core-2.0.0-py2.py3-none-any.whl (92 kB)
  Using cached google_api_core-1.31.3-py2.py3-none-any.whl (93 kB)
Collecting protobuf<4,>=3.12.2
  Using cached protobuf-3.17.3-cp37-cp37m-manylinux_2_5_x86_64.manylinux1_x86_64.whl (1.0 MB)
Collecting google-auth<3,>=1.18.0
  Using cached google_auth-1.35.0-py2.py3-none-any.whl (152 kB)
Collecting google-crc32c<2.0dev,>=1.0
  Using cached google_crc32c-1.2.0-cp37-cp37m-manylinux_2_12_x86_64.manylinux2010_x86_64.whl (38 kB)
Collecting docopt
  Using cached docopt-0.6.2-py2.py3-none-any.whl
Requirement already satisfied: pyparsing<3,>=2.4.2 in <https://ci-beam.apache.org/job/beam_PerformanceTests_PubsubIOIT_Python_Streaming/ws/src/build/gradleenv/1329484227/lib/python3.7/site-packages> (from httplib2<0.20.0,>=0.8->apache-beam==2.34.0.dev0) (2.4.7)
Collecting pbr>=0.11
  Using cached pbr-5.6.0-py2.py3-none-any.whl (111 kB)
Collecting requests-oauthlib>=0.5.0
  Using cached requests_oauthlib-1.3.0-py2.py3-none-any.whl (23 kB)
Collecting isodate>=0.6.0
  Using cached isodate-0.6.0-py2.py3-none-any.whl (45 kB)
Collecting certifi>=2017.4.17
  Using cached certifi-2021.5.30-py2.py3-none-any.whl (145 kB)
Collecting pyasn1>=0.1.7
  Using cached pyasn1-0.4.8-py2.py3-none-any.whl (77 kB)
Requirement already satisfied: importlib-metadata>=0.12 in <https://ci-beam.apache.org/job/beam_PerformanceTests_PubsubIOIT_Python_Streaming/ws/src/build/gradleenv/1329484227/lib/python3.7/site-packages> (from pytest<5.0,>=4.4.0->apache-beam==2.34.0.dev0) (2.1.1)
Collecting wcwidth
  Using cached wcwidth-0.2.5-py2.py3-none-any.whl (30 kB)
Collecting more-itertools>=4.0.0
  Using cached more_itertools-8.10.0-py3-none-any.whl (51 kB)
Requirement already satisfied: py>=1.5.0 in <https://ci-beam.apache.org/job/beam_PerformanceTests_PubsubIOIT_Python_Streaming/ws/src/build/gradleenv/1329484227/lib/python3.7/site-packages> (from pytest<5.0,>=4.4.0->apache-beam==2.34.0.dev0) (1.10.0)
Collecting atomicwrites>=1.0
  Using cached atomicwrites-1.4.0-py2.py3-none-any.whl (6.8 kB)
Collecting pluggy<1.0,>=0.12
  Using cached pluggy-0.13.1-py2.py3-none-any.whl (18 kB)
Collecting attrs>=17.4.0
  Using cached attrs-21.2.0-py2.py3-none-any.whl (53 kB)
Requirement already satisfied: zipp>=0.5 in <https://ci-beam.apache.org/job/beam_PerformanceTests_PubsubIOIT_Python_Streaming/ws/src/build/gradleenv/1329484227/lib/python3.7/site-packages> (from importlib-metadata>=0.12->pytest<5.0,>=4.4.0->apache-beam==2.34.0.dev0) (3.5.0)
Collecting execnet>=1.1
  Using cached execnet-1.9.0-py2.py3-none-any.whl (39 kB)
Collecting pytest-forked
  Using cached pytest_forked-1.3.0-py2.py3-none-any.whl (4.7 kB)
Collecting idna<4,>=2.5
  Using cached idna-3.2-py3-none-any.whl (59 kB)
Collecting charset-normalizer~=2.0.0
  Using cached charset_normalizer-2.0.6-py3-none-any.whl (37 kB)
Collecting oauthlib>=3.0.0
  Using cached oauthlib-3.1.1-py2.py3-none-any.whl (146 kB)
Collecting greenlet!=0.4.17
  Using cached greenlet-1.1.1-cp37-cp37m-manylinux_2_17_x86_64.manylinux2014_x86_64.whl (143 kB)
Collecting wrapt
  Using cached wrapt-1.12.1-cp37-cp37m-linux_x86_64.whl
Collecting deprecation
  Using cached deprecation-2.1.0-py2.py3-none-any.whl (11 kB)
Collecting docker
  Using cached docker-5.0.2-py2.py3-none-any.whl (145 kB)
Collecting websocket-client>=0.32.0
  Using cached websocket_client-1.2.1-py2.py3-none-any.whl (52 kB)
Building wheels for collected packages: apache-beam
  Building wheel for apache-beam (setup.py): started
  Building wheel for apache-beam (setup.py): finished with status 'done'
  Created wheel for apache-beam: filename=apache_beam-2.34.0.dev0-py3-none-any.whl size=2547059 sha256=b92ee2ad32c2c240508e547946fa0905c7d1ee75a6d472a7c1765d32899dc907
  Stored in directory: /home/jenkins/.cache/pip/wheels/ab/30/db/7a1d878abb34081c011192312e662d364ee443467dfb553778
Successfully built apache-beam
Installing collected packages: pyasn1, urllib3, rsa, pyasn1-modules, protobuf, idna, charset-normalizer, certifi, cachetools, wcwidth, requests, pytz, python-dateutil, pycparser, pluggy, oauthlib, more-itertools, jmespath, googleapis-common-protos, google-auth, attrs, atomicwrites, websocket-client, requests-oauthlib, pytest, numpy, isodate, httplib2, grpcio-gcp, google-crc32c, google-api-core, docopt, cffi, botocore, wrapt, typing-extensions, s3transfer, pytest-forked, pymongo, pydot, pyarrow, proto-plus, pbr, orjson, oauth2client, msrest, hdfs, grpc-google-iam-v1, greenlet, google-resumable-media, google-cloud-core, fasteners, fastavro, execnet, docker, dill, deprecation, cryptography, crcmod, azure-core, avro-python3, testcontainers, tenacity, sqlalchemy, requests-mock, pyyaml, pytest-xdist, pytest-timeout, pyhamcrest, psycopg2-binary, parameterized, pandas, mock, google-cloud-vision, google-cloud-videointelligence, google-cloud-spanner, google-cloud-recommendations-ai, google-cloud-pubsub, google-cloud-language, google-cloud-dlp, google-cloud-datastore, google-cloud-bigtable, google-cloud-bigquery, google-apitools, freezegun, boto3, azure-storage-blob, apache-beam
  Attempting uninstall: protobuf
    Found existing installation: protobuf 3.18.0
    Uninstalling protobuf-3.18.0:
      Successfully uninstalled protobuf-3.18.0
  Attempting uninstall: pluggy
    Found existing installation: pluggy 1.0.0
    Uninstalling pluggy-1.0.0:
      Successfully uninstalled pluggy-1.0.0
Successfully installed apache-beam-2.34.0.dev0 atomicwrites-1.4.0 attrs-21.2.0 avro-python3-1.9.2.1 azure-core-1.18.0 azure-storage-blob-12.9.0 boto3-1.18.45 botocore-1.21.45 cachetools-4.2.2 certifi-2021.5.30 cffi-1.14.6 charset-normalizer-2.0.6 crcmod-1.7 cryptography-3.4.8 deprecation-2.1.0 dill-0.3.1.1 docker-5.0.2 docopt-0.6.2 execnet-1.9.0 fastavro-1.4.4 fasteners-0.16.3 freezegun-1.1.0 google-api-core-1.31.3 google-apitools-0.5.31 google-auth-1.35.0 google-cloud-bigquery-2.26.0 google-cloud-bigtable-1.7.0 google-cloud-core-1.7.2 google-cloud-datastore-1.15.3 google-cloud-dlp-1.0.0 google-cloud-language-1.3.0 google-cloud-pubsub-1.7.0 google-cloud-recommendations-ai-0.2.0 google-cloud-spanner-1.19.1 google-cloud-videointelligence-1.16.1 google-cloud-vision-1.0.0 google-crc32c-1.2.0 google-resumable-media-2.0.3 googleapis-common-protos-1.53.0 greenlet-1.1.1 grpc-google-iam-v1-0.12.3 grpcio-gcp-0.2.2 hdfs-2.6.0 httplib2-0.19.1 idna-3.2 isodate-0.6.0 jmespath-0.10.0 mock-2.0.0 more-itertools-8.10.0 msrest-0.6.21 numpy-1.20.3 oauth2client-4.1.3 oauthlib-3.1.1 orjson-3.6.3 pandas-1.2.5 parameterized-0.7.5 pbr-5.6.0 pluggy-0.13.1 proto-plus-1.19.0 protobuf-3.17.3 psycopg2-binary-2.9.1 pyarrow-4.0.1 pyasn1-0.4.8 pyasn1-modules-0.2.8 pycparser-2.20 pydot-1.4.2 pyhamcrest-1.10.1 pymongo-3.12.0 pytest-4.6.11 pytest-forked-1.3.0 pytest-timeout-1.4.2 pytest-xdist-1.34.0 python-dateutil-2.8.2 pytz-2021.1 pyyaml-5.4.1 requests-2.26.0 requests-mock-1.9.3 requests-oauthlib-1.3.0 rsa-4.7.2 s3transfer-0.5.0 sqlalchemy-1.4.24 tenacity-5.1.5 testcontainers-3.4.2 typing-extensions-3.10.0.2 urllib3-1.26.6 wcwidth-0.2.5 websocket-client-1.2.1 wrapt-1.12.1

> Task :sdks:python:apache_beam:testing:load_tests:run
INFO:apache_beam.runners.portability.stager:Copying Beam SDK "<https://ci-beam.apache.org/job/beam_PerformanceTests_PubsubIOIT_Python_Streaming/ws/src/sdks/python/build/apache-beam.tar.gz"> to staging location.
WARNING:root:Make sure that locally built Python SDK docker image has Python 3.7 interpreter.
INFO:root:Default Python SDK image for environment is apache/beam_python3.7_sdk:2.34.0.dev
INFO:root:Using provided Python SDK container image: gcr.io/cloud-dataflow/v1beta3/python37-fnapi:beam-master-20210809
INFO:root:Python SDK container image set to "gcr.io/cloud-dataflow/v1beta3/python37-fnapi:beam-master-20210809" for Docker environment
INFO:apache_beam.runners.dataflow.internal.apiclient:Defaulting to the temp_location as staging_location: gs://temp-storage-for-perf-tests/loadtests
INFO:apache_beam.internal.gcp.auth:Setting socket default timeout to 60 seconds.
INFO:apache_beam.internal.gcp.auth:socket default timeout is 60.0 seconds.
INFO:apache_beam.runners.dataflow.internal.apiclient:Starting GCS upload to gs://temp-storage-for-perf-tests/loadtests/performance-tests-psio-python-2gb0922150503.1632325833.482472/pickled_main_session...
INFO:oauth2client.transport:Attempting refresh to obtain initial access_token
INFO:oauth2client.transport:Attempting refresh to obtain initial access_token
INFO:apache_beam.runners.dataflow.internal.apiclient:Completed GCS upload to gs://temp-storage-for-perf-tests/loadtests/performance-tests-psio-python-2gb0922150503.1632325833.482472/pickled_main_session in 0 seconds.
INFO:apache_beam.runners.dataflow.internal.apiclient:Starting GCS upload to gs://temp-storage-for-perf-tests/loadtests/performance-tests-psio-python-2gb0922150503.1632325833.482472/dataflow_python_sdk.tar...
INFO:apache_beam.runners.dataflow.internal.apiclient:Completed GCS upload to gs://temp-storage-for-perf-tests/loadtests/performance-tests-psio-python-2gb0922150503.1632325833.482472/dataflow_python_sdk.tar in 0 seconds.
INFO:apache_beam.runners.dataflow.internal.apiclient:Starting GCS upload to gs://temp-storage-for-perf-tests/loadtests/performance-tests-psio-python-2gb0922150503.1632325833.482472/dataflow-****.jar...
INFO:apache_beam.runners.dataflow.internal.apiclient:Completed GCS upload to gs://temp-storage-for-perf-tests/loadtests/performance-tests-psio-python-2gb0922150503.1632325833.482472/dataflow-****.jar in 3 seconds.
INFO:apache_beam.runners.dataflow.internal.apiclient:Starting GCS upload to gs://temp-storage-for-perf-tests/loadtests/performance-tests-psio-python-2gb0922150503.1632325833.482472/pipeline.pb...
INFO:apache_beam.runners.dataflow.internal.apiclient:Completed GCS upload to gs://temp-storage-for-perf-tests/loadtests/performance-tests-psio-python-2gb0922150503.1632325833.482472/pipeline.pb in 0 seconds.
WARNING:apache_beam.options.pipeline_options:Discarding unparseable args: ['--pubsub_namespace_prefix=pubsub_io_performance_']
WARNING:apache_beam.options.pipeline_options:Discarding unparseable args: ['--pubsub_namespace_prefix=pubsub_io_performance_']
INFO:apache_beam.runners.dataflow.internal.apiclient:Create job: <Job
 clientRequestId: '20210922155033483436-8633'
 createTime: '2021-09-22T15:50:37.976064Z'
 currentStateTime: '1970-01-01T00:00:00Z'
 id: '2021-09-22_08_50_37-11010998379505396983'
 location: 'us-central1'
 name: 'performance-tests-psio-python-2gb0922150503'
 projectId: 'apache-beam-testing'
 stageStates: []
 startTime: '2021-09-22T15:50:37.976064Z'
 steps: []
 tempFiles: []
 type: TypeValueValuesEnum(JOB_TYPE_STREAMING, 2)>
INFO:apache_beam.runners.dataflow.internal.apiclient:Created job with id: [2021-09-22_08_50_37-11010998379505396983]
INFO:apache_beam.runners.dataflow.internal.apiclient:Submitted job: 2021-09-22_08_50_37-11010998379505396983
INFO:apache_beam.runners.dataflow.internal.apiclient:To access the Dataflow monitoring console, please navigate to https://console.cloud.google.com/dataflow/jobs/us-central1/2021-09-22_08_50_37-11010998379505396983?project=apache-beam-testing
INFO:apache_beam.runners.dataflow.dataflow_runner:Job 2021-09-22_08_50_37-11010998379505396983 is in state JOB_STATE_RUNNING
INFO:apache_beam.runners.dataflow.dataflow_runner:2021-09-22T15:50:37.252Z: JOB_MESSAGE_BASIC: Streaming Engine auto-enabled. Use --experiments=disable_streaming_engine to opt out.
INFO:apache_beam.runners.dataflow.dataflow_runner:2021-09-22T15:50:37.253Z: JOB_MESSAGE_BASIC: Dataflow Runner V2 auto-enabled. Use --experiments=disable_runner_v2 to opt out.
INFO:apache_beam.runners.dataflow.dataflow_runner:2021-09-22T15:50:45.086Z: JOB_MESSAGE_BASIC: Worker configuration: e2-standard-2 in us-central1-a.
INFO:apache_beam.runners.dataflow.dataflow_runner:2021-09-22T15:50:45.712Z: JOB_MESSAGE_DETAILED: Expanding SplittableParDo operations into optimizable parts.
INFO:apache_beam.runners.dataflow.dataflow_runner:2021-09-22T15:50:45.739Z: JOB_MESSAGE_DETAILED: Expanding CollectionToSingleton operations into optimizable parts.
INFO:apache_beam.runners.dataflow.dataflow_runner:2021-09-22T15:50:45.797Z: JOB_MESSAGE_DETAILED: Expanding CoGroupByKey operations into optimizable parts.
INFO:apache_beam.runners.dataflow.dataflow_runner:2021-09-22T15:50:45.823Z: JOB_MESSAGE_DEBUG: Combiner lifting skipped for step Create input/Reshuffle/ReshufflePerKey/GroupByKey: GroupByKey not followed by a combiner.
INFO:apache_beam.runners.dataflow.dataflow_runner:2021-09-22T15:50:45.861Z: JOB_MESSAGE_DETAILED: Expanding SplittableProcessKeyed operations into optimizable parts.
INFO:apache_beam.runners.dataflow.dataflow_runner:2021-09-22T15:50:45.890Z: JOB_MESSAGE_DETAILED: Expanding GroupByKey operations into streaming Read/Write steps
INFO:apache_beam.runners.dataflow.dataflow_runner:2021-09-22T15:50:45.954Z: JOB_MESSAGE_DETAILED: Lifting ValueCombiningMappingFns into MergeBucketsMappingFns
INFO:apache_beam.runners.dataflow.dataflow_runner:2021-09-22T15:50:46.038Z: JOB_MESSAGE_DEBUG: Annotating graph with Autotuner information.
INFO:apache_beam.runners.dataflow.dataflow_runner:2021-09-22T15:50:46.088Z: JOB_MESSAGE_DETAILED: Fusing adjacent ParDo, Read, Write, and Flatten operations
INFO:apache_beam.runners.dataflow.dataflow_runner:2021-09-22T15:50:46.116Z: JOB_MESSAGE_DETAILED: Fusing consumer Create input/Split into Create input/Impulse
INFO:apache_beam.runners.dataflow.dataflow_runner:2021-09-22T15:50:46.144Z: JOB_MESSAGE_DETAILED: Fusing consumer Create input/Reshuffle/AddRandomKeys into Create input/Split
INFO:apache_beam.runners.dataflow.dataflow_runner:2021-09-22T15:50:46.177Z: JOB_MESSAGE_DETAILED: Fusing consumer Create input/Reshuffle/ReshufflePerKey/Map(reify_timestamps) into Create input/Reshuffle/AddRandomKeys
INFO:apache_beam.runners.dataflow.dataflow_runner:2021-09-22T15:50:46.207Z: JOB_MESSAGE_DETAILED: Fusing consumer Create input/Reshuffle/ReshufflePerKey/GroupByKey/WriteStream into Create input/Reshuffle/ReshufflePerKey/Map(reify_timestamps)
INFO:apache_beam.runners.dataflow.dataflow_runner:2021-09-22T15:50:46.232Z: JOB_MESSAGE_DETAILED: Fusing consumer Create input/Reshuffle/ReshufflePerKey/GroupByKey/MergeBuckets into Create input/Reshuffle/ReshufflePerKey/GroupByKey/ReadStream
INFO:apache_beam.runners.dataflow.dataflow_runner:2021-09-22T15:50:46.268Z: JOB_MESSAGE_DETAILED: Fusing consumer Create input/Reshuffle/ReshufflePerKey/FlatMap(restore_timestamps) into Create input/Reshuffle/ReshufflePerKey/GroupByKey/MergeBuckets
INFO:apache_beam.runners.dataflow.dataflow_runner:2021-09-22T15:50:46.305Z: JOB_MESSAGE_DETAILED: Fusing consumer Create input/Reshuffle/RemoveRandomKeys into Create input/Reshuffle/ReshufflePerKey/FlatMap(restore_timestamps)
INFO:apache_beam.runners.dataflow.dataflow_runner:2021-09-22T15:50:46.328Z: JOB_MESSAGE_DETAILED: Fusing consumer Create input/ReadSplits into Create input/Reshuffle/RemoveRandomKeys
INFO:apache_beam.runners.dataflow.dataflow_runner:2021-09-22T15:50:46.363Z: JOB_MESSAGE_DETAILED: Fusing consumer Format to pubsub message in bytes into Create input/ReadSplits
INFO:apache_beam.runners.dataflow.dataflow_runner:2021-09-22T15:50:46.403Z: JOB_MESSAGE_DETAILED: Fusing consumer Measure time into Format to pubsub message in bytes
INFO:apache_beam.runners.dataflow.dataflow_runner:2021-09-22T15:50:46.437Z: JOB_MESSAGE_DETAILED: Fusing consumer Write to Pubsub/ToProtobuf into Measure time
INFO:apache_beam.runners.dataflow.dataflow_runner:2021-09-22T15:50:46.463Z: JOB_MESSAGE_DETAILED: Fusing consumer Write to Pubsub/Write into Write to Pubsub/ToProtobuf
INFO:apache_beam.runners.dataflow.dataflow_runner:2021-09-22T15:50:46.509Z: JOB_MESSAGE_DEBUG: Workflow config is missing a default resource spec.
INFO:apache_beam.runners.dataflow.dataflow_runner:2021-09-22T15:50:46.537Z: JOB_MESSAGE_DEBUG: Adding StepResource setup and teardown to workflow graph.
INFO:apache_beam.runners.dataflow.dataflow_runner:2021-09-22T15:50:46.570Z: JOB_MESSAGE_DEBUG: Adding workflow start and stop steps.
INFO:apache_beam.runners.dataflow.dataflow_runner:2021-09-22T15:50:46.610Z: JOB_MESSAGE_DEBUG: Assigning stage ids.
INFO:apache_beam.runners.dataflow.dataflow_runner:2021-09-22T15:50:46.681Z: JOB_MESSAGE_DEBUG: Starting **** pool setup.
INFO:apache_beam.runners.dataflow.dataflow_runner:2021-09-22T15:50:46.719Z: JOB_MESSAGE_DEBUG: Starting **** pool setup.
INFO:apache_beam.runners.dataflow.dataflow_runner:2021-09-22T15:50:46.755Z: JOB_MESSAGE_BASIC: Starting 5 ****s in us-central1-a...
INFO:apache_beam.runners.dataflow.dataflow_runner:2021-09-22T15:51:20.202Z: JOB_MESSAGE_BASIC: Your project already contains 100 Dataflow-created metric descriptors, so new user metrics of the form custom.googleapis.com/* will not be created. However, all user metrics are also available in the metric dataflow.googleapis.com/job/user_counter. If you rely on the custom metrics, you can delete old / unused metric descriptors. See https://developers.google.com/apis-explorer/#p/monitoring/v3/monitoring.projects.metricDescriptors.list and https://developers.google.com/apis-explorer/#p/monitoring/v3/monitoring.projects.metricDescriptors.delete
INFO:apache_beam.runners.dataflow.dataflow_runner:2021-09-22T15:51:22.056Z: JOB_MESSAGE_DETAILED: Autoscaling: Raised the number of ****s to 5 so that the pipeline can catch up with its backlog and keep up with its input rate.
INFO:apache_beam.runners.dataflow.dataflow_runner:2021-09-22T15:51:55.284Z: JOB_MESSAGE_DETAILED: Workers have started successfully.
INFO:apache_beam.runners.dataflow.dataflow_runner:2021-09-22T15:51:55.316Z: JOB_MESSAGE_DETAILED: Workers have started successfully.
INFO:apache_beam.runners.dataflow.dataflow_runner:2021-09-22T15:59:55.201Z: JOB_MESSAGE_DETAILED: Cleaning up.
INFO:apache_beam.runners.dataflow.dataflow_runner:2021-09-22T15:59:55.274Z: JOB_MESSAGE_DEBUG: Starting **** pool teardown.
INFO:apache_beam.runners.dataflow.dataflow_runner:2021-09-22T15:59:55.314Z: JOB_MESSAGE_BASIC: Stopping **** pool...
INFO:apache_beam.runners.dataflow.dataflow_runner:2021-09-22T15:59:55.353Z: JOB_MESSAGE_DEBUG: Starting **** pool teardown.
INFO:apache_beam.runners.dataflow.dataflow_runner:2021-09-22T15:59:55.387Z: JOB_MESSAGE_BASIC: Stopping **** pool...
WARNING:apache_beam.runners.dataflow.dataflow_runner:Timing out on waiting for job 2021-09-22_08_50_37-11010998379505396983 after 602 seconds
INFO:apache_beam.testing.load_tests.load_test_metrics_utils:Load test results for test: e9197594e4f64aaf9cc3d64b8a36b594 and timestamp: 1632326549.7433214:
INFO:apache_beam.testing.load_tests.load_test_metrics_utils:Metric: pubsub_io_perf_write_runtime Value: 78
Traceback (most recent call last):
Worker logs: https://console.cloud.google.com/dataflow/jobs/us-central1/2021-09-22_08_50_37-11010998379505396983?project=apache-beam-testing
  File "/usr/lib/python3.7/runpy.py", line 193, in _run_module_as_main
    "__main__", mod_spec)
  File "/usr/lib/python3.7/runpy.py", line 85, in _run_code
    exec(code, run_globals)
  File "<https://ci-beam.apache.org/job/beam_PerformanceTests_PubsubIOIT_Python_Streaming/ws/src/sdks/python/apache_beam/io/gcp/pubsub_io_perf_test.py",> line 223, in <module>
    PubsubReadPerfTest().run()
  File "<https://ci-beam.apache.org/job/beam_PerformanceTests_PubsubIOIT_Python_Streaming/ws/src/sdks/python/apache_beam/testing/load_tests/load_test.py",> line 147, in run
    self.test()
  File "<https://ci-beam.apache.org/job/beam_PerformanceTests_PubsubIOIT_Python_Streaming/ws/src/sdks/python/apache_beam/io/gcp/pubsub_io_perf_test.py",> line 183, in test
    | 'Write to Pubsub' >> beam.io.WriteToPubSub(self.matcher_topic_name))
  File "<https://ci-beam.apache.org/job/beam_PerformanceTests_PubsubIOIT_Python_Streaming/ws/src/sdks/python/apache_beam/pvalue.py",> line 137, in __or__
    return self.pipeline.apply(ptransform, self)
  File "<https://ci-beam.apache.org/job/beam_PerformanceTests_PubsubIOIT_Python_Streaming/ws/src/sdks/python/apache_beam/pipeline.py",> line 646, in apply
    transform.transform, pvalueish, label or transform.label)
  File "<https://ci-beam.apache.org/job/beam_PerformanceTests_PubsubIOIT_Python_Streaming/ws/src/sdks/python/apache_beam/pipeline.py",> line 656, in apply
    return self.apply(transform, pvalueish)
  File "<https://ci-beam.apache.org/job/beam_PerformanceTests_PubsubIOIT_Python_Streaming/ws/src/sdks/python/apache_beam/pipeline.py",> line 702, in apply
    pvalueish_result = self.runner.apply(transform, pvalueish, self._options)
  File "<https://ci-beam.apache.org/job/beam_PerformanceTests_PubsubIOIT_Python_Streaming/ws/src/sdks/python/apache_beam/runners/dataflow/dataflow_runner.py",> line 141, in apply
    return super(DataflowRunner, self).apply(transform, input, options)
  File "<https://ci-beam.apache.org/job/beam_PerformanceTests_PubsubIOIT_Python_Streaming/ws/src/sdks/python/apache_beam/runners/runner.py",> line 185, in apply
    return m(transform, input, options)
  File "<https://ci-beam.apache.org/job/beam_PerformanceTests_PubsubIOIT_Python_Streaming/ws/src/sdks/python/apache_beam/runners/runner.py",> line 215, in apply_PTransform
    return transform.expand(input)
  File "<https://ci-beam.apache.org/job/beam_PerformanceTests_PubsubIOIT_Python_Streaming/ws/src/sdks/python/apache_beam/transforms/core.py",> line 1909, in expand
    | 'UnKey' >> Map(lambda k_v: k_v[1]))
  File "<https://ci-beam.apache.org/job/beam_PerformanceTests_PubsubIOIT_Python_Streaming/ws/src/sdks/python/apache_beam/pvalue.py",> line 137, in __or__
    return self.pipeline.apply(ptransform, self)
  File "<https://ci-beam.apache.org/job/beam_PerformanceTests_PubsubIOIT_Python_Streaming/ws/src/sdks/python/apache_beam/pipeline.py",> line 646, in apply
    transform.transform, pvalueish, label or transform.label)
  File "<https://ci-beam.apache.org/job/beam_PerformanceTests_PubsubIOIT_Python_Streaming/ws/src/sdks/python/apache_beam/pipeline.py",> line 656, in apply
    return self.apply(transform, pvalueish)
  File "<https://ci-beam.apache.org/job/beam_PerformanceTests_PubsubIOIT_Python_Streaming/ws/src/sdks/python/apache_beam/pipeline.py",> line 702, in apply
    pvalueish_result = self.runner.apply(transform, pvalueish, self._options)
  File "<https://ci-beam.apache.org/job/beam_PerformanceTests_PubsubIOIT_Python_Streaming/ws/src/sdks/python/apache_beam/runners/dataflow/dataflow_runner.py",> line 141, in apply
    return super(DataflowRunner, self).apply(transform, input, options)
  File "<https://ci-beam.apache.org/job/beam_PerformanceTests_PubsubIOIT_Python_Streaming/ws/src/sdks/python/apache_beam/runners/runner.py",> line 185, in apply
    return m(transform, input, options)
  File "<https://ci-beam.apache.org/job/beam_PerformanceTests_PubsubIOIT_Python_Streaming/ws/src/sdks/python/apache_beam/runners/runner.py",> line 215, in apply_PTransform
    return transform.expand(input)
  File "<https://ci-beam.apache.org/job/beam_PerformanceTests_PubsubIOIT_Python_Streaming/ws/src/sdks/python/apache_beam/transforms/core.py",> line 2048, in expand
    return pcoll | GroupByKey() | 'Combine' >> CombineValues(
  File "<https://ci-beam.apache.org/job/beam_PerformanceTests_PubsubIOIT_Python_Streaming/ws/src/sdks/python/apache_beam/pvalue.py",> line 137, in __or__
    return self.pipeline.apply(ptransform, self)
  File "<https://ci-beam.apache.org/job/beam_PerformanceTests_PubsubIOIT_Python_Streaming/ws/src/sdks/python/apache_beam/pipeline.py",> line 702, in apply
    pvalueish_result = self.runner.apply(transform, pvalueish, self._options)
  File "<https://ci-beam.apache.org/job/beam_PerformanceTests_PubsubIOIT_Python_Streaming/ws/src/sdks/python/apache_beam/runners/dataflow/dataflow_runner.py",> line 141, in apply
    return super(DataflowRunner, self).apply(transform, input, options)
  File "<https://ci-beam.apache.org/job/beam_PerformanceTests_PubsubIOIT_Python_Streaming/ws/src/sdks/python/apache_beam/runners/runner.py",> line 185, in apply
    return m(transform, input, options)
  File "<https://ci-beam.apache.org/job/beam_PerformanceTests_PubsubIOIT_Python_Streaming/ws/src/sdks/python/apache_beam/runners/dataflow/dataflow_runner.py",> line 833, in apply_GroupByKey
    return transform.expand(pcoll)
  File "<https://ci-beam.apache.org/job/beam_PerformanceTests_PubsubIOIT_Python_Streaming/ws/src/sdks/python/apache_beam/transforms/core.py",> line 2349, in expand
    raise ValueError(msg)
ValueError: GroupByKey: Unsafe trigger: `Repeatedly(AfterCount(2097152))` may lose data. Reason: CONDITION_NOT_GUARANTEED. This can be overriden with the --allow_unsafe_triggers flag.

> Task :sdks:python:apache_beam:testing:load_tests:run FAILED

FAILURE: Build failed with an exception.

* Where:
Build file '<https://ci-beam.apache.org/job/beam_PerformanceTests_PubsubIOIT_Python_Streaming/ws/src/sdks/python/apache_beam/testing/load_tests/build.gradle'> line: 58

* What went wrong:
Execution failed for task ':sdks:python:apache_beam:testing:load_tests:run'.
> error occurred

* Try:
Run with --stacktrace option to get the stack trace. Run with --info or --debug option to get more log output. Run with --scan to get full insights.

* Get more help at https://help.gradle.org

Deprecated Gradle features were used in this build, making it incompatible with Gradle 7.0.
Use '--warning-mode all' to show the individual deprecation warnings.
See https://docs.gradle.org/6.9.1/userguide/command_line_interface.html#sec:command_line_warnings

BUILD FAILED in 13m 12s
83 actionable tasks: 53 executed, 30 from cache

Publishing build scan...
https://gradle.com/s/t6zzi4btbkoqs

Build step 'Invoke Gradle script' changed build result to FAILURE
Build step 'Invoke Gradle script' marked build as failure

---------------------------------------------------------------------
To unsubscribe, e-mail: builds-unsubscribe@beam.apache.org
For additional commands, e-mail: builds-help@beam.apache.org


Jenkins build is back to normal : beam_PerformanceTests_PubsubIOIT_Python_Streaming #474

Posted by Apache Jenkins Server <je...@builds.apache.org>.
See <https://ci-beam.apache.org/job/beam_PerformanceTests_PubsubIOIT_Python_Streaming/474/display/redirect?page=changes>


---------------------------------------------------------------------
To unsubscribe, e-mail: builds-unsubscribe@beam.apache.org
For additional commands, e-mail: builds-help@beam.apache.org


Build failed in Jenkins: beam_PerformanceTests_PubsubIOIT_Python_Streaming #473

Posted by Apache Jenkins Server <je...@builds.apache.org>.
See <https://ci-beam.apache.org/job/beam_PerformanceTests_PubsubIOIT_Python_Streaming/473/display/redirect?page=changes>

Changes:

[noreply] Avoid setting empty builders in proto setters

[Brian Hulette] Add back 'more' break

[Robert Bradshaw] Fix some website logos.

[chuck.yang] Run BigQuery queries with batch priority

[chuck.yang] Allow changing query priority in ReadFromBigQuery

[chuck.yang] Update CHANGES

[kawaigin] Implicitly watch and track anonymous pipeline and PCollections

[chamikaramj] Reject requests when parameter names cannot be validated unless

[chamikaramj] Updates error message

[alexander.chermenin] [BEAM-10822] Fixed typo in BigqueryClient

[zyichi] [BEAM-12898] Minor fix to Kubernetes.groovy postBuildScript.

[noreply] [BEAM-12869] Bump tensorflow from 2.5.0 to 2.5.1 in

[noreply] [BEAM-12946] Fix SmallestPerKey, add unit testing (#15567)

[zyichi] [BEAM-12908] Sickbay pubsublite.ReadWriteIT

[noreply] Relocate Go SDK breaking change note out of template into 2.33.0.


------------------------------------------
[...truncated 61.54 KB...]
  Using cached google_cloud_bigtable-0.33.0-py2.py3-none-any.whl (230 kB)
  Using cached google_cloud_bigtable-0.32.2-py2.py3-none-any.whl (156 kB)
  Using cached google_cloud_bigtable-0.32.1-py2.py3-none-any.whl (156 kB)
  Using cached google_cloud_bigtable-0.32.0-py2.py3-none-any.whl (155 kB)
  Using cached google_cloud_bigtable-0.31.1-py2.py3-none-any.whl (154 kB)
Collecting grpc-google-iam-v1<0.12dev,>=0.11.4
  Using cached grpc-google-iam-v1-0.11.4.tar.gz (12 kB)
INFO: pip is looking at multiple versions of google-api-core[grpc] to determine which version is compatible with other requirements. This could take a while.
Collecting google-api-core[grpc]<3.0.0dev,>=1.29.0
  Using cached google_api_core-2.0.0-py2.py3-none-any.whl (92 kB)
  Using cached google_api_core-1.31.3-py2.py3-none-any.whl (93 kB)
Collecting protobuf<4,>=3.12.2
  Using cached protobuf-3.17.3-cp37-cp37m-manylinux_2_5_x86_64.manylinux1_x86_64.whl (1.0 MB)
Collecting google-auth<3,>=1.18.0
  Using cached google_auth-1.35.0-py2.py3-none-any.whl (152 kB)
Collecting google-crc32c<2.0dev,>=1.0
  Using cached google_crc32c-1.2.0-cp37-cp37m-manylinux_2_12_x86_64.manylinux2010_x86_64.whl (38 kB)
Collecting docopt
  Using cached docopt-0.6.2-py2.py3-none-any.whl
Requirement already satisfied: pyparsing<3,>=2.4.2 in <https://ci-beam.apache.org/job/beam_PerformanceTests_PubsubIOIT_Python_Streaming/ws/src/build/gradleenv/1329484227/lib/python3.7/site-packages> (from httplib2<0.20.0,>=0.8->apache-beam==2.34.0.dev0) (2.4.7)
Collecting pbr>=0.11
  Using cached pbr-5.6.0-py2.py3-none-any.whl (111 kB)
Collecting isodate>=0.6.0
  Using cached isodate-0.6.0-py2.py3-none-any.whl (45 kB)
Collecting requests-oauthlib>=0.5.0
  Using cached requests_oauthlib-1.3.0-py2.py3-none-any.whl (23 kB)
Collecting certifi>=2017.4.17
  Using cached certifi-2021.5.30-py2.py3-none-any.whl (145 kB)
Collecting pyasn1>=0.1.7
  Using cached pyasn1-0.4.8-py2.py3-none-any.whl (77 kB)
Collecting atomicwrites>=1.0
  Using cached atomicwrites-1.4.0-py2.py3-none-any.whl (6.8 kB)
Collecting attrs>=17.4.0
  Using cached attrs-21.2.0-py2.py3-none-any.whl (53 kB)
Collecting wcwidth
  Using cached wcwidth-0.2.5-py2.py3-none-any.whl (30 kB)
Requirement already satisfied: importlib-metadata>=0.12 in <https://ci-beam.apache.org/job/beam_PerformanceTests_PubsubIOIT_Python_Streaming/ws/src/build/gradleenv/1329484227/lib/python3.7/site-packages> (from pytest<5.0,>=4.4.0->apache-beam==2.34.0.dev0) (2.1.1)
Collecting pluggy<1.0,>=0.12
  Using cached pluggy-0.13.1-py2.py3-none-any.whl (18 kB)
Collecting more-itertools>=4.0.0
  Using cached more_itertools-8.10.0-py3-none-any.whl (51 kB)
Requirement already satisfied: py>=1.5.0 in <https://ci-beam.apache.org/job/beam_PerformanceTests_PubsubIOIT_Python_Streaming/ws/src/build/gradleenv/1329484227/lib/python3.7/site-packages> (from pytest<5.0,>=4.4.0->apache-beam==2.34.0.dev0) (1.10.0)
Requirement already satisfied: zipp>=0.5 in <https://ci-beam.apache.org/job/beam_PerformanceTests_PubsubIOIT_Python_Streaming/ws/src/build/gradleenv/1329484227/lib/python3.7/site-packages> (from importlib-metadata>=0.12->pytest<5.0,>=4.4.0->apache-beam==2.34.0.dev0) (3.5.0)
Collecting pytest-forked
  Using cached pytest_forked-1.3.0-py2.py3-none-any.whl (4.7 kB)
Collecting execnet>=1.1
  Using cached execnet-1.9.0-py2.py3-none-any.whl (39 kB)
Collecting charset-normalizer~=2.0.0
  Using cached charset_normalizer-2.0.6-py3-none-any.whl (37 kB)
Collecting idna<4,>=2.5
  Using cached idna-3.2-py3-none-any.whl (59 kB)
Collecting oauthlib>=3.0.0
  Using cached oauthlib-3.1.1-py2.py3-none-any.whl (146 kB)
Collecting greenlet!=0.4.17
  Using cached greenlet-1.1.1-cp37-cp37m-manylinux_2_17_x86_64.manylinux2014_x86_64.whl (143 kB)
Collecting wrapt
  Using cached wrapt-1.12.1-cp37-cp37m-linux_x86_64.whl
Collecting deprecation
  Using cached deprecation-2.1.0-py2.py3-none-any.whl (11 kB)
Collecting docker
  Using cached docker-5.0.2-py2.py3-none-any.whl (145 kB)
Collecting websocket-client>=0.32.0
  Using cached websocket_client-1.2.1-py2.py3-none-any.whl (52 kB)
Building wheels for collected packages: apache-beam
  Building wheel for apache-beam (setup.py): started
  Building wheel for apache-beam (setup.py): finished with status 'done'
  Created wheel for apache-beam: filename=apache_beam-2.34.0.dev0-py3-none-any.whl size=2547583 sha256=c70c667db267d03593f5628fd0cb4c3a67944391f298d49444d6e0d25b81c8ac
  Stored in directory: /home/jenkins/.cache/pip/wheels/ab/30/db/7a1d878abb34081c011192312e662d364ee443467dfb553778
Successfully built apache-beam
Installing collected packages: pyasn1, urllib3, rsa, pyasn1-modules, protobuf, idna, charset-normalizer, certifi, cachetools, wcwidth, requests, pytz, python-dateutil, pycparser, pluggy, oauthlib, more-itertools, jmespath, googleapis-common-protos, google-auth, attrs, atomicwrites, websocket-client, requests-oauthlib, pytest, numpy, isodate, httplib2, grpcio-gcp, google-crc32c, google-api-core, docopt, cffi, botocore, wrapt, typing-extensions, s3transfer, pytest-forked, pymongo, pydot, pyarrow, proto-plus, pbr, orjson, oauth2client, msrest, hdfs, grpc-google-iam-v1, greenlet, google-resumable-media, google-cloud-core, fasteners, fastavro, execnet, docker, dill, deprecation, cryptography, crcmod, azure-core, avro-python3, testcontainers, tenacity, sqlalchemy, requests-mock, pyyaml, pytest-xdist, pytest-timeout, pyhamcrest, psycopg2-binary, parameterized, pandas, mock, google-cloud-vision, google-cloud-videointelligence, google-cloud-spanner, google-cloud-recommendations-ai, google-cloud-pubsub, google-cloud-language, google-cloud-dlp, google-cloud-datastore, google-cloud-bigtable, google-cloud-bigquery, google-apitools, freezegun, boto3, azure-storage-blob, apache-beam
  Attempting uninstall: protobuf
    Found existing installation: protobuf 3.18.0
    Uninstalling protobuf-3.18.0:
      Successfully uninstalled protobuf-3.18.0
  Attempting uninstall: pluggy
    Found existing installation: pluggy 1.0.0
    Uninstalling pluggy-1.0.0:
      Successfully uninstalled pluggy-1.0.0
Successfully installed apache-beam-2.34.0.dev0 atomicwrites-1.4.0 attrs-21.2.0 avro-python3-1.9.2.1 azure-core-1.18.0 azure-storage-blob-12.9.0 boto3-1.18.47 botocore-1.21.47 cachetools-4.2.2 certifi-2021.5.30 cffi-1.14.6 charset-normalizer-2.0.6 crcmod-1.7 cryptography-3.4.8 deprecation-2.1.0 dill-0.3.1.1 docker-5.0.2 docopt-0.6.2 execnet-1.9.0 fastavro-1.4.5 fasteners-0.16.3 freezegun-1.1.0 google-api-core-1.31.3 google-apitools-0.5.31 google-auth-1.35.0 google-cloud-bigquery-2.26.0 google-cloud-bigtable-1.7.0 google-cloud-core-1.7.2 google-cloud-datastore-1.15.3 google-cloud-dlp-1.0.0 google-cloud-language-1.3.0 google-cloud-pubsub-1.7.0 google-cloud-recommendations-ai-0.2.0 google-cloud-spanner-1.19.1 google-cloud-videointelligence-1.16.1 google-cloud-vision-1.0.0 google-crc32c-1.2.0 google-resumable-media-2.0.3 googleapis-common-protos-1.53.0 greenlet-1.1.1 grpc-google-iam-v1-0.12.3 grpcio-gcp-0.2.2 hdfs-2.6.0 httplib2-0.19.1 idna-3.2 isodate-0.6.0 jmespath-0.10.0 mock-2.0.0 more-itertools-8.10.0 msrest-0.6.21 numpy-1.20.3 oauth2client-4.1.3 oauthlib-3.1.1 orjson-3.6.3 pandas-1.2.5 parameterized-0.7.5 pbr-5.6.0 pluggy-0.13.1 proto-plus-1.19.0 protobuf-3.17.3 psycopg2-binary-2.9.1 pyarrow-4.0.1 pyasn1-0.4.8 pyasn1-modules-0.2.8 pycparser-2.20 pydot-1.4.2 pyhamcrest-1.10.1 pymongo-3.12.0 pytest-4.6.11 pytest-forked-1.3.0 pytest-timeout-1.4.2 pytest-xdist-1.34.0 python-dateutil-2.8.2 pytz-2021.1 pyyaml-5.4.1 requests-2.26.0 requests-mock-1.9.3 requests-oauthlib-1.3.0 rsa-4.7.2 s3transfer-0.5.0 sqlalchemy-1.4.25 tenacity-5.1.5 testcontainers-3.4.2 typing-extensions-3.10.0.2 urllib3-1.26.7 wcwidth-0.2.5 websocket-client-1.2.1 wrapt-1.12.1

> Task :sdks:python:apache_beam:testing:load_tests:run
INFO:apache_beam.runners.portability.stager:Copying Beam SDK "<https://ci-beam.apache.org/job/beam_PerformanceTests_PubsubIOIT_Python_Streaming/ws/src/sdks/python/build/apache-beam.tar.gz"> to staging location.
WARNING:root:Make sure that locally built Python SDK docker image has Python 3.7 interpreter.
INFO:root:Default Python SDK image for environment is apache/beam_python3.7_sdk:2.34.0.dev
INFO:root:Using provided Python SDK container image: gcr.io/cloud-dataflow/v1beta3/python37-fnapi:beam-master-20210809
INFO:root:Python SDK container image set to "gcr.io/cloud-dataflow/v1beta3/python37-fnapi:beam-master-20210809" for Docker environment
INFO:apache_beam.runners.dataflow.internal.apiclient:Defaulting to the temp_location as staging_location: gs://temp-storage-for-perf-tests/loadtests
INFO:apache_beam.internal.gcp.auth:Setting socket default timeout to 60 seconds.
INFO:apache_beam.internal.gcp.auth:socket default timeout is 60.0 seconds.
INFO:apache_beam.runners.dataflow.internal.apiclient:Starting GCS upload to gs://temp-storage-for-perf-tests/loadtests/performance-tests-psio-python-2gb0924150505.1632498633.457494/pickled_main_session...
INFO:oauth2client.transport:Attempting refresh to obtain initial access_token
INFO:oauth2client.transport:Attempting refresh to obtain initial access_token
INFO:apache_beam.runners.dataflow.internal.apiclient:Completed GCS upload to gs://temp-storage-for-perf-tests/loadtests/performance-tests-psio-python-2gb0924150505.1632498633.457494/pickled_main_session in 0 seconds.
INFO:apache_beam.runners.dataflow.internal.apiclient:Starting GCS upload to gs://temp-storage-for-perf-tests/loadtests/performance-tests-psio-python-2gb0924150505.1632498633.457494/dataflow_python_sdk.tar...
INFO:apache_beam.runners.dataflow.internal.apiclient:Completed GCS upload to gs://temp-storage-for-perf-tests/loadtests/performance-tests-psio-python-2gb0924150505.1632498633.457494/dataflow_python_sdk.tar in 0 seconds.
INFO:apache_beam.runners.dataflow.internal.apiclient:Starting GCS upload to gs://temp-storage-for-perf-tests/loadtests/performance-tests-psio-python-2gb0924150505.1632498633.457494/dataflow-****.jar...
INFO:apache_beam.runners.dataflow.internal.apiclient:Completed GCS upload to gs://temp-storage-for-perf-tests/loadtests/performance-tests-psio-python-2gb0924150505.1632498633.457494/dataflow-****.jar in 3 seconds.
INFO:apache_beam.runners.dataflow.internal.apiclient:Starting GCS upload to gs://temp-storage-for-perf-tests/loadtests/performance-tests-psio-python-2gb0924150505.1632498633.457494/pipeline.pb...
INFO:apache_beam.runners.dataflow.internal.apiclient:Completed GCS upload to gs://temp-storage-for-perf-tests/loadtests/performance-tests-psio-python-2gb0924150505.1632498633.457494/pipeline.pb in 0 seconds.
WARNING:apache_beam.options.pipeline_options:Discarding unparseable args: ['--pubsub_namespace_prefix=pubsub_io_performance_']
WARNING:apache_beam.options.pipeline_options:Discarding unparseable args: ['--pubsub_namespace_prefix=pubsub_io_performance_']
INFO:apache_beam.runners.dataflow.internal.apiclient:Create job: <Job
 clientRequestId: '20210924155033458445-5120'
 createTime: '2021-09-24T15:50:37.958318Z'
 currentStateTime: '1970-01-01T00:00:00Z'
 id: '2021-09-24_08_50_36-1937739938267030395'
 location: 'us-central1'
 name: 'performance-tests-psio-python-2gb0924150505'
 projectId: 'apache-beam-testing'
 stageStates: []
 startTime: '2021-09-24T15:50:37.958318Z'
 steps: []
 tempFiles: []
 type: TypeValueValuesEnum(JOB_TYPE_STREAMING, 2)>
INFO:apache_beam.runners.dataflow.internal.apiclient:Created job with id: [2021-09-24_08_50_36-1937739938267030395]
INFO:apache_beam.runners.dataflow.internal.apiclient:Submitted job: 2021-09-24_08_50_36-1937739938267030395
INFO:apache_beam.runners.dataflow.internal.apiclient:To access the Dataflow monitoring console, please navigate to https://console.cloud.google.com/dataflow/jobs/us-central1/2021-09-24_08_50_36-1937739938267030395?project=apache-beam-testing
INFO:apache_beam.runners.dataflow.dataflow_runner:Job 2021-09-24_08_50_36-1937739938267030395 is in state JOB_STATE_RUNNING
INFO:apache_beam.runners.dataflow.dataflow_runner:2021-09-24T15:50:37.029Z: JOB_MESSAGE_BASIC: Streaming Engine auto-enabled. Use --experiments=disable_streaming_engine to opt out.
INFO:apache_beam.runners.dataflow.dataflow_runner:2021-09-24T15:50:37.030Z: JOB_MESSAGE_BASIC: Dataflow Runner V2 auto-enabled. Use --experiments=disable_runner_v2 to opt out.
INFO:apache_beam.runners.dataflow.dataflow_runner:2021-09-24T15:50:45.197Z: JOB_MESSAGE_BASIC: Worker configuration: e2-standard-2 in us-central1-a.
INFO:apache_beam.runners.dataflow.dataflow_runner:2021-09-24T15:50:45.921Z: JOB_MESSAGE_DETAILED: Expanding SplittableParDo operations into optimizable parts.
INFO:apache_beam.runners.dataflow.dataflow_runner:2021-09-24T15:50:45.950Z: JOB_MESSAGE_DETAILED: Expanding CollectionToSingleton operations into optimizable parts.
INFO:apache_beam.runners.dataflow.dataflow_runner:2021-09-24T15:50:46.029Z: JOB_MESSAGE_DETAILED: Expanding CoGroupByKey operations into optimizable parts.
INFO:apache_beam.runners.dataflow.dataflow_runner:2021-09-24T15:50:46.066Z: JOB_MESSAGE_DEBUG: Combiner lifting skipped for step Create input/Reshuffle/ReshufflePerKey/GroupByKey: GroupByKey not followed by a combiner.
INFO:apache_beam.runners.dataflow.dataflow_runner:2021-09-24T15:50:46.099Z: JOB_MESSAGE_DETAILED: Expanding SplittableProcessKeyed operations into optimizable parts.
INFO:apache_beam.runners.dataflow.dataflow_runner:2021-09-24T15:50:46.131Z: JOB_MESSAGE_DETAILED: Expanding GroupByKey operations into streaming Read/Write steps
INFO:apache_beam.runners.dataflow.dataflow_runner:2021-09-24T15:50:46.201Z: JOB_MESSAGE_DETAILED: Lifting ValueCombiningMappingFns into MergeBucketsMappingFns
INFO:apache_beam.runners.dataflow.dataflow_runner:2021-09-24T15:50:46.261Z: JOB_MESSAGE_DEBUG: Annotating graph with Autotuner information.
INFO:apache_beam.runners.dataflow.dataflow_runner:2021-09-24T15:50:46.308Z: JOB_MESSAGE_DETAILED: Fusing adjacent ParDo, Read, Write, and Flatten operations
INFO:apache_beam.runners.dataflow.dataflow_runner:2021-09-24T15:50:46.354Z: JOB_MESSAGE_DETAILED: Fusing consumer Create input/Split into Create input/Impulse
INFO:apache_beam.runners.dataflow.dataflow_runner:2021-09-24T15:50:46.380Z: JOB_MESSAGE_DETAILED: Fusing consumer Create input/Reshuffle/AddRandomKeys into Create input/Split
INFO:apache_beam.runners.dataflow.dataflow_runner:2021-09-24T15:50:46.414Z: JOB_MESSAGE_DETAILED: Fusing consumer Create input/Reshuffle/ReshufflePerKey/Map(reify_timestamps) into Create input/Reshuffle/AddRandomKeys
INFO:apache_beam.runners.dataflow.dataflow_runner:2021-09-24T15:50:46.461Z: JOB_MESSAGE_DETAILED: Fusing consumer Create input/Reshuffle/ReshufflePerKey/GroupByKey/WriteStream into Create input/Reshuffle/ReshufflePerKey/Map(reify_timestamps)
INFO:apache_beam.runners.dataflow.dataflow_runner:2021-09-24T15:50:46.505Z: JOB_MESSAGE_DETAILED: Fusing consumer Create input/Reshuffle/ReshufflePerKey/GroupByKey/MergeBuckets into Create input/Reshuffle/ReshufflePerKey/GroupByKey/ReadStream
INFO:apache_beam.runners.dataflow.dataflow_runner:2021-09-24T15:50:46.545Z: JOB_MESSAGE_DETAILED: Fusing consumer Create input/Reshuffle/ReshufflePerKey/FlatMap(restore_timestamps) into Create input/Reshuffle/ReshufflePerKey/GroupByKey/MergeBuckets
INFO:apache_beam.runners.dataflow.dataflow_runner:2021-09-24T15:50:46.581Z: JOB_MESSAGE_DETAILED: Fusing consumer Create input/Reshuffle/RemoveRandomKeys into Create input/Reshuffle/ReshufflePerKey/FlatMap(restore_timestamps)
INFO:apache_beam.runners.dataflow.dataflow_runner:2021-09-24T15:50:46.621Z: JOB_MESSAGE_DETAILED: Fusing consumer Create input/ReadSplits into Create input/Reshuffle/RemoveRandomKeys
INFO:apache_beam.runners.dataflow.dataflow_runner:2021-09-24T15:50:46.654Z: JOB_MESSAGE_DETAILED: Fusing consumer Format to pubsub message in bytes into Create input/ReadSplits
INFO:apache_beam.runners.dataflow.dataflow_runner:2021-09-24T15:50:46.689Z: JOB_MESSAGE_DETAILED: Fusing consumer Measure time into Format to pubsub message in bytes
INFO:apache_beam.runners.dataflow.dataflow_runner:2021-09-24T15:50:46.715Z: JOB_MESSAGE_DETAILED: Fusing consumer Write to Pubsub/ToProtobuf into Measure time
INFO:apache_beam.runners.dataflow.dataflow_runner:2021-09-24T15:50:46.753Z: JOB_MESSAGE_DETAILED: Fusing consumer Write to Pubsub/Write into Write to Pubsub/ToProtobuf
INFO:apache_beam.runners.dataflow.dataflow_runner:2021-09-24T15:50:46.798Z: JOB_MESSAGE_DEBUG: Workflow config is missing a default resource spec.
INFO:apache_beam.runners.dataflow.dataflow_runner:2021-09-24T15:50:46.897Z: JOB_MESSAGE_DEBUG: Adding StepResource setup and teardown to workflow graph.
INFO:apache_beam.runners.dataflow.dataflow_runner:2021-09-24T15:50:46.932Z: JOB_MESSAGE_DEBUG: Adding workflow start and stop steps.
INFO:apache_beam.runners.dataflow.dataflow_runner:2021-09-24T15:50:46.970Z: JOB_MESSAGE_DEBUG: Assigning stage ids.
INFO:apache_beam.runners.dataflow.dataflow_runner:2021-09-24T15:50:47.016Z: JOB_MESSAGE_DEBUG: Starting **** pool setup.
INFO:apache_beam.runners.dataflow.dataflow_runner:2021-09-24T15:50:47.050Z: JOB_MESSAGE_BASIC: Starting 5 ****s in us-central1-a...
INFO:apache_beam.runners.dataflow.dataflow_runner:2021-09-24T15:50:47.089Z: JOB_MESSAGE_DEBUG: Starting **** pool setup.
INFO:apache_beam.runners.dataflow.dataflow_runner:2021-09-24T15:51:11.122Z: JOB_MESSAGE_BASIC: Your project already contains 100 Dataflow-created metric descriptors, so new user metrics of the form custom.googleapis.com/* will not be created. However, all user metrics are also available in the metric dataflow.googleapis.com/job/user_counter. If you rely on the custom metrics, you can delete old / unused metric descriptors. See https://developers.google.com/apis-explorer/#p/monitoring/v3/monitoring.projects.metricDescriptors.list and https://developers.google.com/apis-explorer/#p/monitoring/v3/monitoring.projects.metricDescriptors.delete
INFO:apache_beam.runners.dataflow.dataflow_runner:2021-09-24T15:51:27.588Z: JOB_MESSAGE_DETAILED: Autoscaling: Raised the number of ****s to 4 so that the pipeline can catch up with its backlog and keep up with its input rate.
INFO:apache_beam.runners.dataflow.dataflow_runner:2021-09-24T15:51:27.623Z: JOB_MESSAGE_DETAILED: Resized **** pool to 4, though goal was 5.  This could be a quota issue.
INFO:apache_beam.runners.dataflow.dataflow_runner:2021-09-24T15:51:58.182Z: JOB_MESSAGE_DETAILED: Workers have started successfully.
INFO:apache_beam.runners.dataflow.dataflow_runner:2021-09-24T15:51:58.224Z: JOB_MESSAGE_DETAILED: Workers have started successfully.
INFO:apache_beam.runners.dataflow.dataflow_runner:2021-09-24T15:53:21.039Z: JOB_MESSAGE_DETAILED: Autoscaling: Raised the number of ****s to 5 so that the pipeline can catch up with its backlog and keep up with its input rate.
INFO:apache_beam.runners.dataflow.dataflow_runner:2021-09-24T15:59:55.801Z: JOB_MESSAGE_DETAILED: Cleaning up.
INFO:apache_beam.runners.dataflow.dataflow_runner:2021-09-24T15:59:55.845Z: JOB_MESSAGE_DEBUG: Starting **** pool teardown.
INFO:apache_beam.runners.dataflow.dataflow_runner:2021-09-24T15:59:55.877Z: JOB_MESSAGE_BASIC: Stopping **** pool...
INFO:apache_beam.runners.dataflow.dataflow_runner:2021-09-24T15:59:55.927Z: JOB_MESSAGE_DEBUG: Starting **** pool teardown.
INFO:apache_beam.runners.dataflow.dataflow_runner:2021-09-24T15:59:55.957Z: JOB_MESSAGE_BASIC: Stopping **** pool...
WARNING:apache_beam.runners.dataflow.dataflow_runner:Timing out on waiting for job 2021-09-24_08_50_36-1937739938267030395 after 604 seconds
INFO:apache_beam.testing.load_tests.load_test_metrics_utils:Load test results for test: 9b91763b9f184120a784a91fc9e6276d and timestamp: 1632499350.5377462:
INFO:apache_beam.testing.load_tests.load_test_metrics_utils:Metric: pubsub_io_perf_write_runtime Value: 59
Traceback (most recent call last):
Worker logs: https://console.cloud.google.com/dataflow/jobs/us-central1/2021-09-24_08_50_36-1937739938267030395?project=apache-beam-testing
  File "/usr/lib/python3.7/runpy.py", line 193, in _run_module_as_main
    "__main__", mod_spec)
  File "/usr/lib/python3.7/runpy.py", line 85, in _run_code
    exec(code, run_globals)
  File "<https://ci-beam.apache.org/job/beam_PerformanceTests_PubsubIOIT_Python_Streaming/ws/src/sdks/python/apache_beam/io/gcp/pubsub_io_perf_test.py",> line 223, in <module>
    PubsubReadPerfTest().run()
  File "<https://ci-beam.apache.org/job/beam_PerformanceTests_PubsubIOIT_Python_Streaming/ws/src/sdks/python/apache_beam/testing/load_tests/load_test.py",> line 147, in run
    self.test()
  File "<https://ci-beam.apache.org/job/beam_PerformanceTests_PubsubIOIT_Python_Streaming/ws/src/sdks/python/apache_beam/io/gcp/pubsub_io_perf_test.py",> line 183, in test
    | 'Write to Pubsub' >> beam.io.WriteToPubSub(self.matcher_topic_name))
  File "<https://ci-beam.apache.org/job/beam_PerformanceTests_PubsubIOIT_Python_Streaming/ws/src/sdks/python/apache_beam/pvalue.py",> line 137, in __or__
    return self.pipeline.apply(ptransform, self)
  File "<https://ci-beam.apache.org/job/beam_PerformanceTests_PubsubIOIT_Python_Streaming/ws/src/sdks/python/apache_beam/pipeline.py",> line 646, in apply
    transform.transform, pvalueish, label or transform.label)
  File "<https://ci-beam.apache.org/job/beam_PerformanceTests_PubsubIOIT_Python_Streaming/ws/src/sdks/python/apache_beam/pipeline.py",> line 656, in apply
    return self.apply(transform, pvalueish)
  File "<https://ci-beam.apache.org/job/beam_PerformanceTests_PubsubIOIT_Python_Streaming/ws/src/sdks/python/apache_beam/pipeline.py",> line 702, in apply
    pvalueish_result = self.runner.apply(transform, pvalueish, self._options)
  File "<https://ci-beam.apache.org/job/beam_PerformanceTests_PubsubIOIT_Python_Streaming/ws/src/sdks/python/apache_beam/runners/dataflow/dataflow_runner.py",> line 141, in apply
    return super(DataflowRunner, self).apply(transform, input, options)
  File "<https://ci-beam.apache.org/job/beam_PerformanceTests_PubsubIOIT_Python_Streaming/ws/src/sdks/python/apache_beam/runners/runner.py",> line 185, in apply
    return m(transform, input, options)
  File "<https://ci-beam.apache.org/job/beam_PerformanceTests_PubsubIOIT_Python_Streaming/ws/src/sdks/python/apache_beam/runners/runner.py",> line 215, in apply_PTransform
    return transform.expand(input)
  File "<https://ci-beam.apache.org/job/beam_PerformanceTests_PubsubIOIT_Python_Streaming/ws/src/sdks/python/apache_beam/transforms/core.py",> line 1909, in expand
    | 'UnKey' >> Map(lambda k_v: k_v[1]))
  File "<https://ci-beam.apache.org/job/beam_PerformanceTests_PubsubIOIT_Python_Streaming/ws/src/sdks/python/apache_beam/pvalue.py",> line 137, in __or__
    return self.pipeline.apply(ptransform, self)
  File "<https://ci-beam.apache.org/job/beam_PerformanceTests_PubsubIOIT_Python_Streaming/ws/src/sdks/python/apache_beam/pipeline.py",> line 646, in apply
    transform.transform, pvalueish, label or transform.label)
  File "<https://ci-beam.apache.org/job/beam_PerformanceTests_PubsubIOIT_Python_Streaming/ws/src/sdks/python/apache_beam/pipeline.py",> line 656, in apply
    return self.apply(transform, pvalueish)
  File "<https://ci-beam.apache.org/job/beam_PerformanceTests_PubsubIOIT_Python_Streaming/ws/src/sdks/python/apache_beam/pipeline.py",> line 702, in apply
    pvalueish_result = self.runner.apply(transform, pvalueish, self._options)
  File "<https://ci-beam.apache.org/job/beam_PerformanceTests_PubsubIOIT_Python_Streaming/ws/src/sdks/python/apache_beam/runners/dataflow/dataflow_runner.py",> line 141, in apply
    return super(DataflowRunner, self).apply(transform, input, options)
  File "<https://ci-beam.apache.org/job/beam_PerformanceTests_PubsubIOIT_Python_Streaming/ws/src/sdks/python/apache_beam/runners/runner.py",> line 185, in apply
    return m(transform, input, options)
  File "<https://ci-beam.apache.org/job/beam_PerformanceTests_PubsubIOIT_Python_Streaming/ws/src/sdks/python/apache_beam/runners/runner.py",> line 215, in apply_PTransform
    return transform.expand(input)
  File "<https://ci-beam.apache.org/job/beam_PerformanceTests_PubsubIOIT_Python_Streaming/ws/src/sdks/python/apache_beam/transforms/core.py",> line 2048, in expand
    return pcoll | GroupByKey() | 'Combine' >> CombineValues(
  File "<https://ci-beam.apache.org/job/beam_PerformanceTests_PubsubIOIT_Python_Streaming/ws/src/sdks/python/apache_beam/pvalue.py",> line 137, in __or__
    return self.pipeline.apply(ptransform, self)
  File "<https://ci-beam.apache.org/job/beam_PerformanceTests_PubsubIOIT_Python_Streaming/ws/src/sdks/python/apache_beam/pipeline.py",> line 702, in apply
    pvalueish_result = self.runner.apply(transform, pvalueish, self._options)
  File "<https://ci-beam.apache.org/job/beam_PerformanceTests_PubsubIOIT_Python_Streaming/ws/src/sdks/python/apache_beam/runners/dataflow/dataflow_runner.py",> line 141, in apply
    return super(DataflowRunner, self).apply(transform, input, options)
  File "<https://ci-beam.apache.org/job/beam_PerformanceTests_PubsubIOIT_Python_Streaming/ws/src/sdks/python/apache_beam/runners/runner.py",> line 185, in apply
    return m(transform, input, options)
  File "<https://ci-beam.apache.org/job/beam_PerformanceTests_PubsubIOIT_Python_Streaming/ws/src/sdks/python/apache_beam/runners/dataflow/dataflow_runner.py",> line 833, in apply_GroupByKey
    return transform.expand(pcoll)
  File "<https://ci-beam.apache.org/job/beam_PerformanceTests_PubsubIOIT_Python_Streaming/ws/src/sdks/python/apache_beam/transforms/core.py",> line 2349, in expand
    raise ValueError(msg)
ValueError: GroupByKey: Unsafe trigger: `Repeatedly(AfterCount(2097152))` may lose data. Reason: CONDITION_NOT_GUARANTEED. This can be overriden with the --allow_unsafe_triggers flag.

> Task :sdks:python:apache_beam:testing:load_tests:run FAILED

FAILURE: Build failed with an exception.

* Where:
Build file '<https://ci-beam.apache.org/job/beam_PerformanceTests_PubsubIOIT_Python_Streaming/ws/src/sdks/python/apache_beam/testing/load_tests/build.gradle'> line: 58

* What went wrong:
Execution failed for task ':sdks:python:apache_beam:testing:load_tests:run'.
> error occurred

* Try:
Run with --stacktrace option to get the stack trace. Run with --info or --debug option to get more log output. Run with --scan to get full insights.

* Get more help at https://help.gradle.org

Deprecated Gradle features were used in this build, making it incompatible with Gradle 7.0.
Use '--warning-mode all' to show the individual deprecation warnings.
See https://docs.gradle.org/6.9.1/userguide/command_line_interface.html#sec:command_line_warnings

BUILD FAILED in 13m 15s
83 actionable tasks: 53 executed, 30 from cache

Publishing build scan...
https://gradle.com/s/ajh6p72dvl6ws

Build step 'Invoke Gradle script' changed build result to FAILURE
Build step 'Invoke Gradle script' marked build as failure

---------------------------------------------------------------------
To unsubscribe, e-mail: builds-unsubscribe@beam.apache.org
For additional commands, e-mail: builds-help@beam.apache.org


Build failed in Jenkins: beam_PerformanceTests_PubsubIOIT_Python_Streaming #472

Posted by Apache Jenkins Server <je...@builds.apache.org>.
See <https://ci-beam.apache.org/job/beam_PerformanceTests_PubsubIOIT_Python_Streaming/472/display/redirect?page=changes>

Changes:

[kileysok] Add MapState and SetState support

[Kyle Weaver] [BEAM-12898] Use new postbuildscript dsl in Flink load tests

[Kyle Weaver] run postbuild regardless of test result

[Kyle Weaver] spotless

[noreply] Merge pull request #15487 from [BEAM-12812] - Run Github Actions on GCP

[noreply] [BEAM-11097] Add SideInputCache to harness control type (#15530)

[kawaigin] Updated interactive integration test golden screenshots.

[noreply] Revert PR 15487 (BEAM-12812) (#15554)

[zyichi] [BEAM-12898] Trying out solution suggestion for JENKINS-66189 to solve

[noreply] [BEAM-12383] Adding Go SDK and Kafka IO to Gradle cross-language test


------------------------------------------
[...truncated 62.05 KB...]
Collecting grpc-google-iam-v1<0.13dev,>=0.12.3
  Using cached grpc_google_iam_v1-0.12.3-py3-none-any.whl
Collecting google-crc32c<2.0dev,>=1.0
  Using cached google_crc32c-1.2.0-cp37-cp37m-manylinux_2_12_x86_64.manylinux2010_x86_64.whl (38 kB)
Collecting docopt
  Using cached docopt-0.6.2-py2.py3-none-any.whl
Requirement already satisfied: pyparsing<3,>=2.4.2 in <https://ci-beam.apache.org/job/beam_PerformanceTests_PubsubIOIT_Python_Streaming/ws/src/build/gradleenv/1329484227/lib/python3.7/site-packages> (from httplib2<0.20.0,>=0.8->apache-beam==2.34.0.dev0) (2.4.7)
Collecting pbr>=0.11
  Using cached pbr-5.6.0-py2.py3-none-any.whl (111 kB)
Collecting isodate>=0.6.0
  Using cached isodate-0.6.0-py2.py3-none-any.whl (45 kB)
Collecting certifi>=2017.4.17
  Using cached certifi-2021.5.30-py2.py3-none-any.whl (145 kB)
Collecting requests-oauthlib>=0.5.0
  Using cached requests_oauthlib-1.3.0-py2.py3-none-any.whl (23 kB)
Collecting pyasn1>=0.1.7
  Using cached pyasn1-0.4.8-py2.py3-none-any.whl (77 kB)
Requirement already satisfied: py>=1.5.0 in <https://ci-beam.apache.org/job/beam_PerformanceTests_PubsubIOIT_Python_Streaming/ws/src/build/gradleenv/1329484227/lib/python3.7/site-packages> (from pytest<5.0,>=4.4.0->apache-beam==2.34.0.dev0) (1.10.0)
Collecting atomicwrites>=1.0
  Using cached atomicwrites-1.4.0-py2.py3-none-any.whl (6.8 kB)
Collecting more-itertools>=4.0.0
  Using cached more_itertools-8.10.0-py3-none-any.whl (51 kB)
Collecting pluggy<1.0,>=0.12
  Using cached pluggy-0.13.1-py2.py3-none-any.whl (18 kB)
Requirement already satisfied: importlib-metadata>=0.12 in <https://ci-beam.apache.org/job/beam_PerformanceTests_PubsubIOIT_Python_Streaming/ws/src/build/gradleenv/1329484227/lib/python3.7/site-packages> (from pytest<5.0,>=4.4.0->apache-beam==2.34.0.dev0) (2.1.1)
Collecting wcwidth
  Using cached wcwidth-0.2.5-py2.py3-none-any.whl (30 kB)
Collecting attrs>=17.4.0
  Using cached attrs-21.2.0-py2.py3-none-any.whl (53 kB)
Requirement already satisfied: zipp>=0.5 in <https://ci-beam.apache.org/job/beam_PerformanceTests_PubsubIOIT_Python_Streaming/ws/src/build/gradleenv/1329484227/lib/python3.7/site-packages> (from importlib-metadata>=0.12->pytest<5.0,>=4.4.0->apache-beam==2.34.0.dev0) (3.5.0)
Collecting execnet>=1.1
  Using cached execnet-1.9.0-py2.py3-none-any.whl (39 kB)
Collecting pytest-forked
  Using cached pytest_forked-1.3.0-py2.py3-none-any.whl (4.7 kB)
Collecting charset-normalizer~=2.0.0
  Using cached charset_normalizer-2.0.6-py3-none-any.whl (37 kB)
Collecting idna<4,>=2.5
  Using cached idna-3.2-py3-none-any.whl (59 kB)
Collecting oauthlib>=3.0.0
  Using cached oauthlib-3.1.1-py2.py3-none-any.whl (146 kB)
Collecting greenlet!=0.4.17
  Using cached greenlet-1.1.1-cp37-cp37m-manylinux_2_17_x86_64.manylinux2014_x86_64.whl (143 kB)
Collecting docker
  Using cached docker-5.0.2-py2.py3-none-any.whl (145 kB)
Collecting wrapt
  Using cached wrapt-1.12.1-cp37-cp37m-linux_x86_64.whl
Collecting deprecation
  Using cached deprecation-2.1.0-py2.py3-none-any.whl (11 kB)
Collecting websocket-client>=0.32.0
  Using cached websocket_client-1.2.1-py2.py3-none-any.whl (52 kB)
Building wheels for collected packages: apache-beam
  Building wheel for apache-beam (setup.py): started
  Building wheel for apache-beam (setup.py): finished with status 'done'
  Created wheel for apache-beam: filename=apache_beam-2.34.0.dev0-py3-none-any.whl size=2547059 sha256=fc0688831297e6229b488c29a7c35fefbbeb728414ca544cd62b15ce3d8e8ac5
  Stored in directory: /home/jenkins/.cache/pip/wheels/ab/30/db/7a1d878abb34081c011192312e662d364ee443467dfb553778
Successfully built apache-beam

> Task :runners:google-cloud-dataflow-java:****:compileJava

> Task :sdks:python:apache_beam:testing:load_tests:installGcpTest
Installing collected packages: pyasn1, urllib3, rsa, pyasn1-modules, protobuf, idna, charset-normalizer, certifi, cachetools, wcwidth, requests, pytz, python-dateutil, pycparser, pluggy, oauthlib, more-itertools, jmespath, googleapis-common-protos, google-auth, attrs, atomicwrites, websocket-client, requests-oauthlib, pytest, numpy, isodate, httplib2, grpcio-gcp, google-crc32c, google-api-core, docopt, cffi, botocore, wrapt, typing-extensions, s3transfer, pytest-forked, pymongo, pydot, pyarrow, proto-plus, pbr, orjson, oauth2client, msrest, hdfs, grpc-google-iam-v1, greenlet, google-resumable-media, google-cloud-core, fasteners, fastavro, execnet, docker, dill, deprecation, cryptography, crcmod, azure-core, avro-python3, testcontainers, tenacity, sqlalchemy, requests-mock, pyyaml, pytest-xdist, pytest-timeout, pyhamcrest, psycopg2-binary, parameterized, pandas, mock, google-cloud-vision, google-cloud-videointelligence, google-cloud-spanner, google-cloud-recommendations-ai, google-cloud-pubsub, google-cloud-language, google-cloud-dlp, google-cloud-datastore, google-cloud-bigtable, google-cloud-bigquery, google-apitools, freezegun, boto3, azure-storage-blob, apache-beam
  Attempting uninstall: protobuf
    Found existing installation: protobuf 3.18.0
    Uninstalling protobuf-3.18.0:
      Successfully uninstalled protobuf-3.18.0
  Attempting uninstall: pluggy
    Found existing installation: pluggy 1.0.0
    Uninstalling pluggy-1.0.0:
      Successfully uninstalled pluggy-1.0.0
Successfully installed apache-beam-2.34.0.dev0 atomicwrites-1.4.0 attrs-21.2.0 avro-python3-1.9.2.1 azure-core-1.18.0 azure-storage-blob-12.9.0 boto3-1.18.46 botocore-1.21.46 cachetools-4.2.2 certifi-2021.5.30 cffi-1.14.6 charset-normalizer-2.0.6 crcmod-1.7 cryptography-3.4.8 deprecation-2.1.0 dill-0.3.1.1 docker-5.0.2 docopt-0.6.2 execnet-1.9.0 fastavro-1.4.5 fasteners-0.16.3 freezegun-1.1.0 google-api-core-1.31.3 google-apitools-0.5.31 google-auth-1.35.0 google-cloud-bigquery-2.26.0 google-cloud-bigtable-1.7.0 google-cloud-core-1.7.2 google-cloud-datastore-1.15.3 google-cloud-dlp-1.0.0 google-cloud-language-1.3.0 google-cloud-pubsub-1.7.0 google-cloud-recommendations-ai-0.2.0 google-cloud-spanner-1.19.1 google-cloud-videointelligence-1.16.1 google-cloud-vision-1.0.0 google-crc32c-1.2.0 google-resumable-media-2.0.3 googleapis-common-protos-1.53.0 greenlet-1.1.1 grpc-google-iam-v1-0.12.3 grpcio-gcp-0.2.2 hdfs-2.6.0 httplib2-0.19.1 idna-3.2 isodate-0.6.0 jmespath-0.10.0 mock-2.0.0 more-itertools-8.10.0 msrest-0.6.21 numpy-1.20.3 oauth2client-4.1.3 oauthlib-3.1.1 orjson-3.6.3 pandas-1.2.5 parameterized-0.7.5 pbr-5.6.0 pluggy-0.13.1 proto-plus-1.19.0 protobuf-3.17.3 psycopg2-binary-2.9.1 pyarrow-4.0.1 pyasn1-0.4.8 pyasn1-modules-0.2.8 pycparser-2.20 pydot-1.4.2 pyhamcrest-1.10.1 pymongo-3.12.0 pytest-4.6.11 pytest-forked-1.3.0 pytest-timeout-1.4.2 pytest-xdist-1.34.0 python-dateutil-2.8.2 pytz-2021.1 pyyaml-5.4.1 requests-2.26.0 requests-mock-1.9.3 requests-oauthlib-1.3.0 rsa-4.7.2 s3transfer-0.5.0 sqlalchemy-1.4.25 tenacity-5.1.5 testcontainers-3.4.2 typing-extensions-3.10.0.2 urllib3-1.26.7 wcwidth-0.2.5 websocket-client-1.2.1 wrapt-1.12.1

> Task :runners:google-cloud-dataflow-java:****:compileJava
Note: Some input files use or override a deprecated API.
Note: Recompile with -Xlint:deprecation for details.
Note: Some input files use unchecked or unsafe operations.
Note: Recompile with -Xlint:unchecked for details.

> Task :runners:google-cloud-dataflow-java:****:classes
> Task :runners:google-cloud-dataflow-java:****:shadowJar

> Task :sdks:python:apache_beam:testing:load_tests:run
INFO:apache_beam.runners.portability.stager:Copying Beam SDK "<https://ci-beam.apache.org/job/beam_PerformanceTests_PubsubIOIT_Python_Streaming/ws/src/sdks/python/build/apache-beam.tar.gz"> to staging location.
WARNING:root:Make sure that locally built Python SDK docker image has Python 3.7 interpreter.
INFO:root:Default Python SDK image for environment is apache/beam_python3.7_sdk:2.34.0.dev
INFO:root:Using provided Python SDK container image: gcr.io/cloud-dataflow/v1beta3/python37-fnapi:beam-master-20210809
INFO:root:Python SDK container image set to "gcr.io/cloud-dataflow/v1beta3/python37-fnapi:beam-master-20210809" for Docker environment
INFO:apache_beam.runners.dataflow.internal.apiclient:Defaulting to the temp_location as staging_location: gs://temp-storage-for-perf-tests/loadtests
INFO:apache_beam.internal.gcp.auth:Setting socket default timeout to 60 seconds.
INFO:apache_beam.internal.gcp.auth:socket default timeout is 60.0 seconds.
INFO:apache_beam.runners.dataflow.internal.apiclient:Starting GCS upload to gs://temp-storage-for-perf-tests/loadtests/performance-tests-psio-python-2gb0922200453.1632412326.497912/pickled_main_session...
INFO:oauth2client.transport:Attempting refresh to obtain initial access_token
INFO:oauth2client.transport:Attempting refresh to obtain initial access_token
INFO:apache_beam.runners.dataflow.internal.apiclient:Completed GCS upload to gs://temp-storage-for-perf-tests/loadtests/performance-tests-psio-python-2gb0922200453.1632412326.497912/pickled_main_session in 0 seconds.
INFO:apache_beam.runners.dataflow.internal.apiclient:Starting GCS upload to gs://temp-storage-for-perf-tests/loadtests/performance-tests-psio-python-2gb0922200453.1632412326.497912/dataflow_python_sdk.tar...
INFO:apache_beam.runners.dataflow.internal.apiclient:Completed GCS upload to gs://temp-storage-for-perf-tests/loadtests/performance-tests-psio-python-2gb0922200453.1632412326.497912/dataflow_python_sdk.tar in 0 seconds.
INFO:apache_beam.runners.dataflow.internal.apiclient:Starting GCS upload to gs://temp-storage-for-perf-tests/loadtests/performance-tests-psio-python-2gb0922200453.1632412326.497912/dataflow-****.jar...
INFO:apache_beam.runners.dataflow.internal.apiclient:Completed GCS upload to gs://temp-storage-for-perf-tests/loadtests/performance-tests-psio-python-2gb0922200453.1632412326.497912/dataflow-****.jar in 3 seconds.
INFO:apache_beam.runners.dataflow.internal.apiclient:Starting GCS upload to gs://temp-storage-for-perf-tests/loadtests/performance-tests-psio-python-2gb0922200453.1632412326.497912/pipeline.pb...
INFO:apache_beam.runners.dataflow.internal.apiclient:Completed GCS upload to gs://temp-storage-for-perf-tests/loadtests/performance-tests-psio-python-2gb0922200453.1632412326.497912/pipeline.pb in 0 seconds.
WARNING:apache_beam.options.pipeline_options:Discarding unparseable args: ['--pubsub_namespace_prefix=pubsub_io_performance_']
WARNING:apache_beam.options.pipeline_options:Discarding unparseable args: ['--pubsub_namespace_prefix=pubsub_io_performance_']
INFO:apache_beam.runners.dataflow.internal.apiclient:Create job: <Job
 clientRequestId: '20210923155206498885-6674'
 createTime: '2021-09-23T15:52:11.184180Z'
 currentStateTime: '1970-01-01T00:00:00Z'
 id: '2021-09-23_08_52_10-3003323734479457269'
 location: 'us-central1'
 name: 'performance-tests-psio-python-2gb0922200453'
 projectId: 'apache-beam-testing'
 stageStates: []
 startTime: '2021-09-23T15:52:11.184180Z'
 steps: []
 tempFiles: []
 type: TypeValueValuesEnum(JOB_TYPE_STREAMING, 2)>
INFO:apache_beam.runners.dataflow.internal.apiclient:Created job with id: [2021-09-23_08_52_10-3003323734479457269]
INFO:apache_beam.runners.dataflow.internal.apiclient:Submitted job: 2021-09-23_08_52_10-3003323734479457269
INFO:apache_beam.runners.dataflow.internal.apiclient:To access the Dataflow monitoring console, please navigate to https://console.cloud.google.com/dataflow/jobs/us-central1/2021-09-23_08_52_10-3003323734479457269?project=apache-beam-testing
INFO:apache_beam.runners.dataflow.dataflow_runner:Job 2021-09-23_08_52_10-3003323734479457269 is in state JOB_STATE_RUNNING
INFO:apache_beam.runners.dataflow.dataflow_runner:2021-09-23T15:52:10.323Z: JOB_MESSAGE_BASIC: Streaming Engine auto-enabled. Use --experiments=disable_streaming_engine to opt out.
INFO:apache_beam.runners.dataflow.dataflow_runner:2021-09-23T15:52:10.323Z: JOB_MESSAGE_BASIC: Dataflow Runner V2 auto-enabled. Use --experiments=disable_runner_v2 to opt out.
INFO:apache_beam.runners.dataflow.dataflow_runner:2021-09-23T15:52:17.023Z: JOB_MESSAGE_BASIC: Worker configuration: e2-standard-2 in us-central1-a.
INFO:apache_beam.runners.dataflow.dataflow_runner:2021-09-23T15:52:17.651Z: JOB_MESSAGE_DETAILED: Expanding SplittableParDo operations into optimizable parts.
INFO:apache_beam.runners.dataflow.dataflow_runner:2021-09-23T15:52:17.680Z: JOB_MESSAGE_DETAILED: Expanding CollectionToSingleton operations into optimizable parts.
INFO:apache_beam.runners.dataflow.dataflow_runner:2021-09-23T15:52:17.748Z: JOB_MESSAGE_DETAILED: Expanding CoGroupByKey operations into optimizable parts.
INFO:apache_beam.runners.dataflow.dataflow_runner:2021-09-23T15:52:17.787Z: JOB_MESSAGE_DEBUG: Combiner lifting skipped for step Create input/Reshuffle/ReshufflePerKey/GroupByKey: GroupByKey not followed by a combiner.
INFO:apache_beam.runners.dataflow.dataflow_runner:2021-09-23T15:52:17.833Z: JOB_MESSAGE_DETAILED: Expanding SplittableProcessKeyed operations into optimizable parts.
INFO:apache_beam.runners.dataflow.dataflow_runner:2021-09-23T15:52:17.858Z: JOB_MESSAGE_DETAILED: Expanding GroupByKey operations into streaming Read/Write steps
INFO:apache_beam.runners.dataflow.dataflow_runner:2021-09-23T15:52:17.932Z: JOB_MESSAGE_DETAILED: Lifting ValueCombiningMappingFns into MergeBucketsMappingFns
INFO:apache_beam.runners.dataflow.dataflow_runner:2021-09-23T15:52:17.996Z: JOB_MESSAGE_DEBUG: Annotating graph with Autotuner information.
INFO:apache_beam.runners.dataflow.dataflow_runner:2021-09-23T15:52:18.030Z: JOB_MESSAGE_DETAILED: Fusing adjacent ParDo, Read, Write, and Flatten operations
INFO:apache_beam.runners.dataflow.dataflow_runner:2021-09-23T15:52:18.081Z: JOB_MESSAGE_DETAILED: Fusing consumer Create input/Split into Create input/Impulse
INFO:apache_beam.runners.dataflow.dataflow_runner:2021-09-23T15:52:18.134Z: JOB_MESSAGE_DETAILED: Fusing consumer Create input/Reshuffle/AddRandomKeys into Create input/Split
INFO:apache_beam.runners.dataflow.dataflow_runner:2021-09-23T15:52:18.182Z: JOB_MESSAGE_DETAILED: Fusing consumer Create input/Reshuffle/ReshufflePerKey/Map(reify_timestamps) into Create input/Reshuffle/AddRandomKeys
INFO:apache_beam.runners.dataflow.dataflow_runner:2021-09-23T15:52:18.206Z: JOB_MESSAGE_DETAILED: Fusing consumer Create input/Reshuffle/ReshufflePerKey/GroupByKey/WriteStream into Create input/Reshuffle/ReshufflePerKey/Map(reify_timestamps)
INFO:apache_beam.runners.dataflow.dataflow_runner:2021-09-23T15:52:18.236Z: JOB_MESSAGE_DETAILED: Fusing consumer Create input/Reshuffle/ReshufflePerKey/GroupByKey/MergeBuckets into Create input/Reshuffle/ReshufflePerKey/GroupByKey/ReadStream
INFO:apache_beam.runners.dataflow.dataflow_runner:2021-09-23T15:52:18.265Z: JOB_MESSAGE_DETAILED: Fusing consumer Create input/Reshuffle/ReshufflePerKey/FlatMap(restore_timestamps) into Create input/Reshuffle/ReshufflePerKey/GroupByKey/MergeBuckets
INFO:apache_beam.runners.dataflow.dataflow_runner:2021-09-23T15:52:18.298Z: JOB_MESSAGE_DETAILED: Fusing consumer Create input/Reshuffle/RemoveRandomKeys into Create input/Reshuffle/ReshufflePerKey/FlatMap(restore_timestamps)
INFO:apache_beam.runners.dataflow.dataflow_runner:2021-09-23T15:52:18.342Z: JOB_MESSAGE_DETAILED: Fusing consumer Create input/ReadSplits into Create input/Reshuffle/RemoveRandomKeys
INFO:apache_beam.runners.dataflow.dataflow_runner:2021-09-23T15:52:18.362Z: JOB_MESSAGE_DETAILED: Fusing consumer Format to pubsub message in bytes into Create input/ReadSplits
INFO:apache_beam.runners.dataflow.dataflow_runner:2021-09-23T15:52:18.396Z: JOB_MESSAGE_DETAILED: Fusing consumer Measure time into Format to pubsub message in bytes
INFO:apache_beam.runners.dataflow.dataflow_runner:2021-09-23T15:52:18.429Z: JOB_MESSAGE_DETAILED: Fusing consumer Write to Pubsub/ToProtobuf into Measure time
INFO:apache_beam.runners.dataflow.dataflow_runner:2021-09-23T15:52:18.466Z: JOB_MESSAGE_DETAILED: Fusing consumer Write to Pubsub/Write into Write to Pubsub/ToProtobuf
INFO:apache_beam.runners.dataflow.dataflow_runner:2021-09-23T15:52:18.497Z: JOB_MESSAGE_DEBUG: Workflow config is missing a default resource spec.
INFO:apache_beam.runners.dataflow.dataflow_runner:2021-09-23T15:52:18.531Z: JOB_MESSAGE_DEBUG: Adding StepResource setup and teardown to workflow graph.
INFO:apache_beam.runners.dataflow.dataflow_runner:2021-09-23T15:52:18.555Z: JOB_MESSAGE_DEBUG: Adding workflow start and stop steps.
INFO:apache_beam.runners.dataflow.dataflow_runner:2021-09-23T15:52:18.595Z: JOB_MESSAGE_DEBUG: Assigning stage ids.
INFO:apache_beam.runners.dataflow.dataflow_runner:2021-09-23T15:52:18.664Z: JOB_MESSAGE_DEBUG: Starting **** pool setup.
INFO:apache_beam.runners.dataflow.dataflow_runner:2021-09-23T15:52:18.700Z: JOB_MESSAGE_BASIC: Starting 5 ****s in us-central1-a...
INFO:apache_beam.runners.dataflow.dataflow_runner:2021-09-23T15:52:18.737Z: JOB_MESSAGE_DEBUG: Starting **** pool setup.
INFO:apache_beam.runners.dataflow.dataflow_runner:2021-09-23T15:52:44.362Z: JOB_MESSAGE_BASIC: Your project already contains 100 Dataflow-created metric descriptors, so new user metrics of the form custom.googleapis.com/* will not be created. However, all user metrics are also available in the metric dataflow.googleapis.com/job/user_counter. If you rely on the custom metrics, you can delete old / unused metric descriptors. See https://developers.google.com/apis-explorer/#p/monitoring/v3/monitoring.projects.metricDescriptors.list and https://developers.google.com/apis-explorer/#p/monitoring/v3/monitoring.projects.metricDescriptors.delete
INFO:apache_beam.runners.dataflow.dataflow_runner:2021-09-23T15:52:56.672Z: JOB_MESSAGE_DETAILED: Autoscaling: Raised the number of ****s to 2 so that the pipeline can catch up with its backlog and keep up with its input rate.
INFO:apache_beam.runners.dataflow.dataflow_runner:2021-09-23T15:52:56.711Z: JOB_MESSAGE_DETAILED: Resized **** pool to 2, though goal was 5.  This could be a quota issue.
INFO:apache_beam.runners.dataflow.dataflow_runner:2021-09-23T15:53:07.059Z: JOB_MESSAGE_DETAILED: Autoscaling: Raised the number of ****s to 5 so that the pipeline can catch up with its backlog and keep up with its input rate.
INFO:apache_beam.runners.dataflow.dataflow_runner:2021-09-23T15:53:34.497Z: JOB_MESSAGE_DETAILED: Workers have started successfully.
INFO:apache_beam.runners.dataflow.dataflow_runner:2021-09-23T15:53:34.529Z: JOB_MESSAGE_DETAILED: Workers have started successfully.
INFO:apache_beam.runners.dataflow.dataflow_runner:2021-09-23T16:01:21.835Z: JOB_MESSAGE_DETAILED: Cleaning up.
INFO:apache_beam.runners.dataflow.dataflow_runner:2021-09-23T16:01:21.887Z: JOB_MESSAGE_DEBUG: Starting **** pool teardown.
INFO:apache_beam.runners.dataflow.dataflow_runner:2021-09-23T16:01:21.910Z: JOB_MESSAGE_BASIC: Stopping **** pool...
INFO:apache_beam.runners.dataflow.dataflow_runner:2021-09-23T16:01:21.949Z: JOB_MESSAGE_DEBUG: Starting **** pool teardown.
INFO:apache_beam.runners.dataflow.dataflow_runner:2021-09-23T16:01:21.985Z: JOB_MESSAGE_BASIC: Stopping **** pool...
WARNING:apache_beam.runners.dataflow.dataflow_runner:Timing out on waiting for job 2021-09-23_08_52_10-3003323734479457269 after 604 seconds
INFO:apache_beam.testing.load_tests.load_test_metrics_utils:Load test results for test: 8acad549720845eda11ca1417e5f3a2a and timestamp: 1632413038.0582361:
INFO:apache_beam.testing.load_tests.load_test_metrics_utils:Metric: pubsub_io_perf_write_runtime Value: 62
Traceback (most recent call last):
  File "/usr/lib/python3.7/runpy.py", line 193, in _run_module_as_main
    "__main__", mod_spec)
  File "/usr/lib/python3.7/runpy.py", line 85, in _run_code
    exec(code, run_globals)
  File "<https://ci-beam.apache.org/job/beam_PerformanceTests_PubsubIOIT_Python_Streaming/ws/src/sdks/python/apache_beam/io/gcp/pubsub_io_perf_test.py",> line 223, in <module>
    PubsubReadPerfTest().run()
  File "<https://ci-beam.apache.org/job/beam_PerformanceTests_PubsubIOIT_Python_Streaming/ws/src/sdks/python/apache_beam/testing/load_tests/load_test.py",> line 147, in run
    self.test()
  File "<https://ci-beam.apache.org/job/beam_PerformanceTests_PubsubIOIT_Python_Streaming/ws/src/sdks/python/apache_beam/io/gcp/pubsub_io_perf_test.py",> line 183, in test
    | 'Write to Pubsub' >> beam.io.WriteToPubSub(self.matcher_topic_name))
  File "<https://ci-beam.apache.org/job/beam_PerformanceTests_PubsubIOIT_Python_Streaming/ws/src/sdks/python/apache_beam/pvalue.py",> line 137, in __or__
Worker logs: https://console.cloud.google.com/dataflow/jobs/us-central1/2021-09-23_08_52_10-3003323734479457269?project=apache-beam-testing
    return self.pipeline.apply(ptransform, self)
  File "<https://ci-beam.apache.org/job/beam_PerformanceTests_PubsubIOIT_Python_Streaming/ws/src/sdks/python/apache_beam/pipeline.py",> line 646, in apply
    transform.transform, pvalueish, label or transform.label)
  File "<https://ci-beam.apache.org/job/beam_PerformanceTests_PubsubIOIT_Python_Streaming/ws/src/sdks/python/apache_beam/pipeline.py",> line 656, in apply
    return self.apply(transform, pvalueish)
  File "<https://ci-beam.apache.org/job/beam_PerformanceTests_PubsubIOIT_Python_Streaming/ws/src/sdks/python/apache_beam/pipeline.py",> line 702, in apply
    pvalueish_result = self.runner.apply(transform, pvalueish, self._options)
  File "<https://ci-beam.apache.org/job/beam_PerformanceTests_PubsubIOIT_Python_Streaming/ws/src/sdks/python/apache_beam/runners/dataflow/dataflow_runner.py",> line 141, in apply
    return super(DataflowRunner, self).apply(transform, input, options)
  File "<https://ci-beam.apache.org/job/beam_PerformanceTests_PubsubIOIT_Python_Streaming/ws/src/sdks/python/apache_beam/runners/runner.py",> line 185, in apply
    return m(transform, input, options)
  File "<https://ci-beam.apache.org/job/beam_PerformanceTests_PubsubIOIT_Python_Streaming/ws/src/sdks/python/apache_beam/runners/runner.py",> line 215, in apply_PTransform
    return transform.expand(input)
  File "<https://ci-beam.apache.org/job/beam_PerformanceTests_PubsubIOIT_Python_Streaming/ws/src/sdks/python/apache_beam/transforms/core.py",> line 1909, in expand
    | 'UnKey' >> Map(lambda k_v: k_v[1]))
  File "<https://ci-beam.apache.org/job/beam_PerformanceTests_PubsubIOIT_Python_Streaming/ws/src/sdks/python/apache_beam/pvalue.py",> line 137, in __or__
    return self.pipeline.apply(ptransform, self)
  File "<https://ci-beam.apache.org/job/beam_PerformanceTests_PubsubIOIT_Python_Streaming/ws/src/sdks/python/apache_beam/pipeline.py",> line 646, in apply
    transform.transform, pvalueish, label or transform.label)
  File "<https://ci-beam.apache.org/job/beam_PerformanceTests_PubsubIOIT_Python_Streaming/ws/src/sdks/python/apache_beam/pipeline.py",> line 656, in apply
    return self.apply(transform, pvalueish)
  File "<https://ci-beam.apache.org/job/beam_PerformanceTests_PubsubIOIT_Python_Streaming/ws/src/sdks/python/apache_beam/pipeline.py",> line 702, in apply
    pvalueish_result = self.runner.apply(transform, pvalueish, self._options)
  File "<https://ci-beam.apache.org/job/beam_PerformanceTests_PubsubIOIT_Python_Streaming/ws/src/sdks/python/apache_beam/runners/dataflow/dataflow_runner.py",> line 141, in apply
    return super(DataflowRunner, self).apply(transform, input, options)
  File "<https://ci-beam.apache.org/job/beam_PerformanceTests_PubsubIOIT_Python_Streaming/ws/src/sdks/python/apache_beam/runners/runner.py",> line 185, in apply
    return m(transform, input, options)
  File "<https://ci-beam.apache.org/job/beam_PerformanceTests_PubsubIOIT_Python_Streaming/ws/src/sdks/python/apache_beam/runners/runner.py",> line 215, in apply_PTransform
    return transform.expand(input)
  File "<https://ci-beam.apache.org/job/beam_PerformanceTests_PubsubIOIT_Python_Streaming/ws/src/sdks/python/apache_beam/transforms/core.py",> line 2048, in expand
    return pcoll | GroupByKey() | 'Combine' >> CombineValues(
  File "<https://ci-beam.apache.org/job/beam_PerformanceTests_PubsubIOIT_Python_Streaming/ws/src/sdks/python/apache_beam/pvalue.py",> line 137, in __or__
    return self.pipeline.apply(ptransform, self)
  File "<https://ci-beam.apache.org/job/beam_PerformanceTests_PubsubIOIT_Python_Streaming/ws/src/sdks/python/apache_beam/pipeline.py",> line 702, in apply
    pvalueish_result = self.runner.apply(transform, pvalueish, self._options)
  File "<https://ci-beam.apache.org/job/beam_PerformanceTests_PubsubIOIT_Python_Streaming/ws/src/sdks/python/apache_beam/runners/dataflow/dataflow_runner.py",> line 141, in apply
    return super(DataflowRunner, self).apply(transform, input, options)
  File "<https://ci-beam.apache.org/job/beam_PerformanceTests_PubsubIOIT_Python_Streaming/ws/src/sdks/python/apache_beam/runners/runner.py",> line 185, in apply
    return m(transform, input, options)
  File "<https://ci-beam.apache.org/job/beam_PerformanceTests_PubsubIOIT_Python_Streaming/ws/src/sdks/python/apache_beam/runners/dataflow/dataflow_runner.py",> line 833, in apply_GroupByKey
    return transform.expand(pcoll)
  File "<https://ci-beam.apache.org/job/beam_PerformanceTests_PubsubIOIT_Python_Streaming/ws/src/sdks/python/apache_beam/transforms/core.py",> line 2349, in expand
    raise ValueError(msg)
ValueError: GroupByKey: Unsafe trigger: `Repeatedly(AfterCount(2097152))` may lose data. Reason: CONDITION_NOT_GUARANTEED. This can be overriden with the --allow_unsafe_triggers flag.

> Task :sdks:python:apache_beam:testing:load_tests:run FAILED

FAILURE: Build failed with an exception.

* Where:
Build file '<https://ci-beam.apache.org/job/beam_PerformanceTests_PubsubIOIT_Python_Streaming/ws/src/sdks/python/apache_beam/testing/load_tests/build.gradle'> line: 58

* What went wrong:
Execution failed for task ':sdks:python:apache_beam:testing:load_tests:run'.
> error occurred

* Try:
Run with --stacktrace option to get the stack trace. Run with --info or --debug option to get more log output. Run with --scan to get full insights.

* Get more help at https://help.gradle.org

Deprecated Gradle features were used in this build, making it incompatible with Gradle 7.0.
Use '--warning-mode all' to show the individual deprecation warnings.
See https://docs.gradle.org/6.9.1/userguide/command_line_interface.html#sec:command_line_warnings

BUILD FAILED in 14m 41s
83 actionable tasks: 56 executed, 27 from cache

Publishing build scan...
https://gradle.com/s/4piviyceekyfq

Build step 'Invoke Gradle script' changed build result to FAILURE
Build step 'Invoke Gradle script' marked build as failure

---------------------------------------------------------------------
To unsubscribe, e-mail: builds-unsubscribe@beam.apache.org
For additional commands, e-mail: builds-help@beam.apache.org