You are viewing a plain text version of this content. The canonical link for it is here.
Posted to dev@zookeeper.apache.org by Apache Jenkins Server <je...@builds.apache.org> on 2017/02/13 22:39:23 UTC
ZooKeeper-trunk-solaris - Build # 1504 - Still Failing
See https://builds.apache.org/job/ZooKeeper-trunk-solaris/1504/
###################################################################################
########################## LAST 60 LINES OF THE CONSOLE ###########################
[...truncated 488523 lines...]
[junit] 2017-02-13 22:40:22,047 [myid:] - INFO [main:ClientBase@376] - STARTING server instance 127.0.0.1:11222
[junit] 2017-02-13 22:40:22,047 [myid:] - INFO [main:ZooKeeperServer@908] - minSessionTimeout set to 6000
[junit] 2017-02-13 22:40:22,048 [myid:] - INFO [main:ZooKeeperServer@917] - maxSessionTimeout set to 60000
[junit] 2017-02-13 22:40:22,048 [myid:] - INFO [main:ZooKeeperServer@160] - Created server with tickTime 3000 minSessionTimeout 6000 maxSessionTimeout 60000 datadir /zonestorage/hudson_solaris/home/hudson/hudson-slave/workspace/ZooKeeper-trunk-solaris/build/test/tmp/test159999848134751079.junit.dir/version-2 snapdir /zonestorage/hudson_solaris/home/hudson/hudson-slave/workspace/ZooKeeper-trunk-solaris/build/test/tmp/test159999848134751079.junit.dir/version-2
[junit] 2017-02-13 22:40:22,048 [myid:] - INFO [main:FileSnap@83] - Reading snapshot /zonestorage/hudson_solaris/home/hudson/hudson-slave/workspace/ZooKeeper-trunk-solaris/build/test/tmp/test159999848134751079.junit.dir/version-2/snapshot.b
[junit] 2017-02-13 22:40:22,050 [myid:] - INFO [main:FileTxnSnapLog@346] - Snapshotting: 0xb to /zonestorage/hudson_solaris/home/hudson/hudson-slave/workspace/ZooKeeper-trunk-solaris/build/test/tmp/test159999848134751079.junit.dir/version-2/snapshot.b
[junit] 2017-02-13 22:40:22,052 [myid:] - ERROR [main:ZooKeeperServer@506] - ZKShutdownHandler is not registered, so ZooKeeper server won't take any action on ERROR or SHUTDOWN server state changes
[junit] 2017-02-13 22:40:22,052 [myid:] - INFO [main:FourLetterWordMain@85] - connecting to 127.0.0.1 11222
[junit] 2017-02-13 22:40:22,052 [myid:] - INFO [NIOServerCxnFactory.AcceptThread:0.0.0.0/0.0.0.0:11222:NIOServerCnxnFactory$AcceptThread@296] - Accepted socket connection from /127.0.0.1:45560
[junit] 2017-02-13 22:40:22,053 [myid:] - INFO [NIOWorkerThread-1:NIOServerCnxn@485] - Processing stat command from /127.0.0.1:45560
[junit] 2017-02-13 22:40:22,053 [myid:] - INFO [NIOWorkerThread-1:StatCommand@49] - Stat command output
[junit] 2017-02-13 22:40:22,054 [myid:] - INFO [NIOWorkerThread-1:NIOServerCnxn@614] - Closed socket connection for client /127.0.0.1:45560 (no session established for client)
[junit] 2017-02-13 22:40:22,054 [myid:] - INFO [main:JMXEnv@228] - ensureParent:[InMemoryDataTree, StandaloneServer_port]
[junit] 2017-02-13 22:40:22,055 [myid:] - INFO [main:JMXEnv@245] - expect:InMemoryDataTree
[junit] 2017-02-13 22:40:22,055 [myid:] - INFO [main:JMXEnv@249] - found:InMemoryDataTree org.apache.ZooKeeperService:name0=StandaloneServer_port11222,name1=InMemoryDataTree
[junit] 2017-02-13 22:40:22,055 [myid:] - INFO [main:JMXEnv@245] - expect:StandaloneServer_port
[junit] 2017-02-13 22:40:22,055 [myid:] - INFO [main:JMXEnv@249] - found:StandaloneServer_port org.apache.ZooKeeperService:name0=StandaloneServer_port11222
[junit] 2017-02-13 22:40:22,056 [myid:] - INFO [main:JUnit4ZKTestRunner$LoggedInvokeMethod@82] - Memory used 18090
[junit] 2017-02-13 22:40:22,056 [myid:] - INFO [main:JUnit4ZKTestRunner$LoggedInvokeMethod@87] - Number of threads 24
[junit] 2017-02-13 22:40:22,056 [myid:] - INFO [main:JUnit4ZKTestRunner$LoggedInvokeMethod@102] - FINISHED TEST METHOD testQuota
[junit] 2017-02-13 22:40:22,056 [myid:] - INFO [main:ClientBase@558] - tearDown starting
[junit] 2017-02-13 22:40:22,132 [myid:] - INFO [main:ZooKeeper@1324] - Session: 0x126b69b40920000 closed
[junit] 2017-02-13 22:40:22,132 [myid:] - INFO [main-EventThread:ClientCnxn$EventThread@513] - EventThread shut down for session: 0x126b69b40920000
[junit] 2017-02-13 22:40:22,133 [myid:] - INFO [main:ClientBase@528] - STOPPING server
[junit] 2017-02-13 22:40:22,133 [myid:] - INFO [NIOServerCxnFactory.AcceptThread:0.0.0.0/0.0.0.0:11222:NIOServerCnxnFactory$AcceptThread@219] - accept thread exitted run method
[junit] 2017-02-13 22:40:22,133 [myid:] - INFO [NIOServerCxnFactory.SelectorThread-0:NIOServerCnxnFactory$SelectorThread@420] - selector thread exitted run method
[junit] 2017-02-13 22:40:22,133 [myid:] - INFO [ConnnectionExpirer:NIOServerCnxnFactory$ConnectionExpirerThread@583] - ConnnectionExpirerThread interrupted
[junit] 2017-02-13 22:40:22,134 [myid:] - INFO [NIOServerCxnFactory.SelectorThread-1:NIOServerCnxnFactory$SelectorThread@420] - selector thread exitted run method
[junit] 2017-02-13 22:40:22,134 [myid:] - INFO [main:ZooKeeperServer@542] - shutting down
[junit] 2017-02-13 22:40:22,134 [myid:] - ERROR [main:ZooKeeperServer@506] - ZKShutdownHandler is not registered, so ZooKeeper server won't take any action on ERROR or SHUTDOWN server state changes
[junit] 2017-02-13 22:40:22,134 [myid:] - INFO [main:SessionTrackerImpl@232] - Shutting down
[junit] 2017-02-13 22:40:22,135 [myid:] - INFO [main:PrepRequestProcessor@1008] - Shutting down
[junit] 2017-02-13 22:40:22,135 [myid:] - INFO [main:SyncRequestProcessor@191] - Shutting down
[junit] 2017-02-13 22:40:22,135 [myid:] - INFO [ProcessThread(sid:0 cport:11222)::PrepRequestProcessor@157] - PrepRequestProcessor exited loop!
[junit] 2017-02-13 22:40:22,135 [myid:] - INFO [SyncThread:0:SyncRequestProcessor@169] - SyncRequestProcessor exited!
[junit] 2017-02-13 22:40:22,135 [myid:] - INFO [main:FinalRequestProcessor@481] - shutdown of request processor complete
[junit] 2017-02-13 22:40:22,135 [myid:] - INFO [main:MBeanRegistry@128] - Unregister MBean [org.apache.ZooKeeperService:name0=StandaloneServer_port11222,name1=InMemoryDataTree]
[junit] 2017-02-13 22:40:22,136 [myid:] - INFO [main:MBeanRegistry@128] - Unregister MBean [org.apache.ZooKeeperService:name0=StandaloneServer_port11222]
[junit] 2017-02-13 22:40:22,136 [myid:] - INFO [main:FourLetterWordMain@85] - connecting to 127.0.0.1 11222
[junit] 2017-02-13 22:40:22,136 [myid:] - INFO [main:JMXEnv@146] - ensureOnly:[]
[junit] 2017-02-13 22:40:22,141 [myid:] - INFO [main:ClientBase@583] - fdcount after test is: 60 at start it was 43
[junit] 2017-02-13 22:40:22,142 [myid:] - INFO [main:ClientBase@585] - sleeping for 20 secs
[junit] 2017-02-13 22:40:22,143 [myid:] - INFO [main:ZKTestCase$1@65] - SUCCEEDED testQuota
[junit] 2017-02-13 22:40:22,143 [myid:] - INFO [main:ZKTestCase$1@60] - FINISHED testQuota
[junit] Tests run: 1, Failures: 0, Errors: 0, Time elapsed: 1.485 sec
fail.build.on.test.failure:
BUILD FAILED
/zonestorage/hudson_solaris/home/hudson/hudson-slave/workspace/ZooKeeper-trunk-solaris/build.xml:1242: The following error occurred while executing this line:
/zonestorage/hudson_solaris/home/hudson/hudson-slave/workspace/ZooKeeper-trunk-solaris/build.xml:1216: Tests failed!
Total time: 82 minutes 47 seconds
Build step 'Invoke Ant' marked build as failure
[locks-and-latches] Releasing all the locks
[locks-and-latches] All the locks released
Recording test results
Email was triggered for: Failure - Any
Sending email for trigger: Failure - Any
###################################################################################
############################## FAILED TESTS (if any) ##############################
2 tests failed.
FAILED: org.apache.zookeeper.test.ReconfigTest.testPortChangeToBlockedPortLeader
Error Message:
client could not connect to reestablished quorum: giving up after 30+ seconds.
Stack Trace:
junit.framework.AssertionFailedError: client could not connect to reestablished quorum: giving up after 30+ seconds.
at org.apache.zookeeper.test.ReconfigTest.testNormalOperation(ReconfigTest.java:183)
at org.apache.zookeeper.test.ReconfigTest.testPortChangeToBlockedPort(ReconfigTest.java:796)
at org.apache.zookeeper.test.ReconfigTest.testPortChangeToBlockedPortLeader(ReconfigTest.java:719)
at org.apache.zookeeper.JUnit4ZKTestRunner$LoggedInvokeMethod.evaluate(JUnit4ZKTestRunner.java:79)
FAILED: org.apache.zookeeper.test.ReconfigTest.testPortChangeToBlockedPortFollower
Error Message:
client could not connect to reestablished quorum: giving up after 30+ seconds.
Stack Trace:
junit.framework.AssertionFailedError: client could not connect to reestablished quorum: giving up after 30+ seconds.
at org.apache.zookeeper.test.ReconfigTest.testNormalOperation(ReconfigTest.java:183)
at org.apache.zookeeper.test.ReconfigTest.testPortChangeToBlockedPort(ReconfigTest.java:796)
at org.apache.zookeeper.test.ReconfigTest.testPortChangeToBlockedPortFollower(ReconfigTest.java:715)
at org.apache.zookeeper.JUnit4ZKTestRunner$LoggedInvokeMethod.evaluate(JUnit4ZKTestRunner.java:79)
ZooKeeper-trunk-solaris - Build # 1521 - Still Failing
Posted by Apache Jenkins Server <je...@builds.apache.org>.
See https://builds.apache.org/job/ZooKeeper-trunk-solaris/1521/
###################################################################################
########################## LAST 60 LINES OF THE CONSOLE ###########################
[...truncated 66.05 MB...]
[junit] 2017-02-27 08:35:35,776 [myid:] - INFO [main:ClientBase@376] - STARTING server instance 127.0.0.1:11222
[junit] 2017-02-27 08:35:35,776 [myid:] - INFO [main:ZooKeeperServer@908] - minSessionTimeout set to 6000
[junit] 2017-02-27 08:35:35,776 [myid:] - INFO [main:ZooKeeperServer@917] - maxSessionTimeout set to 60000
[junit] 2017-02-27 08:35:35,776 [myid:] - INFO [main:ZooKeeperServer@160] - Created server with tickTime 3000 minSessionTimeout 6000 maxSessionTimeout 60000 datadir /zonestorage/hudson_solaris/home/hudson/hudson-slave/workspace/ZooKeeper-trunk-solaris/build/test/tmp/test6609383126355056909.junit.dir/version-2 snapdir /zonestorage/hudson_solaris/home/hudson/hudson-slave/workspace/ZooKeeper-trunk-solaris/build/test/tmp/test6609383126355056909.junit.dir/version-2
[junit] 2017-02-27 08:35:35,777 [myid:] - INFO [main:FileSnap@83] - Reading snapshot /zonestorage/hudson_solaris/home/hudson/hudson-slave/workspace/ZooKeeper-trunk-solaris/build/test/tmp/test6609383126355056909.junit.dir/version-2/snapshot.b
[junit] 2017-02-27 08:35:35,779 [myid:] - INFO [main:FileTxnSnapLog@346] - Snapshotting: 0xb to /zonestorage/hudson_solaris/home/hudson/hudson-slave/workspace/ZooKeeper-trunk-solaris/build/test/tmp/test6609383126355056909.junit.dir/version-2/snapshot.b
[junit] 2017-02-27 08:35:35,780 [myid:] - ERROR [main:ZooKeeperServer@506] - ZKShutdownHandler is not registered, so ZooKeeper server won't take any action on ERROR or SHUTDOWN server state changes
[junit] 2017-02-27 08:35:35,780 [myid:] - INFO [main:FourLetterWordMain@85] - connecting to 127.0.0.1 11222
[junit] 2017-02-27 08:35:35,781 [myid:] - INFO [NIOServerCxnFactory.AcceptThread:0.0.0.0/0.0.0.0:11222:NIOServerCnxnFactory$AcceptThread@296] - Accepted socket connection from /127.0.0.1:54613
[junit] 2017-02-27 08:35:35,781 [myid:] - INFO [NIOWorkerThread-1:NIOServerCnxn@485] - Processing stat command from /127.0.0.1:54613
[junit] 2017-02-27 08:35:35,782 [myid:] - INFO [NIOWorkerThread-1:StatCommand@49] - Stat command output
[junit] 2017-02-27 08:35:35,782 [myid:] - INFO [NIOWorkerThread-1:NIOServerCnxn@614] - Closed socket connection for client /127.0.0.1:54613 (no session established for client)
[junit] 2017-02-27 08:35:35,782 [myid:] - INFO [main:JMXEnv@228] - ensureParent:[InMemoryDataTree, StandaloneServer_port]
[junit] 2017-02-27 08:35:35,783 [myid:] - INFO [main:JMXEnv@245] - expect:InMemoryDataTree
[junit] 2017-02-27 08:35:35,784 [myid:] - INFO [main:JMXEnv@249] - found:InMemoryDataTree org.apache.ZooKeeperService:name0=StandaloneServer_port11222,name1=InMemoryDataTree
[junit] 2017-02-27 08:35:35,784 [myid:] - INFO [main:JMXEnv@245] - expect:StandaloneServer_port
[junit] 2017-02-27 08:35:35,784 [myid:] - INFO [main:JMXEnv@249] - found:StandaloneServer_port org.apache.ZooKeeperService:name0=StandaloneServer_port11222
[junit] 2017-02-27 08:35:35,784 [myid:] - INFO [main:JUnit4ZKTestRunner$LoggedInvokeMethod@82] - Memory used 17907
[junit] 2017-02-27 08:35:35,784 [myid:] - INFO [main:JUnit4ZKTestRunner$LoggedInvokeMethod@87] - Number of threads 24
[junit] 2017-02-27 08:35:35,785 [myid:] - INFO [main:JUnit4ZKTestRunner$LoggedInvokeMethod@102] - FINISHED TEST METHOD testQuota
[junit] 2017-02-27 08:35:35,785 [myid:] - INFO [main:ClientBase@558] - tearDown starting
[junit] 2017-02-27 08:35:35,862 [myid:] - INFO [main:ZooKeeper@1324] - Session: 0x126fbaeaa420000 closed
[junit] 2017-02-27 08:35:35,862 [myid:] - INFO [main:ClientBase@528] - STOPPING server
[junit] 2017-02-27 08:35:35,862 [myid:] - INFO [main-EventThread:ClientCnxn$EventThread@513] - EventThread shut down for session: 0x126fbaeaa420000
[junit] 2017-02-27 08:35:35,862 [myid:] - INFO [NIOServerCxnFactory.SelectorThread-0:NIOServerCnxnFactory$SelectorThread@420] - selector thread exitted run method
[junit] 2017-02-27 08:35:35,862 [myid:] - INFO [NIOServerCxnFactory.SelectorThread-1:NIOServerCnxnFactory$SelectorThread@420] - selector thread exitted run method
[junit] 2017-02-27 08:35:35,862 [myid:] - INFO [ConnnectionExpirer:NIOServerCnxnFactory$ConnectionExpirerThread@583] - ConnnectionExpirerThread interrupted
[junit] 2017-02-27 08:35:35,862 [myid:] - INFO [NIOServerCxnFactory.AcceptThread:0.0.0.0/0.0.0.0:11222:NIOServerCnxnFactory$AcceptThread@219] - accept thread exitted run method
[junit] 2017-02-27 08:35:35,863 [myid:] - INFO [main:ZooKeeperServer@542] - shutting down
[junit] 2017-02-27 08:35:35,863 [myid:] - ERROR [main:ZooKeeperServer@506] - ZKShutdownHandler is not registered, so ZooKeeper server won't take any action on ERROR or SHUTDOWN server state changes
[junit] 2017-02-27 08:35:35,863 [myid:] - INFO [main:SessionTrackerImpl@232] - Shutting down
[junit] 2017-02-27 08:35:35,864 [myid:] - INFO [main:PrepRequestProcessor@1008] - Shutting down
[junit] 2017-02-27 08:35:35,864 [myid:] - INFO [main:SyncRequestProcessor@191] - Shutting down
[junit] 2017-02-27 08:35:35,864 [myid:] - INFO [ProcessThread(sid:0 cport:11222)::PrepRequestProcessor@157] - PrepRequestProcessor exited loop!
[junit] 2017-02-27 08:35:35,864 [myid:] - INFO [SyncThread:0:SyncRequestProcessor@169] - SyncRequestProcessor exited!
[junit] 2017-02-27 08:35:35,864 [myid:] - INFO [main:FinalRequestProcessor@481] - shutdown of request processor complete
[junit] 2017-02-27 08:35:35,864 [myid:] - INFO [main:MBeanRegistry@128] - Unregister MBean [org.apache.ZooKeeperService:name0=StandaloneServer_port11222,name1=InMemoryDataTree]
[junit] 2017-02-27 08:35:35,865 [myid:] - INFO [main:MBeanRegistry@128] - Unregister MBean [org.apache.ZooKeeperService:name0=StandaloneServer_port11222]
[junit] 2017-02-27 08:35:35,865 [myid:] - INFO [main:FourLetterWordMain@85] - connecting to 127.0.0.1 11222
[junit] 2017-02-27 08:35:35,865 [myid:] - INFO [main:JMXEnv@146] - ensureOnly:[]
[junit] 2017-02-27 08:35:35,870 [myid:] - INFO [main:ClientBase@583] - fdcount after test is: 60 at start it was 43
[junit] 2017-02-27 08:35:35,870 [myid:] - INFO [main:ClientBase@585] - sleeping for 20 secs
[junit] 2017-02-27 08:35:36,031 [myid:] - INFO [main:ZKTestCase$1@65] - SUCCEEDED testQuota
[junit] 2017-02-27 08:35:36,031 [myid:] - INFO [main:ZKTestCase$1@60] - FINISHED testQuota
[junit] Tests run: 1, Failures: 0, Errors: 0, Time elapsed: 1.097 sec
fail.build.on.test.failure:
BUILD FAILED
/zonestorage/hudson_solaris/home/hudson/hudson-slave/workspace/ZooKeeper-trunk-solaris/build.xml:1242: The following error occurred while executing this line:
/zonestorage/hudson_solaris/home/hudson/hudson-slave/workspace/ZooKeeper-trunk-solaris/build.xml:1216: Tests failed!
Total time: 76 minutes 14 seconds
Build step 'Invoke Ant' marked build as failure
[locks-and-latches] Releasing all the locks
[locks-and-latches] All the locks released
Recording test results
Email was triggered for: Failure - Any
Sending email for trigger: Failure - Any
###################################################################################
############################## FAILED TESTS (if any) ##############################
1 tests failed.
FAILED: org.apache.zookeeper.test.ReconfigTest.testJMXBeanAfterRoleChange
Error Message:
Timeout occurred. Please note the time in the report does not reflect the time until the timeout.
Stack Trace:
junit.framework.AssertionFailedError: Timeout occurred. Please note the time in the report does not reflect the time until the timeout.
ZooKeeper-trunk-solaris - Build # 1520 - Still Failing
Posted by Apache Jenkins Server <je...@builds.apache.org>.
See https://builds.apache.org/job/ZooKeeper-trunk-solaris/1520/
###################################################################################
########################## LAST 60 LINES OF THE CONSOLE ###########################
[...truncated 60.38 MB...]
[junit] 2017-02-26 09:00:11,007 [myid:] - INFO [main:JMXEnv@228] - ensureParent:[InMemoryDataTree, StandaloneServer_port]
[junit] 2017-02-26 09:00:11,009 [myid:] - INFO [main:JMXEnv@245] - expect:InMemoryDataTree
[junit] 2017-02-26 09:00:11,009 [myid:] - INFO [main:JMXEnv@249] - found:InMemoryDataTree org.apache.ZooKeeperService:name0=StandaloneServer_port11222,name1=InMemoryDataTree
[junit] 2017-02-26 09:00:11,009 [myid:] - INFO [main:JMXEnv@245] - expect:StandaloneServer_port
[junit] 2017-02-26 09:00:11,009 [myid:] - INFO [main:JMXEnv@249] - found:StandaloneServer_port org.apache.ZooKeeperService:name0=StandaloneServer_port11222
[junit] 2017-02-26 09:00:11,009 [myid:] - INFO [main:JUnit4ZKTestRunner$LoggedInvokeMethod@82] - Memory used 17907
[junit] 2017-02-26 09:00:11,010 [myid:] - INFO [main:JUnit4ZKTestRunner$LoggedInvokeMethod@87] - Number of threads 24
[junit] 2017-02-26 09:00:11,010 [myid:] - INFO [main:JUnit4ZKTestRunner$LoggedInvokeMethod@102] - FINISHED TEST METHOD testQuota
[junit] 2017-02-26 09:00:11,010 [myid:] - INFO [main:ClientBase@558] - tearDown starting
[junit] 2017-02-26 09:00:11,261 [myid:] - INFO [SessionTracker:SessionTrackerImpl@158] - SessionTrackerImpl exited loop!
[junit] 2017-02-26 09:00:11,261 [myid:] - INFO [SessionTracker:SessionTrackerImpl@158] - SessionTrackerImpl exited loop!
[junit] 2017-02-26 09:00:12,471 [myid:127.0.0.1:11222] - INFO [main-SendThread(127.0.0.1:11222):ClientCnxn$SendThread@1113] - Opening socket connection to server 127.0.0.1/127.0.0.1:11222. Will not attempt to authenticate using SASL (unknown error)
[junit] 2017-02-26 09:00:12,471 [myid:127.0.0.1:11222] - INFO [main-SendThread(127.0.0.1:11222):ClientCnxn$SendThread@948] - Socket connection established, initiating session, client: null, server: null
[junit] 2017-02-26 09:00:12,471 [myid:] - INFO [NIOServerCxnFactory.AcceptThread:0.0.0.0/0.0.0.0:11222:NIOServerCnxnFactory$AcceptThread@296] - Accepted socket connection from /127.0.0.1:59404
[junit] 2017-02-26 09:00:12,473 [myid:] - INFO [NIOWorkerThread-2:ZooKeeperServer@1019] - Client attempting to renew session 0x126f69ed1d10000 at /127.0.0.1:59404
[junit] 2017-02-26 09:00:12,473 [myid:] - INFO [NIOWorkerThread-2:ZooKeeperServer@728] - Established session 0x126f69ed1d10000 with negotiated timeout 30000 for client /127.0.0.1:59404
[junit] 2017-02-26 09:00:12,474 [myid:127.0.0.1:11222] - INFO [main-SendThread(127.0.0.1:11222):ClientCnxn$SendThread@1381] - Session establishment complete on server null, sessionid = 0x126f69ed1d10000, negotiated timeout = 30000
[junit] 2017-02-26 09:00:12,475 [myid:] - INFO [ProcessThread(sid:0 cport:11222)::PrepRequestProcessor@617] - Processed session termination for sessionid: 0x126f69ed1d10000
[junit] 2017-02-26 09:00:12,475 [myid:] - INFO [SyncThread:0:FileTxnLog@204] - Creating new log file: log.c
[junit] 2017-02-26 09:00:12,477 [myid:] - INFO [NIOWorkerThread-5:MBeanRegistry@128] - Unregister MBean [org.apache.ZooKeeperService:name0=StandaloneServer_port11222,name1=Connections,name2=127.0.0.1,name3=0x126f69ed1d10000]
[junit] 2017-02-26 09:00:12,478 [myid:] - INFO [NIOWorkerThread-5:NIOServerCnxn@614] - Closed socket connection for client /127.0.0.1:59404 which had sessionid 0x126f69ed1d10000
[junit] 2017-02-26 09:00:12,478 [myid:] - INFO [main:ZooKeeper@1324] - Session: 0x126f69ed1d10000 closed
[junit] 2017-02-26 09:00:12,478 [myid:] - INFO [main-EventThread:ClientCnxn$EventThread@513] - EventThread shut down for session: 0x126f69ed1d10000
[junit] 2017-02-26 09:00:12,478 [myid:] - INFO [main:ClientBase@528] - STOPPING server
[junit] 2017-02-26 09:00:12,479 [myid:] - INFO [ConnnectionExpirer:NIOServerCnxnFactory$ConnectionExpirerThread@583] - ConnnectionExpirerThread interrupted
[junit] 2017-02-26 09:00:12,479 [myid:] - INFO [NIOServerCxnFactory.SelectorThread-0:NIOServerCnxnFactory$SelectorThread@420] - selector thread exitted run method
[junit] 2017-02-26 09:00:12,479 [myid:] - INFO [NIOServerCxnFactory.AcceptThread:0.0.0.0/0.0.0.0:11222:NIOServerCnxnFactory$AcceptThread@219] - accept thread exitted run method
[junit] 2017-02-26 09:00:12,479 [myid:] - INFO [NIOServerCxnFactory.SelectorThread-1:NIOServerCnxnFactory$SelectorThread@420] - selector thread exitted run method
[junit] 2017-02-26 09:00:12,480 [myid:] - INFO [main:ZooKeeperServer@542] - shutting down
[junit] 2017-02-26 09:00:12,480 [myid:] - ERROR [main:ZooKeeperServer@506] - ZKShutdownHandler is not registered, so ZooKeeper server won't take any action on ERROR or SHUTDOWN server state changes
[junit] 2017-02-26 09:00:12,480 [myid:] - INFO [main:SessionTrackerImpl@232] - Shutting down
[junit] 2017-02-26 09:00:12,480 [myid:] - INFO [main:PrepRequestProcessor@1008] - Shutting down
[junit] 2017-02-26 09:00:12,481 [myid:] - INFO [main:SyncRequestProcessor@191] - Shutting down
[junit] 2017-02-26 09:00:12,481 [myid:] - INFO [ProcessThread(sid:0 cport:11222)::PrepRequestProcessor@157] - PrepRequestProcessor exited loop!
[junit] 2017-02-26 09:00:12,481 [myid:] - INFO [SyncThread:0:SyncRequestProcessor@169] - SyncRequestProcessor exited!
[junit] 2017-02-26 09:00:12,481 [myid:] - INFO [main:FinalRequestProcessor@481] - shutdown of request processor complete
[junit] 2017-02-26 09:00:12,481 [myid:] - INFO [main:MBeanRegistry@128] - Unregister MBean [org.apache.ZooKeeperService:name0=StandaloneServer_port11222,name1=InMemoryDataTree]
[junit] 2017-02-26 09:00:12,482 [myid:] - INFO [main:MBeanRegistry@128] - Unregister MBean [org.apache.ZooKeeperService:name0=StandaloneServer_port11222]
[junit] 2017-02-26 09:00:12,482 [myid:] - INFO [main:FourLetterWordMain@85] - connecting to 127.0.0.1 11222
[junit] 2017-02-26 09:00:12,483 [myid:] - INFO [main:JMXEnv@146] - ensureOnly:[]
[junit] 2017-02-26 09:00:12,551 [myid:] - INFO [main:ClientBase@583] - fdcount after test is: 60 at start it was 43
[junit] 2017-02-26 09:00:12,552 [myid:] - INFO [main:ClientBase@585] - sleeping for 20 secs
[junit] 2017-02-26 09:00:12,578 [myid:] - INFO [main:ZKTestCase$1@65] - SUCCEEDED testQuota
[junit] 2017-02-26 09:00:12,578 [myid:] - INFO [main:ZKTestCase$1@60] - FINISHED testQuota
[junit] Tests run: 1, Failures: 0, Errors: 0, Time elapsed: 14.298 sec
fail.build.on.test.failure:
BUILD FAILED
/zonestorage/hudson_solaris/home/hudson/hudson-slave/workspace/ZooKeeper-trunk-solaris/build.xml:1242: The following error occurred while executing this line:
/zonestorage/hudson_solaris/home/hudson/hudson-slave/workspace/ZooKeeper-trunk-solaris/build.xml:1216: Tests failed!
Total time: 102 minutes 28 seconds
Build step 'Invoke Ant' marked build as failure
[locks-and-latches] Releasing all the locks
[locks-and-latches] All the locks released
Recording test results
Email was triggered for: Failure - Any
Sending email for trigger: Failure - Any
###################################################################################
############################## FAILED TESTS (if any) ##############################
4 tests failed.
FAILED: org.apache.zookeeper.server.quorum.Zab1_0Test.testNormalObserverRun
Error Message:
Timeout occurred. Please note the time in the report does not reflect the time until the timeout.
Stack Trace:
junit.framework.AssertionFailedError: Timeout occurred. Please note the time in the report does not reflect the time until the timeout.
FAILED: org.apache.zookeeper.test.SSLTest.testSecureQuorumServer
Error Message:
waiting for server 0 being up
Stack Trace:
junit.framework.AssertionFailedError: waiting for server 0 being up
at org.apache.zookeeper.test.SSLTest.testSecureQuorumServer(SSLTest.java:96)
at org.apache.zookeeper.JUnit4ZKTestRunner$LoggedInvokeMethod.evaluate(JUnit4ZKTestRunner.java:79)
FAILED: org.apache.zookeeper.test.ReconfigTest.testPortChangeToBlockedPortLeader
Error Message:
client could not connect to reestablished quorum: giving up after 30+ seconds.
Stack Trace:
junit.framework.AssertionFailedError: client could not connect to reestablished quorum: giving up after 30+ seconds.
at org.apache.zookeeper.test.ReconfigTest.testNormalOperation(ReconfigTest.java:183)
at org.apache.zookeeper.test.ReconfigTest.testPortChangeToBlockedPort(ReconfigTest.java:796)
at org.apache.zookeeper.test.ReconfigTest.testPortChangeToBlockedPortLeader(ReconfigTest.java:719)
at org.apache.zookeeper.JUnit4ZKTestRunner$LoggedInvokeMethod.evaluate(JUnit4ZKTestRunner.java:79)
FAILED: org.apache.zookeeper.test.ReconfigTest.testPortChangeToBlockedPortFollower
Error Message:
client could not connect to reestablished quorum: giving up after 30+ seconds.
Stack Trace:
junit.framework.AssertionFailedError: client could not connect to reestablished quorum: giving up after 30+ seconds.
at org.apache.zookeeper.test.ReconfigTest.testNormalOperation(ReconfigTest.java:183)
at org.apache.zookeeper.test.ReconfigTest.testPortChangeToBlockedPort(ReconfigTest.java:796)
at org.apache.zookeeper.test.ReconfigTest.testPortChangeToBlockedPortFollower(ReconfigTest.java:715)
at org.apache.zookeeper.JUnit4ZKTestRunner$LoggedInvokeMethod.evaluate(JUnit4ZKTestRunner.java:79)
ZooKeeper-trunk-solaris - Build # 1519 - Still Failing
Posted by Apache Jenkins Server <je...@builds.apache.org>.
See https://builds.apache.org/job/ZooKeeper-trunk-solaris/1519/
###################################################################################
########################## LAST 60 LINES OF THE CONSOLE ###########################
[...truncated 58.90 MB...]
[junit] 2017-02-25 08:26:26,381 [myid:] - INFO [main:ClientBase@376] - STARTING server instance 127.0.0.1:11222
[junit] 2017-02-25 08:26:26,382 [myid:] - INFO [main:ZooKeeperServer@908] - minSessionTimeout set to 6000
[junit] 2017-02-25 08:26:26,382 [myid:] - INFO [main:ZooKeeperServer@917] - maxSessionTimeout set to 60000
[junit] 2017-02-25 08:26:26,382 [myid:] - INFO [main:ZooKeeperServer@160] - Created server with tickTime 3000 minSessionTimeout 6000 maxSessionTimeout 60000 datadir /zonestorage/hudson_solaris/home/hudson/hudson-slave/workspace/ZooKeeper-trunk-solaris/build/test/tmp/test2323635937556005077.junit.dir/version-2 snapdir /zonestorage/hudson_solaris/home/hudson/hudson-slave/workspace/ZooKeeper-trunk-solaris/build/test/tmp/test2323635937556005077.junit.dir/version-2
[junit] 2017-02-25 08:26:26,383 [myid:] - INFO [main:FileSnap@83] - Reading snapshot /zonestorage/hudson_solaris/home/hudson/hudson-slave/workspace/ZooKeeper-trunk-solaris/build/test/tmp/test2323635937556005077.junit.dir/version-2/snapshot.b
[junit] 2017-02-25 08:26:26,385 [myid:] - INFO [main:FileTxnSnapLog@346] - Snapshotting: 0xb to /zonestorage/hudson_solaris/home/hudson/hudson-slave/workspace/ZooKeeper-trunk-solaris/build/test/tmp/test2323635937556005077.junit.dir/version-2/snapshot.b
[junit] 2017-02-25 08:26:26,386 [myid:] - ERROR [main:ZooKeeperServer@506] - ZKShutdownHandler is not registered, so ZooKeeper server won't take any action on ERROR or SHUTDOWN server state changes
[junit] 2017-02-25 08:26:26,386 [myid:] - INFO [main:FourLetterWordMain@85] - connecting to 127.0.0.1 11222
[junit] 2017-02-25 08:26:26,387 [myid:] - INFO [NIOServerCxnFactory.AcceptThread:0.0.0.0/0.0.0.0:11222:NIOServerCnxnFactory$AcceptThread@296] - Accepted socket connection from /127.0.0.1:42161
[junit] 2017-02-25 08:26:26,387 [myid:] - INFO [NIOWorkerThread-1:NIOServerCnxn@485] - Processing stat command from /127.0.0.1:42161
[junit] 2017-02-25 08:26:26,388 [myid:] - INFO [NIOWorkerThread-1:StatCommand@49] - Stat command output
[junit] 2017-02-25 08:26:26,388 [myid:] - INFO [NIOWorkerThread-1:NIOServerCnxn@614] - Closed socket connection for client /127.0.0.1:42161 (no session established for client)
[junit] 2017-02-25 08:26:26,388 [myid:] - INFO [main:JMXEnv@228] - ensureParent:[InMemoryDataTree, StandaloneServer_port]
[junit] 2017-02-25 08:26:26,389 [myid:] - INFO [main:JMXEnv@245] - expect:InMemoryDataTree
[junit] 2017-02-25 08:26:26,390 [myid:] - INFO [main:JMXEnv@249] - found:InMemoryDataTree org.apache.ZooKeeperService:name0=StandaloneServer_port11222,name1=InMemoryDataTree
[junit] 2017-02-25 08:26:26,390 [myid:] - INFO [main:JMXEnv@245] - expect:StandaloneServer_port
[junit] 2017-02-25 08:26:26,390 [myid:] - INFO [main:JMXEnv@249] - found:StandaloneServer_port org.apache.ZooKeeperService:name0=StandaloneServer_port11222
[junit] 2017-02-25 08:26:26,390 [myid:] - INFO [main:JUnit4ZKTestRunner$LoggedInvokeMethod@82] - Memory used 17906
[junit] 2017-02-25 08:26:26,390 [myid:] - INFO [main:JUnit4ZKTestRunner$LoggedInvokeMethod@87] - Number of threads 24
[junit] 2017-02-25 08:26:26,391 [myid:] - INFO [main:JUnit4ZKTestRunner$LoggedInvokeMethod@102] - FINISHED TEST METHOD testQuota
[junit] 2017-02-25 08:26:26,391 [myid:] - INFO [main:ClientBase@558] - tearDown starting
[junit] 2017-02-25 08:26:26,472 [myid:] - INFO [main-EventThread:ClientCnxn$EventThread@513] - EventThread shut down for session: 0x126f15998100000
[junit] 2017-02-25 08:26:26,472 [myid:] - INFO [main:ZooKeeper@1324] - Session: 0x126f15998100000 closed
[junit] 2017-02-25 08:26:26,473 [myid:] - INFO [main:ClientBase@528] - STOPPING server
[junit] 2017-02-25 08:26:26,473 [myid:] - INFO [ConnnectionExpirer:NIOServerCnxnFactory$ConnectionExpirerThread@583] - ConnnectionExpirerThread interrupted
[junit] 2017-02-25 08:26:26,473 [myid:] - INFO [NIOServerCxnFactory.SelectorThread-0:NIOServerCnxnFactory$SelectorThread@420] - selector thread exitted run method
[junit] 2017-02-25 08:26:26,473 [myid:] - INFO [NIOServerCxnFactory.AcceptThread:0.0.0.0/0.0.0.0:11222:NIOServerCnxnFactory$AcceptThread@219] - accept thread exitted run method
[junit] 2017-02-25 08:26:26,473 [myid:] - INFO [NIOServerCxnFactory.SelectorThread-1:NIOServerCnxnFactory$SelectorThread@420] - selector thread exitted run method
[junit] 2017-02-25 08:26:26,473 [myid:] - INFO [main:ZooKeeperServer@542] - shutting down
[junit] 2017-02-25 08:26:26,474 [myid:] - ERROR [main:ZooKeeperServer@506] - ZKShutdownHandler is not registered, so ZooKeeper server won't take any action on ERROR or SHUTDOWN server state changes
[junit] 2017-02-25 08:26:26,474 [myid:] - INFO [main:SessionTrackerImpl@232] - Shutting down
[junit] 2017-02-25 08:26:26,474 [myid:] - INFO [main:PrepRequestProcessor@1008] - Shutting down
[junit] 2017-02-25 08:26:26,474 [myid:] - INFO [main:SyncRequestProcessor@191] - Shutting down
[junit] 2017-02-25 08:26:26,474 [myid:] - INFO [ProcessThread(sid:0 cport:11222)::PrepRequestProcessor@157] - PrepRequestProcessor exited loop!
[junit] 2017-02-25 08:26:26,474 [myid:] - INFO [SyncThread:0:SyncRequestProcessor@169] - SyncRequestProcessor exited!
[junit] 2017-02-25 08:26:26,475 [myid:] - INFO [main:FinalRequestProcessor@481] - shutdown of request processor complete
[junit] 2017-02-25 08:26:26,475 [myid:] - INFO [main:MBeanRegistry@128] - Unregister MBean [org.apache.ZooKeeperService:name0=StandaloneServer_port11222,name1=InMemoryDataTree]
[junit] 2017-02-25 08:26:26,475 [myid:] - INFO [main:MBeanRegistry@128] - Unregister MBean [org.apache.ZooKeeperService:name0=StandaloneServer_port11222]
[junit] 2017-02-25 08:26:26,475 [myid:] - INFO [main:FourLetterWordMain@85] - connecting to 127.0.0.1 11222
[junit] 2017-02-25 08:26:26,476 [myid:] - INFO [main:JMXEnv@146] - ensureOnly:[]
[junit] 2017-02-25 08:26:26,480 [myid:] - INFO [main:ClientBase@583] - fdcount after test is: 60 at start it was 43
[junit] 2017-02-25 08:26:26,480 [myid:] - INFO [main:ClientBase@585] - sleeping for 20 secs
[junit] 2017-02-25 08:26:26,482 [myid:] - INFO [main:ZKTestCase$1@65] - SUCCEEDED testQuota
[junit] 2017-02-25 08:26:26,482 [myid:] - INFO [main:ZKTestCase$1@60] - FINISHED testQuota
[junit] Tests run: 1, Failures: 0, Errors: 0, Time elapsed: 0.937 sec
fail.build.on.test.failure:
BUILD FAILED
/zonestorage/hudson_solaris/home/hudson/hudson-slave/workspace/ZooKeeper-trunk-solaris/build.xml:1242: The following error occurred while executing this line:
/zonestorage/hudson_solaris/home/hudson/hudson-slave/workspace/ZooKeeper-trunk-solaris/build.xml:1216: Tests failed!
Total time: 68 minutes 51 seconds
Build step 'Invoke Ant' marked build as failure
[locks-and-latches] Releasing all the locks
[locks-and-latches] All the locks released
Recording test results
Email was triggered for: Failure - Any
Sending email for trigger: Failure - Any
###################################################################################
############################## FAILED TESTS (if any) ##############################
2 tests failed.
FAILED: org.apache.zookeeper.test.ReconfigTest.testPortChangeToBlockedPortLeader
Error Message:
client could not connect to reestablished quorum: giving up after 30+ seconds.
Stack Trace:
junit.framework.AssertionFailedError: client could not connect to reestablished quorum: giving up after 30+ seconds.
at org.apache.zookeeper.test.ReconfigTest.testNormalOperation(ReconfigTest.java:183)
at org.apache.zookeeper.test.ReconfigTest.testPortChangeToBlockedPort(ReconfigTest.java:796)
at org.apache.zookeeper.test.ReconfigTest.testPortChangeToBlockedPortLeader(ReconfigTest.java:719)
at org.apache.zookeeper.JUnit4ZKTestRunner$LoggedInvokeMethod.evaluate(JUnit4ZKTestRunner.java:79)
FAILED: org.apache.zookeeper.test.ReconfigTest.testPortChangeToBlockedPortFollower
Error Message:
client could not connect to reestablished quorum: giving up after 30+ seconds.
Stack Trace:
junit.framework.AssertionFailedError: client could not connect to reestablished quorum: giving up after 30+ seconds.
at org.apache.zookeeper.test.ReconfigTest.testNormalOperation(ReconfigTest.java:183)
at org.apache.zookeeper.test.ReconfigTest.testPortChangeToBlockedPort(ReconfigTest.java:796)
at org.apache.zookeeper.test.ReconfigTest.testPortChangeToBlockedPortFollower(ReconfigTest.java:715)
at org.apache.zookeeper.JUnit4ZKTestRunner$LoggedInvokeMethod.evaluate(JUnit4ZKTestRunner.java:79)
ZooKeeper-trunk-solaris - Build # 1518 - Still Failing
Posted by Apache Jenkins Server <je...@builds.apache.org>.
See https://builds.apache.org/job/ZooKeeper-trunk-solaris/1518/
###################################################################################
########################## LAST 60 LINES OF THE CONSOLE ###########################
[...truncated 60.62 MB...]
[junit] 2017-02-24 08:47:35,268 [myid:] - INFO [main:ClientBase@376] - STARTING server instance 127.0.0.1:11222
[junit] 2017-02-24 08:47:35,268 [myid:] - INFO [main:ZooKeeperServer@908] - minSessionTimeout set to 6000
[junit] 2017-02-24 08:47:35,268 [myid:] - INFO [main:ZooKeeperServer@917] - maxSessionTimeout set to 60000
[junit] 2017-02-24 08:47:35,268 [myid:] - INFO [main:ZooKeeperServer@160] - Created server with tickTime 3000 minSessionTimeout 6000 maxSessionTimeout 60000 datadir /zonestorage/hudson_solaris/home/hudson/hudson-slave/workspace/ZooKeeper-trunk-solaris/build/test/tmp/test6433130690732192384.junit.dir/version-2 snapdir /zonestorage/hudson_solaris/home/hudson/hudson-slave/workspace/ZooKeeper-trunk-solaris/build/test/tmp/test6433130690732192384.junit.dir/version-2
[junit] 2017-02-24 08:47:35,269 [myid:] - INFO [main:FileSnap@83] - Reading snapshot /zonestorage/hudson_solaris/home/hudson/hudson-slave/workspace/ZooKeeper-trunk-solaris/build/test/tmp/test6433130690732192384.junit.dir/version-2/snapshot.b
[junit] 2017-02-24 08:47:35,271 [myid:] - INFO [main:FileTxnSnapLog@346] - Snapshotting: 0xb to /zonestorage/hudson_solaris/home/hudson/hudson-slave/workspace/ZooKeeper-trunk-solaris/build/test/tmp/test6433130690732192384.junit.dir/version-2/snapshot.b
[junit] 2017-02-24 08:47:35,272 [myid:] - ERROR [main:ZooKeeperServer@506] - ZKShutdownHandler is not registered, so ZooKeeper server won't take any action on ERROR or SHUTDOWN server state changes
[junit] 2017-02-24 08:47:35,273 [myid:] - INFO [main:FourLetterWordMain@85] - connecting to 127.0.0.1 11222
[junit] 2017-02-24 08:47:35,273 [myid:] - INFO [NIOServerCxnFactory.AcceptThread:0.0.0.0/0.0.0.0:11222:NIOServerCnxnFactory$AcceptThread@296] - Accepted socket connection from /127.0.0.1:59813
[junit] 2017-02-24 08:47:35,273 [myid:] - INFO [NIOWorkerThread-1:NIOServerCnxn@485] - Processing stat command from /127.0.0.1:59813
[junit] 2017-02-24 08:47:35,274 [myid:] - INFO [NIOWorkerThread-1:StatCommand@49] - Stat command output
[junit] 2017-02-24 08:47:35,274 [myid:] - INFO [NIOWorkerThread-1:NIOServerCnxn@614] - Closed socket connection for client /127.0.0.1:59813 (no session established for client)
[junit] 2017-02-24 08:47:35,274 [myid:] - INFO [main:JMXEnv@228] - ensureParent:[InMemoryDataTree, StandaloneServer_port]
[junit] 2017-02-24 08:47:35,276 [myid:] - INFO [main:JMXEnv@245] - expect:InMemoryDataTree
[junit] 2017-02-24 08:47:35,276 [myid:] - INFO [main:JMXEnv@249] - found:InMemoryDataTree org.apache.ZooKeeperService:name0=StandaloneServer_port11222,name1=InMemoryDataTree
[junit] 2017-02-24 08:47:35,276 [myid:] - INFO [main:JMXEnv@245] - expect:StandaloneServer_port
[junit] 2017-02-24 08:47:35,276 [myid:] - INFO [main:JMXEnv@249] - found:StandaloneServer_port org.apache.ZooKeeperService:name0=StandaloneServer_port11222
[junit] 2017-02-24 08:47:35,276 [myid:] - INFO [main:JUnit4ZKTestRunner$LoggedInvokeMethod@82] - Memory used 18142
[junit] 2017-02-24 08:47:35,277 [myid:] - INFO [main:JUnit4ZKTestRunner$LoggedInvokeMethod@87] - Number of threads 24
[junit] 2017-02-24 08:47:35,277 [myid:] - INFO [main:JUnit4ZKTestRunner$LoggedInvokeMethod@102] - FINISHED TEST METHOD testQuota
[junit] 2017-02-24 08:47:35,277 [myid:] - INFO [main:ClientBase@558] - tearDown starting
[junit] 2017-02-24 08:47:35,352 [myid:] - INFO [main:ZooKeeper@1324] - Session: 0x126ec469fbb0000 closed
[junit] 2017-02-24 08:47:35,352 [myid:] - INFO [main-EventThread:ClientCnxn$EventThread@513] - EventThread shut down for session: 0x126ec469fbb0000
[junit] 2017-02-24 08:47:35,352 [myid:] - INFO [main:ClientBase@528] - STOPPING server
[junit] 2017-02-24 08:47:35,353 [myid:] - INFO [NIOServerCxnFactory.AcceptThread:0.0.0.0/0.0.0.0:11222:NIOServerCnxnFactory$AcceptThread@219] - accept thread exitted run method
[junit] 2017-02-24 08:47:35,353 [myid:] - INFO [ConnnectionExpirer:NIOServerCnxnFactory$ConnectionExpirerThread@583] - ConnnectionExpirerThread interrupted
[junit] 2017-02-24 08:47:35,353 [myid:] - INFO [NIOServerCxnFactory.SelectorThread-1:NIOServerCnxnFactory$SelectorThread@420] - selector thread exitted run method
[junit] 2017-02-24 08:47:35,353 [myid:] - INFO [NIOServerCxnFactory.SelectorThread-0:NIOServerCnxnFactory$SelectorThread@420] - selector thread exitted run method
[junit] 2017-02-24 08:47:35,353 [myid:] - INFO [main:ZooKeeperServer@542] - shutting down
[junit] 2017-02-24 08:47:35,353 [myid:] - ERROR [main:ZooKeeperServer@506] - ZKShutdownHandler is not registered, so ZooKeeper server won't take any action on ERROR or SHUTDOWN server state changes
[junit] 2017-02-24 08:47:35,354 [myid:] - INFO [main:SessionTrackerImpl@232] - Shutting down
[junit] 2017-02-24 08:47:35,354 [myid:] - INFO [main:PrepRequestProcessor@1008] - Shutting down
[junit] 2017-02-24 08:47:35,354 [myid:] - INFO [main:SyncRequestProcessor@191] - Shutting down
[junit] 2017-02-24 08:47:35,354 [myid:] - INFO [ProcessThread(sid:0 cport:11222)::PrepRequestProcessor@157] - PrepRequestProcessor exited loop!
[junit] 2017-02-24 08:47:35,354 [myid:] - INFO [SyncThread:0:SyncRequestProcessor@169] - SyncRequestProcessor exited!
[junit] 2017-02-24 08:47:35,354 [myid:] - INFO [main:FinalRequestProcessor@481] - shutdown of request processor complete
[junit] 2017-02-24 08:47:35,355 [myid:] - INFO [main:MBeanRegistry@128] - Unregister MBean [org.apache.ZooKeeperService:name0=StandaloneServer_port11222,name1=InMemoryDataTree]
[junit] 2017-02-24 08:47:35,355 [myid:] - INFO [main:MBeanRegistry@128] - Unregister MBean [org.apache.ZooKeeperService:name0=StandaloneServer_port11222]
[junit] 2017-02-24 08:47:35,355 [myid:] - INFO [main:FourLetterWordMain@85] - connecting to 127.0.0.1 11222
[junit] 2017-02-24 08:47:35,355 [myid:] - INFO [main:JMXEnv@146] - ensureOnly:[]
[junit] 2017-02-24 08:47:35,360 [myid:] - INFO [main:ClientBase@583] - fdcount after test is: 60 at start it was 43
[junit] 2017-02-24 08:47:35,360 [myid:] - INFO [main:ClientBase@585] - sleeping for 20 secs
[junit] 2017-02-24 08:47:35,361 [myid:] - INFO [main:ZKTestCase$1@65] - SUCCEEDED testQuota
[junit] 2017-02-24 08:47:35,362 [myid:] - INFO [main:ZKTestCase$1@60] - FINISHED testQuota
[junit] Tests run: 1, Failures: 0, Errors: 0, Time elapsed: 1.996 sec
fail.build.on.test.failure:
BUILD FAILED
/zonestorage/hudson_solaris/home/hudson/hudson-slave/workspace/ZooKeeper-trunk-solaris/build.xml:1242: The following error occurred while executing this line:
/zonestorage/hudson_solaris/home/hudson/hudson-slave/workspace/ZooKeeper-trunk-solaris/build.xml:1216: Tests failed!
Total time: 90 minutes 10 seconds
Build step 'Invoke Ant' marked build as failure
[locks-and-latches] Releasing all the locks
[locks-and-latches] All the locks released
Recording test results
Email was triggered for: Failure - Any
Sending email for trigger: Failure - Any
###################################################################################
############################## FAILED TESTS (if any) ##############################
5 tests failed.
FAILED: org.apache.zookeeper.test.NioNettySuiteTest.testJMXBeanAfterRoleChange
Error Message:
Timeout occurred. Please note the time in the report does not reflect the time until the timeout.
Stack Trace:
junit.framework.AssertionFailedError: Timeout occurred. Please note the time in the report does not reflect the time until the timeout.
FAILED: org.apache.zookeeper.test.WatchEventWhenAutoResetTest.testNodeDataChanged
Error Message:
expected:<NodeDataChanged> but was:<NodeDeleted>
Stack Trace:
junit.framework.AssertionFailedError: expected:<NodeDataChanged> but was:<NodeDeleted>
at org.apache.zookeeper.test.WatchEventWhenAutoResetTest$EventsWatcher.assertEvent(WatchEventWhenAutoResetTest.java:67)
at org.apache.zookeeper.test.WatchEventWhenAutoResetTest.testNodeDataChanged(WatchEventWhenAutoResetTest.java:126)
at org.apache.zookeeper.JUnit4ZKTestRunner$LoggedInvokeMethod.evaluate(JUnit4ZKTestRunner.java:79)
FAILED: org.apache.zookeeper.server.quorum.Zab1_0Test.testNormalObserverRun
Error Message:
Timeout occurred. Please note the time in the report does not reflect the time until the timeout.
Stack Trace:
junit.framework.AssertionFailedError: Timeout occurred. Please note the time in the report does not reflect the time until the timeout.
FAILED: org.apache.zookeeper.test.ReconfigTest.testPortChangeToBlockedPortLeader
Error Message:
client could not connect to reestablished quorum: giving up after 30+ seconds.
Stack Trace:
junit.framework.AssertionFailedError: client could not connect to reestablished quorum: giving up after 30+ seconds.
at org.apache.zookeeper.test.ReconfigTest.testNormalOperation(ReconfigTest.java:183)
at org.apache.zookeeper.test.ReconfigTest.testPortChangeToBlockedPort(ReconfigTest.java:796)
at org.apache.zookeeper.test.ReconfigTest.testPortChangeToBlockedPortLeader(ReconfigTest.java:719)
at org.apache.zookeeper.JUnit4ZKTestRunner$LoggedInvokeMethod.evaluate(JUnit4ZKTestRunner.java:79)
FAILED: org.apache.zookeeper.test.ReconfigTest.testPortChangeToBlockedPortFollower
Error Message:
client could not connect to reestablished quorum: giving up after 30+ seconds.
Stack Trace:
junit.framework.AssertionFailedError: client could not connect to reestablished quorum: giving up after 30+ seconds.
at org.apache.zookeeper.test.ReconfigTest.testNormalOperation(ReconfigTest.java:183)
at org.apache.zookeeper.test.ReconfigTest.testPortChangeToBlockedPort(ReconfigTest.java:796)
at org.apache.zookeeper.test.ReconfigTest.testPortChangeToBlockedPortFollower(ReconfigTest.java:715)
at org.apache.zookeeper.JUnit4ZKTestRunner$LoggedInvokeMethod.evaluate(JUnit4ZKTestRunner.java:79)
ZooKeeper-trunk-solaris - Build # 1517 - Still Failing
Posted by Apache Jenkins Server <je...@builds.apache.org>.
See https://builds.apache.org/job/ZooKeeper-trunk-solaris/1517/
###################################################################################
########################## LAST 60 LINES OF THE CONSOLE ###########################
[...truncated 58.60 MB...]
[junit] 2017-02-23 08:39:05,558 [myid:] - INFO [main:ClientBase@376] - STARTING server instance 127.0.0.1:11222
[junit] 2017-02-23 08:39:05,559 [myid:] - INFO [main:ZooKeeperServer@908] - minSessionTimeout set to 6000
[junit] 2017-02-23 08:39:05,559 [myid:] - INFO [main:ZooKeeperServer@917] - maxSessionTimeout set to 60000
[junit] 2017-02-23 08:39:05,559 [myid:] - INFO [main:ZooKeeperServer@160] - Created server with tickTime 3000 minSessionTimeout 6000 maxSessionTimeout 60000 datadir /zonestorage/hudson_solaris/home/hudson/hudson-slave/workspace/ZooKeeper-trunk-solaris/build/test/tmp/test6452893461893143809.junit.dir/version-2 snapdir /zonestorage/hudson_solaris/home/hudson/hudson-slave/workspace/ZooKeeper-trunk-solaris/build/test/tmp/test6452893461893143809.junit.dir/version-2
[junit] 2017-02-23 08:39:05,560 [myid:] - INFO [main:FileSnap@83] - Reading snapshot /zonestorage/hudson_solaris/home/hudson/hudson-slave/workspace/ZooKeeper-trunk-solaris/build/test/tmp/test6452893461893143809.junit.dir/version-2/snapshot.b
[junit] 2017-02-23 08:39:05,562 [myid:] - INFO [main:FileTxnSnapLog@346] - Snapshotting: 0xb to /zonestorage/hudson_solaris/home/hudson/hudson-slave/workspace/ZooKeeper-trunk-solaris/build/test/tmp/test6452893461893143809.junit.dir/version-2/snapshot.b
[junit] 2017-02-23 08:39:05,563 [myid:] - ERROR [main:ZooKeeperServer@506] - ZKShutdownHandler is not registered, so ZooKeeper server won't take any action on ERROR or SHUTDOWN server state changes
[junit] 2017-02-23 08:39:05,563 [myid:] - INFO [main:FourLetterWordMain@85] - connecting to 127.0.0.1 11222
[junit] 2017-02-23 08:39:05,564 [myid:] - INFO [NIOServerCxnFactory.AcceptThread:0.0.0.0/0.0.0.0:11222:NIOServerCnxnFactory$AcceptThread@296] - Accepted socket connection from /127.0.0.1:44975
[junit] 2017-02-23 08:39:05,564 [myid:] - INFO [NIOWorkerThread-1:NIOServerCnxn@485] - Processing stat command from /127.0.0.1:44975
[junit] 2017-02-23 08:39:05,565 [myid:] - INFO [NIOWorkerThread-1:StatCommand@49] - Stat command output
[junit] 2017-02-23 08:39:05,565 [myid:] - INFO [NIOWorkerThread-1:NIOServerCnxn@614] - Closed socket connection for client /127.0.0.1:44975 (no session established for client)
[junit] 2017-02-23 08:39:05,565 [myid:] - INFO [main:JMXEnv@228] - ensureParent:[InMemoryDataTree, StandaloneServer_port]
[junit] 2017-02-23 08:39:05,566 [myid:] - INFO [main:JMXEnv@245] - expect:InMemoryDataTree
[junit] 2017-02-23 08:39:05,566 [myid:] - INFO [main:JMXEnv@249] - found:InMemoryDataTree org.apache.ZooKeeperService:name0=StandaloneServer_port11222,name1=InMemoryDataTree
[junit] 2017-02-23 08:39:05,567 [myid:] - INFO [main:JMXEnv@245] - expect:StandaloneServer_port
[junit] 2017-02-23 08:39:05,567 [myid:] - INFO [main:JMXEnv@249] - found:StandaloneServer_port org.apache.ZooKeeperService:name0=StandaloneServer_port11222
[junit] 2017-02-23 08:39:05,567 [myid:] - INFO [main:JUnit4ZKTestRunner$LoggedInvokeMethod@82] - Memory used 17905
[junit] 2017-02-23 08:39:05,567 [myid:] - INFO [main:JUnit4ZKTestRunner$LoggedInvokeMethod@87] - Number of threads 24
[junit] 2017-02-23 08:39:05,567 [myid:] - INFO [main:JUnit4ZKTestRunner$LoggedInvokeMethod@102] - FINISHED TEST METHOD testQuota
[junit] 2017-02-23 08:39:05,567 [myid:] - INFO [main:ClientBase@558] - tearDown starting
[junit] 2017-02-23 08:39:05,642 [myid:] - INFO [main:ZooKeeper@1324] - Session: 0x126e7187d520000 closed
[junit] 2017-02-23 08:39:05,642 [myid:] - INFO [main-EventThread:ClientCnxn$EventThread@513] - EventThread shut down for session: 0x126e7187d520000
[junit] 2017-02-23 08:39:05,642 [myid:] - INFO [main:ClientBase@528] - STOPPING server
[junit] 2017-02-23 08:39:05,643 [myid:] - INFO [ConnnectionExpirer:NIOServerCnxnFactory$ConnectionExpirerThread@583] - ConnnectionExpirerThread interrupted
[junit] 2017-02-23 08:39:05,643 [myid:] - INFO [NIOServerCxnFactory.SelectorThread-0:NIOServerCnxnFactory$SelectorThread@420] - selector thread exitted run method
[junit] 2017-02-23 08:39:05,643 [myid:] - INFO [NIOServerCxnFactory.SelectorThread-1:NIOServerCnxnFactory$SelectorThread@420] - selector thread exitted run method
[junit] 2017-02-23 08:39:05,643 [myid:] - INFO [NIOServerCxnFactory.AcceptThread:0.0.0.0/0.0.0.0:11222:NIOServerCnxnFactory$AcceptThread@219] - accept thread exitted run method
[junit] 2017-02-23 08:39:05,643 [myid:] - INFO [main:ZooKeeperServer@542] - shutting down
[junit] 2017-02-23 08:39:05,643 [myid:] - ERROR [main:ZooKeeperServer@506] - ZKShutdownHandler is not registered, so ZooKeeper server won't take any action on ERROR or SHUTDOWN server state changes
[junit] 2017-02-23 08:39:05,644 [myid:] - INFO [main:SessionTrackerImpl@232] - Shutting down
[junit] 2017-02-23 08:39:05,644 [myid:] - INFO [main:PrepRequestProcessor@1008] - Shutting down
[junit] 2017-02-23 08:39:05,644 [myid:] - INFO [main:SyncRequestProcessor@191] - Shutting down
[junit] 2017-02-23 08:39:05,644 [myid:] - INFO [ProcessThread(sid:0 cport:11222)::PrepRequestProcessor@157] - PrepRequestProcessor exited loop!
[junit] 2017-02-23 08:39:05,644 [myid:] - INFO [SyncThread:0:SyncRequestProcessor@169] - SyncRequestProcessor exited!
[junit] 2017-02-23 08:39:05,644 [myid:] - INFO [main:FinalRequestProcessor@481] - shutdown of request processor complete
[junit] 2017-02-23 08:39:05,644 [myid:] - INFO [main:MBeanRegistry@128] - Unregister MBean [org.apache.ZooKeeperService:name0=StandaloneServer_port11222,name1=InMemoryDataTree]
[junit] 2017-02-23 08:39:05,645 [myid:] - INFO [main:MBeanRegistry@128] - Unregister MBean [org.apache.ZooKeeperService:name0=StandaloneServer_port11222]
[junit] 2017-02-23 08:39:05,645 [myid:] - INFO [main:FourLetterWordMain@85] - connecting to 127.0.0.1 11222
[junit] 2017-02-23 08:39:05,645 [myid:] - INFO [main:JMXEnv@146] - ensureOnly:[]
[junit] 2017-02-23 08:39:05,659 [myid:] - INFO [main:ClientBase@583] - fdcount after test is: 60 at start it was 43
[junit] 2017-02-23 08:39:05,659 [myid:] - INFO [main:ClientBase@585] - sleeping for 20 secs
[junit] 2017-02-23 08:39:05,661 [myid:] - INFO [main:ZKTestCase$1@65] - SUCCEEDED testQuota
[junit] 2017-02-23 08:39:05,661 [myid:] - INFO [main:ZKTestCase$1@60] - FINISHED testQuota
[junit] Tests run: 1, Failures: 0, Errors: 0, Time elapsed: 0.832 sec
fail.build.on.test.failure:
BUILD FAILED
/zonestorage/hudson_solaris/home/hudson/hudson-slave/workspace/ZooKeeper-trunk-solaris/build.xml:1242: The following error occurred while executing this line:
/zonestorage/hudson_solaris/home/hudson/hudson-slave/workspace/ZooKeeper-trunk-solaris/build.xml:1216: Tests failed!
Total time: 82 minutes 36 seconds
Build step 'Invoke Ant' marked build as failure
[locks-and-latches] Releasing all the locks
[locks-and-latches] All the locks released
Recording test results
Email was triggered for: Failure - Any
Sending email for trigger: Failure - Any
###################################################################################
############################## FAILED TESTS (if any) ##############################
3 tests failed.
FAILED: org.apache.zookeeper.server.quorum.Zab1_0Test.testNormalObserverRun
Error Message:
Timeout occurred. Please note the time in the report does not reflect the time until the timeout.
Stack Trace:
junit.framework.AssertionFailedError: Timeout occurred. Please note the time in the report does not reflect the time until the timeout.
FAILED: org.apache.zookeeper.test.ReconfigTest.testPortChangeToBlockedPortLeader
Error Message:
client could not connect to reestablished quorum: giving up after 30+ seconds.
Stack Trace:
junit.framework.AssertionFailedError: client could not connect to reestablished quorum: giving up after 30+ seconds.
at org.apache.zookeeper.test.ReconfigTest.testNormalOperation(ReconfigTest.java:183)
at org.apache.zookeeper.test.ReconfigTest.testPortChangeToBlockedPort(ReconfigTest.java:796)
at org.apache.zookeeper.test.ReconfigTest.testPortChangeToBlockedPortLeader(ReconfigTest.java:719)
at org.apache.zookeeper.JUnit4ZKTestRunner$LoggedInvokeMethod.evaluate(JUnit4ZKTestRunner.java:79)
FAILED: org.apache.zookeeper.test.ReconfigTest.testPortChangeToBlockedPortFollower
Error Message:
client could not connect to reestablished quorum: giving up after 30+ seconds.
Stack Trace:
junit.framework.AssertionFailedError: client could not connect to reestablished quorum: giving up after 30+ seconds.
at org.apache.zookeeper.test.ReconfigTest.testNormalOperation(ReconfigTest.java:183)
at org.apache.zookeeper.test.ReconfigTest.testPortChangeToBlockedPort(ReconfigTest.java:796)
at org.apache.zookeeper.test.ReconfigTest.testPortChangeToBlockedPortFollower(ReconfigTest.java:715)
at org.apache.zookeeper.JUnit4ZKTestRunner$LoggedInvokeMethod.evaluate(JUnit4ZKTestRunner.java:79)
ZooKeeper-trunk-solaris - Build # 1516 - Still Failing
Posted by Apache Jenkins Server <je...@builds.apache.org>.
See https://builds.apache.org/job/ZooKeeper-trunk-solaris/1516/
###################################################################################
########################## LAST 60 LINES OF THE CONSOLE ###########################
[...truncated 58.63 MB...]
[junit] 2017-02-22 08:23:10,328 [myid:] - INFO [main:ClientBase@376] - STARTING server instance 127.0.0.1:11222
[junit] 2017-02-22 08:23:10,328 [myid:] - INFO [main:ZooKeeperServer@908] - minSessionTimeout set to 6000
[junit] 2017-02-22 08:23:10,329 [myid:] - INFO [main:ZooKeeperServer@917] - maxSessionTimeout set to 60000
[junit] 2017-02-22 08:23:10,329 [myid:] - INFO [main:ZooKeeperServer@160] - Created server with tickTime 3000 minSessionTimeout 6000 maxSessionTimeout 60000 datadir /zonestorage/hudson_solaris/home/hudson/hudson-slave/workspace/ZooKeeper-trunk-solaris/build/test/tmp/test8864537983339373962.junit.dir/version-2 snapdir /zonestorage/hudson_solaris/home/hudson/hudson-slave/workspace/ZooKeeper-trunk-solaris/build/test/tmp/test8864537983339373962.junit.dir/version-2
[junit] 2017-02-22 08:23:10,329 [myid:] - INFO [main:FileSnap@83] - Reading snapshot /zonestorage/hudson_solaris/home/hudson/hudson-slave/workspace/ZooKeeper-trunk-solaris/build/test/tmp/test8864537983339373962.junit.dir/version-2/snapshot.b
[junit] 2017-02-22 08:23:10,332 [myid:] - INFO [main:FileTxnSnapLog@346] - Snapshotting: 0xb to /zonestorage/hudson_solaris/home/hudson/hudson-slave/workspace/ZooKeeper-trunk-solaris/build/test/tmp/test8864537983339373962.junit.dir/version-2/snapshot.b
[junit] 2017-02-22 08:23:10,333 [myid:] - ERROR [main:ZooKeeperServer@506] - ZKShutdownHandler is not registered, so ZooKeeper server won't take any action on ERROR or SHUTDOWN server state changes
[junit] 2017-02-22 08:23:10,333 [myid:] - INFO [main:FourLetterWordMain@85] - connecting to 127.0.0.1 11222
[junit] 2017-02-22 08:23:10,333 [myid:] - INFO [NIOServerCxnFactory.AcceptThread:0.0.0.0/0.0.0.0:11222:NIOServerCnxnFactory$AcceptThread@296] - Accepted socket connection from /127.0.0.1:63787
[junit] 2017-02-22 08:23:10,334 [myid:] - INFO [NIOWorkerThread-1:NIOServerCnxn@485] - Processing stat command from /127.0.0.1:63787
[junit] 2017-02-22 08:23:10,334 [myid:] - INFO [NIOWorkerThread-1:StatCommand@49] - Stat command output
[junit] 2017-02-22 08:23:10,335 [myid:] - INFO [NIOWorkerThread-1:NIOServerCnxn@614] - Closed socket connection for client /127.0.0.1:63787 (no session established for client)
[junit] 2017-02-22 08:23:10,335 [myid:] - INFO [main:JMXEnv@228] - ensureParent:[InMemoryDataTree, StandaloneServer_port]
[junit] 2017-02-22 08:23:10,336 [myid:] - INFO [main:JMXEnv@245] - expect:InMemoryDataTree
[junit] 2017-02-22 08:23:10,337 [myid:] - INFO [main:JMXEnv@249] - found:InMemoryDataTree org.apache.ZooKeeperService:name0=StandaloneServer_port11222,name1=InMemoryDataTree
[junit] 2017-02-22 08:23:10,337 [myid:] - INFO [main:JMXEnv@245] - expect:StandaloneServer_port
[junit] 2017-02-22 08:23:10,337 [myid:] - INFO [main:JMXEnv@249] - found:StandaloneServer_port org.apache.ZooKeeperService:name0=StandaloneServer_port11222
[junit] 2017-02-22 08:23:10,337 [myid:] - INFO [main:JUnit4ZKTestRunner$LoggedInvokeMethod@82] - Memory used 17913
[junit] 2017-02-22 08:23:10,337 [myid:] - INFO [main:JUnit4ZKTestRunner$LoggedInvokeMethod@87] - Number of threads 24
[junit] 2017-02-22 08:23:10,337 [myid:] - INFO [main:JUnit4ZKTestRunner$LoggedInvokeMethod@102] - FINISHED TEST METHOD testQuota
[junit] 2017-02-22 08:23:10,338 [myid:] - INFO [main:ClientBase@558] - tearDown starting
[junit] 2017-02-22 08:23:10,412 [myid:] - INFO [main:ZooKeeper@1324] - Session: 0x126e1e38fa70000 closed
[junit] 2017-02-22 08:23:10,412 [myid:] - INFO [main-EventThread:ClientCnxn$EventThread@513] - EventThread shut down for session: 0x126e1e38fa70000
[junit] 2017-02-22 08:23:10,412 [myid:] - INFO [main:ClientBase@528] - STOPPING server
[junit] 2017-02-22 08:23:10,412 [myid:] - INFO [NIOServerCxnFactory.SelectorThread-0:NIOServerCnxnFactory$SelectorThread@420] - selector thread exitted run method
[junit] 2017-02-22 08:23:10,413 [myid:] - INFO [NIOServerCxnFactory.SelectorThread-1:NIOServerCnxnFactory$SelectorThread@420] - selector thread exitted run method
[junit] 2017-02-22 08:23:10,412 [myid:] - INFO [NIOServerCxnFactory.AcceptThread:0.0.0.0/0.0.0.0:11222:NIOServerCnxnFactory$AcceptThread@219] - accept thread exitted run method
[junit] 2017-02-22 08:23:10,412 [myid:] - INFO [ConnnectionExpirer:NIOServerCnxnFactory$ConnectionExpirerThread@583] - ConnnectionExpirerThread interrupted
[junit] 2017-02-22 08:23:10,413 [myid:] - INFO [main:ZooKeeperServer@542] - shutting down
[junit] 2017-02-22 08:23:10,413 [myid:] - ERROR [main:ZooKeeperServer@506] - ZKShutdownHandler is not registered, so ZooKeeper server won't take any action on ERROR or SHUTDOWN server state changes
[junit] 2017-02-22 08:23:10,413 [myid:] - INFO [main:SessionTrackerImpl@232] - Shutting down
[junit] 2017-02-22 08:23:10,414 [myid:] - INFO [main:PrepRequestProcessor@1008] - Shutting down
[junit] 2017-02-22 08:23:10,414 [myid:] - INFO [main:SyncRequestProcessor@191] - Shutting down
[junit] 2017-02-22 08:23:10,414 [myid:] - INFO [ProcessThread(sid:0 cport:11222)::PrepRequestProcessor@157] - PrepRequestProcessor exited loop!
[junit] 2017-02-22 08:23:10,414 [myid:] - INFO [SyncThread:0:SyncRequestProcessor@169] - SyncRequestProcessor exited!
[junit] 2017-02-22 08:23:10,414 [myid:] - INFO [main:FinalRequestProcessor@481] - shutdown of request processor complete
[junit] 2017-02-22 08:23:10,414 [myid:] - INFO [main:MBeanRegistry@128] - Unregister MBean [org.apache.ZooKeeperService:name0=StandaloneServer_port11222,name1=InMemoryDataTree]
[junit] 2017-02-22 08:23:10,415 [myid:] - INFO [main:MBeanRegistry@128] - Unregister MBean [org.apache.ZooKeeperService:name0=StandaloneServer_port11222]
[junit] 2017-02-22 08:23:10,415 [myid:] - INFO [main:FourLetterWordMain@85] - connecting to 127.0.0.1 11222
[junit] 2017-02-22 08:23:10,415 [myid:] - INFO [main:JMXEnv@146] - ensureOnly:[]
[junit] 2017-02-22 08:23:10,420 [myid:] - INFO [main:ClientBase@583] - fdcount after test is: 60 at start it was 43
[junit] 2017-02-22 08:23:10,420 [myid:] - INFO [main:ClientBase@585] - sleeping for 20 secs
[junit] 2017-02-22 08:23:10,421 [myid:] - INFO [main:ZKTestCase$1@65] - SUCCEEDED testQuota
[junit] 2017-02-22 08:23:10,421 [myid:] - INFO [main:ZKTestCase$1@60] - FINISHED testQuota
[junit] Tests run: 1, Failures: 0, Errors: 0, Time elapsed: 2.576 sec
fail.build.on.test.failure:
BUILD FAILED
/zonestorage/hudson_solaris/home/hudson/hudson-slave/workspace/ZooKeeper-trunk-solaris/build.xml:1242: The following error occurred while executing this line:
/zonestorage/hudson_solaris/home/hudson/hudson-slave/workspace/ZooKeeper-trunk-solaris/build.xml:1216: Tests failed!
Total time: 65 minutes 46 seconds
Build step 'Invoke Ant' marked build as failure
[locks-and-latches] Releasing all the locks
[locks-and-latches] All the locks released
Recording test results
Email was triggered for: Failure - Any
Sending email for trigger: Failure - Any
###################################################################################
############################## FAILED TESTS (if any) ##############################
10 tests failed.
FAILED: org.apache.zookeeper.test.WatcherTest.testWatchAutoResetWithPending
Error Message:
Unexpected bean exists! expected:<0> but was:<1>
Stack Trace:
junit.framework.AssertionFailedError: Unexpected bean exists! expected:<0> but was:<1>
at org.apache.zookeeper.test.ClientBase.verifyUnexpectedBeans(ClientBase.java:513)
at org.apache.zookeeper.test.ClientBase.startServer(ClientBase.java:492)
at org.apache.zookeeper.test.ClientBase.setUp(ClientBase.java:475)
at org.apache.zookeeper.test.WatcherTest.setUp(WatcherTest.java:76)
FAILED: org.apache.zookeeper.test.WatcherTest.testWatcherCorrectness
Error Message:
Unexpected bean exists! expected:<0> but was:<1>
Stack Trace:
junit.framework.AssertionFailedError: Unexpected bean exists! expected:<0> but was:<1>
at org.apache.zookeeper.test.ClientBase.verifyUnexpectedBeans(ClientBase.java:513)
at org.apache.zookeeper.test.ClientBase.startServer(ClientBase.java:492)
at org.apache.zookeeper.test.ClientBase.setUp(ClientBase.java:475)
at org.apache.zookeeper.test.WatcherTest.setUp(WatcherTest.java:76)
FAILED: org.apache.zookeeper.test.WatcherTest.testWatcherAutoResetDisabledWithLocal
Error Message:
Unexpected bean exists! expected:<0> but was:<1>
Stack Trace:
junit.framework.AssertionFailedError: Unexpected bean exists! expected:<0> but was:<1>
at org.apache.zookeeper.test.ClientBase.verifyUnexpectedBeans(ClientBase.java:513)
at org.apache.zookeeper.test.ClientBase.startServer(ClientBase.java:492)
at org.apache.zookeeper.test.ClientBase.setUp(ClientBase.java:475)
at org.apache.zookeeper.test.WatcherTest.setUp(WatcherTest.java:76)
FAILED: org.apache.zookeeper.test.WatcherTest.testWatcherAutoResetWithGlobal
Error Message:
Unexpected bean exists! expected:<0> but was:<1>
Stack Trace:
junit.framework.AssertionFailedError: Unexpected bean exists! expected:<0> but was:<1>
at org.apache.zookeeper.test.ClientBase.verifyUnexpectedBeans(ClientBase.java:513)
at org.apache.zookeeper.test.ClientBase.startServer(ClientBase.java:492)
at org.apache.zookeeper.test.ClientBase.setUp(ClientBase.java:475)
at org.apache.zookeeper.test.WatcherTest.setUp(WatcherTest.java:76)
FAILED: org.apache.zookeeper.test.WatcherTest.testWatcherCount
Error Message:
Unexpected bean exists! expected:<0> but was:<1>
Stack Trace:
junit.framework.AssertionFailedError: Unexpected bean exists! expected:<0> but was:<1>
at org.apache.zookeeper.test.ClientBase.verifyUnexpectedBeans(ClientBase.java:513)
at org.apache.zookeeper.test.ClientBase.startServer(ClientBase.java:492)
at org.apache.zookeeper.test.ClientBase.setUp(ClientBase.java:475)
at org.apache.zookeeper.test.WatcherTest.setUp(WatcherTest.java:76)
FAILED: org.apache.zookeeper.test.WatcherTest.testWatcherAutoResetDisabledWithGlobal
Error Message:
Unexpected bean exists! expected:<0> but was:<1>
Stack Trace:
junit.framework.AssertionFailedError: Unexpected bean exists! expected:<0> but was:<1>
at org.apache.zookeeper.test.ClientBase.verifyUnexpectedBeans(ClientBase.java:513)
at org.apache.zookeeper.test.ClientBase.startServer(ClientBase.java:492)
at org.apache.zookeeper.test.ClientBase.setUp(ClientBase.java:475)
at org.apache.zookeeper.test.WatcherTest.setUp(WatcherTest.java:76)
FAILED: org.apache.zookeeper.test.WatcherTest.testWatcherAutoResetWithLocal
Error Message:
Unexpected bean exists! expected:<0> but was:<1>
Stack Trace:
junit.framework.AssertionFailedError: Unexpected bean exists! expected:<0> but was:<1>
at org.apache.zookeeper.test.ClientBase.verifyUnexpectedBeans(ClientBase.java:513)
at org.apache.zookeeper.test.ClientBase.startServer(ClientBase.java:492)
at org.apache.zookeeper.test.ClientBase.setUp(ClientBase.java:475)
at org.apache.zookeeper.test.WatcherTest.setUp(WatcherTest.java:76)
FAILED: org.apache.zookeeper.test.WatchEventWhenAutoResetTest.testNodeDataChanged
Error Message:
expected:<NodeDataChanged> but was:<NodeDeleted>
Stack Trace:
junit.framework.AssertionFailedError: expected:<NodeDataChanged> but was:<NodeDeleted>
at org.apache.zookeeper.test.WatchEventWhenAutoResetTest$EventsWatcher.assertEvent(WatchEventWhenAutoResetTest.java:67)
at org.apache.zookeeper.test.WatchEventWhenAutoResetTest.testNodeDataChanged(WatchEventWhenAutoResetTest.java:117)
at org.apache.zookeeper.JUnit4ZKTestRunner$LoggedInvokeMethod.evaluate(JUnit4ZKTestRunner.java:79)
FAILED: org.apache.zookeeper.test.ReconfigTest.testPortChangeToBlockedPortLeader
Error Message:
client could not connect to reestablished quorum: giving up after 30+ seconds.
Stack Trace:
junit.framework.AssertionFailedError: client could not connect to reestablished quorum: giving up after 30+ seconds.
at org.apache.zookeeper.test.ReconfigTest.testNormalOperation(ReconfigTest.java:183)
at org.apache.zookeeper.test.ReconfigTest.testPortChangeToBlockedPort(ReconfigTest.java:796)
at org.apache.zookeeper.test.ReconfigTest.testPortChangeToBlockedPortLeader(ReconfigTest.java:719)
at org.apache.zookeeper.JUnit4ZKTestRunner$LoggedInvokeMethod.evaluate(JUnit4ZKTestRunner.java:79)
FAILED: org.apache.zookeeper.test.ReconfigTest.testPortChangeToBlockedPortFollower
Error Message:
client could not connect to reestablished quorum: giving up after 30+ seconds.
Stack Trace:
junit.framework.AssertionFailedError: client could not connect to reestablished quorum: giving up after 30+ seconds.
at org.apache.zookeeper.test.ReconfigTest.testNormalOperation(ReconfigTest.java:183)
at org.apache.zookeeper.test.ReconfigTest.testPortChangeToBlockedPort(ReconfigTest.java:796)
at org.apache.zookeeper.test.ReconfigTest.testPortChangeToBlockedPortFollower(ReconfigTest.java:715)
at org.apache.zookeeper.JUnit4ZKTestRunner$LoggedInvokeMethod.evaluate(JUnit4ZKTestRunner.java:79)
ZooKeeper-trunk-solaris - Build # 1515 - Still Failing
Posted by Apache Jenkins Server <je...@builds.apache.org>.
See https://builds.apache.org/job/ZooKeeper-trunk-solaris/1515/
###################################################################################
########################## LAST 60 LINES OF THE CONSOLE ###########################
[...truncated 59.99 MB...]
[junit] 2017-02-21 08:39:59,116 [myid:] - INFO [main:ClientBase@376] - STARTING server instance 127.0.0.1:11222
[junit] 2017-02-21 08:39:59,116 [myid:] - INFO [main:ZooKeeperServer@908] - minSessionTimeout set to 6000
[junit] 2017-02-21 08:39:59,117 [myid:] - INFO [main:ZooKeeperServer@917] - maxSessionTimeout set to 60000
[junit] 2017-02-21 08:39:59,117 [myid:] - INFO [main:ZooKeeperServer@160] - Created server with tickTime 3000 minSessionTimeout 6000 maxSessionTimeout 60000 datadir /zonestorage/hudson_solaris/home/hudson/hudson-slave/workspace/ZooKeeper-trunk-solaris/build/test/tmp/test9097261130983239221.junit.dir/version-2 snapdir /zonestorage/hudson_solaris/home/hudson/hudson-slave/workspace/ZooKeeper-trunk-solaris/build/test/tmp/test9097261130983239221.junit.dir/version-2
[junit] 2017-02-21 08:39:59,117 [myid:] - INFO [main:FileSnap@83] - Reading snapshot /zonestorage/hudson_solaris/home/hudson/hudson-slave/workspace/ZooKeeper-trunk-solaris/build/test/tmp/test9097261130983239221.junit.dir/version-2/snapshot.b
[junit] 2017-02-21 08:39:59,120 [myid:] - INFO [main:FileTxnSnapLog@346] - Snapshotting: 0xb to /zonestorage/hudson_solaris/home/hudson/hudson-slave/workspace/ZooKeeper-trunk-solaris/build/test/tmp/test9097261130983239221.junit.dir/version-2/snapshot.b
[junit] 2017-02-21 08:39:59,121 [myid:] - ERROR [main:ZooKeeperServer@506] - ZKShutdownHandler is not registered, so ZooKeeper server won't take any action on ERROR or SHUTDOWN server state changes
[junit] 2017-02-21 08:39:59,121 [myid:] - INFO [main:FourLetterWordMain@85] - connecting to 127.0.0.1 11222
[junit] 2017-02-21 08:39:59,122 [myid:] - INFO [NIOServerCxnFactory.AcceptThread:0.0.0.0/0.0.0.0:11222:NIOServerCnxnFactory$AcceptThread@296] - Accepted socket connection from /127.0.0.1:49505
[junit] 2017-02-21 08:39:59,122 [myid:] - INFO [NIOWorkerThread-1:NIOServerCnxn@485] - Processing stat command from /127.0.0.1:49505
[junit] 2017-02-21 08:39:59,122 [myid:] - INFO [NIOWorkerThread-1:StatCommand@49] - Stat command output
[junit] 2017-02-21 08:39:59,123 [myid:] - INFO [NIOWorkerThread-1:NIOServerCnxn@614] - Closed socket connection for client /127.0.0.1:49505 (no session established for client)
[junit] 2017-02-21 08:39:59,123 [myid:] - INFO [main:JMXEnv@228] - ensureParent:[InMemoryDataTree, StandaloneServer_port]
[junit] 2017-02-21 08:39:59,124 [myid:] - INFO [main:JMXEnv@245] - expect:InMemoryDataTree
[junit] 2017-02-21 08:39:59,124 [myid:] - INFO [main:JMXEnv@249] - found:InMemoryDataTree org.apache.ZooKeeperService:name0=StandaloneServer_port11222,name1=InMemoryDataTree
[junit] 2017-02-21 08:39:59,125 [myid:] - INFO [main:JMXEnv@245] - expect:StandaloneServer_port
[junit] 2017-02-21 08:39:59,125 [myid:] - INFO [main:JMXEnv@249] - found:StandaloneServer_port org.apache.ZooKeeperService:name0=StandaloneServer_port11222
[junit] 2017-02-21 08:39:59,125 [myid:] - INFO [main:JUnit4ZKTestRunner$LoggedInvokeMethod@82] - Memory used 17910
[junit] 2017-02-21 08:39:59,125 [myid:] - INFO [main:JUnit4ZKTestRunner$LoggedInvokeMethod@87] - Number of threads 24
[junit] 2017-02-21 08:39:59,125 [myid:] - INFO [main:JUnit4ZKTestRunner$LoggedInvokeMethod@102] - FINISHED TEST METHOD testQuota
[junit] 2017-02-21 08:39:59,125 [myid:] - INFO [main:ClientBase@558] - tearDown starting
[junit] 2017-02-21 08:39:59,202 [myid:] - INFO [main:ZooKeeper@1324] - Session: 0x126dccc9c7d0000 closed
[junit] 2017-02-21 08:39:59,202 [myid:] - INFO [main-EventThread:ClientCnxn$EventThread@513] - EventThread shut down for session: 0x126dccc9c7d0000
[junit] 2017-02-21 08:39:59,202 [myid:] - INFO [main:ClientBase@528] - STOPPING server
[junit] 2017-02-21 08:39:59,202 [myid:] - INFO [NIOServerCxnFactory.AcceptThread:0.0.0.0/0.0.0.0:11222:NIOServerCnxnFactory$AcceptThread@219] - accept thread exitted run method
[junit] 2017-02-21 08:39:59,203 [myid:] - INFO [ConnnectionExpirer:NIOServerCnxnFactory$ConnectionExpirerThread@583] - ConnnectionExpirerThread interrupted
[junit] 2017-02-21 08:39:59,203 [myid:] - INFO [NIOServerCxnFactory.SelectorThread-1:NIOServerCnxnFactory$SelectorThread@420] - selector thread exitted run method
[junit] 2017-02-21 08:39:59,203 [myid:] - INFO [NIOServerCxnFactory.SelectorThread-0:NIOServerCnxnFactory$SelectorThread@420] - selector thread exitted run method
[junit] 2017-02-21 08:39:59,203 [myid:] - INFO [main:ZooKeeperServer@542] - shutting down
[junit] 2017-02-21 08:39:59,203 [myid:] - ERROR [main:ZooKeeperServer@506] - ZKShutdownHandler is not registered, so ZooKeeper server won't take any action on ERROR or SHUTDOWN server state changes
[junit] 2017-02-21 08:39:59,203 [myid:] - INFO [main:SessionTrackerImpl@232] - Shutting down
[junit] 2017-02-21 08:39:59,203 [myid:] - INFO [main:PrepRequestProcessor@1008] - Shutting down
[junit] 2017-02-21 08:39:59,204 [myid:] - INFO [main:SyncRequestProcessor@191] - Shutting down
[junit] 2017-02-21 08:39:59,204 [myid:] - INFO [ProcessThread(sid:0 cport:11222)::PrepRequestProcessor@157] - PrepRequestProcessor exited loop!
[junit] 2017-02-21 08:39:59,204 [myid:] - INFO [SyncThread:0:SyncRequestProcessor@169] - SyncRequestProcessor exited!
[junit] 2017-02-21 08:39:59,204 [myid:] - INFO [main:FinalRequestProcessor@481] - shutdown of request processor complete
[junit] 2017-02-21 08:39:59,204 [myid:] - INFO [main:MBeanRegistry@128] - Unregister MBean [org.apache.ZooKeeperService:name0=StandaloneServer_port11222,name1=InMemoryDataTree]
[junit] 2017-02-21 08:39:59,204 [myid:] - INFO [main:MBeanRegistry@128] - Unregister MBean [org.apache.ZooKeeperService:name0=StandaloneServer_port11222]
[junit] 2017-02-21 08:39:59,205 [myid:] - INFO [main:FourLetterWordMain@85] - connecting to 127.0.0.1 11222
[junit] 2017-02-21 08:39:59,205 [myid:] - INFO [main:JMXEnv@146] - ensureOnly:[]
[junit] 2017-02-21 08:39:59,210 [myid:] - INFO [main:ClientBase@583] - fdcount after test is: 60 at start it was 43
[junit] 2017-02-21 08:39:59,210 [myid:] - INFO [main:ClientBase@585] - sleeping for 20 secs
[junit] 2017-02-21 08:39:59,211 [myid:] - INFO [main:ZKTestCase$1@65] - SUCCEEDED testQuota
[junit] 2017-02-21 08:39:59,211 [myid:] - INFO [main:ZKTestCase$1@60] - FINISHED testQuota
[junit] Tests run: 1, Failures: 0, Errors: 0, Time elapsed: 1.514 sec
fail.build.on.test.failure:
BUILD FAILED
/zonestorage/hudson_solaris/home/hudson/hudson-slave/workspace/ZooKeeper-trunk-solaris/build.xml:1242: The following error occurred while executing this line:
/zonestorage/hudson_solaris/home/hudson/hudson-slave/workspace/ZooKeeper-trunk-solaris/build.xml:1216: Tests failed!
Total time: 83 minutes 7 seconds
Build step 'Invoke Ant' marked build as failure
[locks-and-latches] Releasing all the locks
[locks-and-latches] All the locks released
Recording test results
Email was triggered for: Failure - Any
Sending email for trigger: Failure - Any
###################################################################################
############################## FAILED TESTS (if any) ##############################
3 tests failed.
FAILED: org.apache.zookeeper.server.quorum.StandaloneDisabledTest.startSingleServerTest
Error Message:
Timeout occurred. Please note the time in the report does not reflect the time until the timeout.
Stack Trace:
junit.framework.AssertionFailedError: Timeout occurred. Please note the time in the report does not reflect the time until the timeout.
FAILED: org.apache.zookeeper.test.ReconfigTest.testPortChangeToBlockedPortLeader
Error Message:
client could not connect to reestablished quorum: giving up after 30+ seconds.
Stack Trace:
junit.framework.AssertionFailedError: client could not connect to reestablished quorum: giving up after 30+ seconds.
at org.apache.zookeeper.test.ReconfigTest.testNormalOperation(ReconfigTest.java:183)
at org.apache.zookeeper.test.ReconfigTest.testPortChangeToBlockedPort(ReconfigTest.java:796)
at org.apache.zookeeper.test.ReconfigTest.testPortChangeToBlockedPortLeader(ReconfigTest.java:719)
at org.apache.zookeeper.JUnit4ZKTestRunner$LoggedInvokeMethod.evaluate(JUnit4ZKTestRunner.java:79)
FAILED: org.apache.zookeeper.test.ReconfigTest.testPortChangeToBlockedPortFollower
Error Message:
client could not connect to reestablished quorum: giving up after 30+ seconds.
Stack Trace:
junit.framework.AssertionFailedError: client could not connect to reestablished quorum: giving up after 30+ seconds.
at org.apache.zookeeper.test.ReconfigTest.testNormalOperation(ReconfigTest.java:183)
at org.apache.zookeeper.test.ReconfigTest.testPortChangeToBlockedPort(ReconfigTest.java:796)
at org.apache.zookeeper.test.ReconfigTest.testPortChangeToBlockedPortFollower(ReconfigTest.java:715)
at org.apache.zookeeper.JUnit4ZKTestRunner$LoggedInvokeMethod.evaluate(JUnit4ZKTestRunner.java:79)
ZooKeeper-trunk-solaris - Build # 1514 - Still Failing
Posted by Apache Jenkins Server <je...@builds.apache.org>.
See https://builds.apache.org/job/ZooKeeper-trunk-solaris/1514/
###################################################################################
########################## LAST 60 LINES OF THE CONSOLE ###########################
[...truncated 60.02 MB...]
[junit] 2017-02-20 08:24:00,376 [myid:] - INFO [main:ClientBase@376] - STARTING server instance 127.0.0.1:11222
[junit] 2017-02-20 08:24:00,376 [myid:] - INFO [main:ZooKeeperServer@908] - minSessionTimeout set to 6000
[junit] 2017-02-20 08:24:00,377 [myid:] - INFO [main:ZooKeeperServer@917] - maxSessionTimeout set to 60000
[junit] 2017-02-20 08:24:00,377 [myid:] - INFO [main:ZooKeeperServer@160] - Created server with tickTime 3000 minSessionTimeout 6000 maxSessionTimeout 60000 datadir /zonestorage/hudson_solaris/home/hudson/hudson-slave/workspace/ZooKeeper-trunk-solaris/build/test/tmp/test7453853958782576051.junit.dir/version-2 snapdir /zonestorage/hudson_solaris/home/hudson/hudson-slave/workspace/ZooKeeper-trunk-solaris/build/test/tmp/test7453853958782576051.junit.dir/version-2
[junit] 2017-02-20 08:24:00,377 [myid:] - INFO [main:FileSnap@83] - Reading snapshot /zonestorage/hudson_solaris/home/hudson/hudson-slave/workspace/ZooKeeper-trunk-solaris/build/test/tmp/test7453853958782576051.junit.dir/version-2/snapshot.b
[junit] 2017-02-20 08:24:00,380 [myid:] - INFO [main:FileTxnSnapLog@346] - Snapshotting: 0xb to /zonestorage/hudson_solaris/home/hudson/hudson-slave/workspace/ZooKeeper-trunk-solaris/build/test/tmp/test7453853958782576051.junit.dir/version-2/snapshot.b
[junit] 2017-02-20 08:24:00,381 [myid:] - ERROR [main:ZooKeeperServer@506] - ZKShutdownHandler is not registered, so ZooKeeper server won't take any action on ERROR or SHUTDOWN server state changes
[junit] 2017-02-20 08:24:00,381 [myid:] - INFO [main:FourLetterWordMain@85] - connecting to 127.0.0.1 11222
[junit] 2017-02-20 08:24:00,382 [myid:] - INFO [NIOServerCxnFactory.AcceptThread:0.0.0.0/0.0.0.0:11222:NIOServerCnxnFactory$AcceptThread@296] - Accepted socket connection from /127.0.0.1:34214
[junit] 2017-02-20 08:24:00,382 [myid:] - INFO [NIOWorkerThread-1:NIOServerCnxn@485] - Processing stat command from /127.0.0.1:34214
[junit] 2017-02-20 08:24:00,383 [myid:] - INFO [NIOWorkerThread-1:StatCommand@49] - Stat command output
[junit] 2017-02-20 08:24:00,383 [myid:] - INFO [NIOWorkerThread-1:NIOServerCnxn@614] - Closed socket connection for client /127.0.0.1:34214 (no session established for client)
[junit] 2017-02-20 08:24:00,383 [myid:] - INFO [main:JMXEnv@228] - ensureParent:[InMemoryDataTree, StandaloneServer_port]
[junit] 2017-02-20 08:24:00,384 [myid:] - INFO [main:JMXEnv@245] - expect:InMemoryDataTree
[junit] 2017-02-20 08:24:00,385 [myid:] - INFO [main:JMXEnv@249] - found:InMemoryDataTree org.apache.ZooKeeperService:name0=StandaloneServer_port11222,name1=InMemoryDataTree
[junit] 2017-02-20 08:24:00,385 [myid:] - INFO [main:JMXEnv@245] - expect:StandaloneServer_port
[junit] 2017-02-20 08:24:00,385 [myid:] - INFO [main:JMXEnv@249] - found:StandaloneServer_port org.apache.ZooKeeperService:name0=StandaloneServer_port11222
[junit] 2017-02-20 08:24:00,385 [myid:] - INFO [main:JUnit4ZKTestRunner$LoggedInvokeMethod@82] - Memory used 17910
[junit] 2017-02-20 08:24:00,385 [myid:] - INFO [main:JUnit4ZKTestRunner$LoggedInvokeMethod@87] - Number of threads 24
[junit] 2017-02-20 08:24:00,385 [myid:] - INFO [main:JUnit4ZKTestRunner$LoggedInvokeMethod@102] - FINISHED TEST METHOD testQuota
[junit] 2017-02-20 08:24:00,386 [myid:] - INFO [main:ClientBase@558] - tearDown starting
[junit] 2017-02-20 08:24:00,462 [myid:] - INFO [main:ZooKeeper@1324] - Session: 0x126d797a15b0000 closed
[junit] 2017-02-20 08:24:00,462 [myid:] - INFO [main:ClientBase@528] - STOPPING server
[junit] 2017-02-20 08:24:00,462 [myid:] - INFO [main-EventThread:ClientCnxn$EventThread@513] - EventThread shut down for session: 0x126d797a15b0000
[junit] 2017-02-20 08:24:00,462 [myid:] - INFO [NIOServerCxnFactory.AcceptThread:0.0.0.0/0.0.0.0:11222:NIOServerCnxnFactory$AcceptThread@219] - accept thread exitted run method
[junit] 2017-02-20 08:24:00,462 [myid:] - INFO [NIOServerCxnFactory.SelectorThread-1:NIOServerCnxnFactory$SelectorThread@420] - selector thread exitted run method
[junit] 2017-02-20 08:24:00,462 [myid:] - INFO [NIOServerCxnFactory.SelectorThread-0:NIOServerCnxnFactory$SelectorThread@420] - selector thread exitted run method
[junit] 2017-02-20 08:24:00,462 [myid:] - INFO [ConnnectionExpirer:NIOServerCnxnFactory$ConnectionExpirerThread@583] - ConnnectionExpirerThread interrupted
[junit] 2017-02-20 08:24:00,463 [myid:] - INFO [main:ZooKeeperServer@542] - shutting down
[junit] 2017-02-20 08:24:00,463 [myid:] - ERROR [main:ZooKeeperServer@506] - ZKShutdownHandler is not registered, so ZooKeeper server won't take any action on ERROR or SHUTDOWN server state changes
[junit] 2017-02-20 08:24:00,463 [myid:] - INFO [main:SessionTrackerImpl@232] - Shutting down
[junit] 2017-02-20 08:24:00,463 [myid:] - INFO [main:PrepRequestProcessor@1008] - Shutting down
[junit] 2017-02-20 08:24:00,463 [myid:] - INFO [main:SyncRequestProcessor@191] - Shutting down
[junit] 2017-02-20 08:24:00,463 [myid:] - INFO [ProcessThread(sid:0 cport:11222)::PrepRequestProcessor@157] - PrepRequestProcessor exited loop!
[junit] 2017-02-20 08:24:00,463 [myid:] - INFO [SyncThread:0:SyncRequestProcessor@169] - SyncRequestProcessor exited!
[junit] 2017-02-20 08:24:00,464 [myid:] - INFO [main:FinalRequestProcessor@481] - shutdown of request processor complete
[junit] 2017-02-20 08:24:00,464 [myid:] - INFO [main:MBeanRegistry@128] - Unregister MBean [org.apache.ZooKeeperService:name0=StandaloneServer_port11222,name1=InMemoryDataTree]
[junit] 2017-02-20 08:24:00,464 [myid:] - INFO [main:MBeanRegistry@128] - Unregister MBean [org.apache.ZooKeeperService:name0=StandaloneServer_port11222]
[junit] 2017-02-20 08:24:00,464 [myid:] - INFO [main:FourLetterWordMain@85] - connecting to 127.0.0.1 11222
[junit] 2017-02-20 08:24:00,465 [myid:] - INFO [main:JMXEnv@146] - ensureOnly:[]
[junit] 2017-02-20 08:24:00,469 [myid:] - INFO [main:ClientBase@583] - fdcount after test is: 60 at start it was 43
[junit] 2017-02-20 08:24:00,469 [myid:] - INFO [main:ClientBase@585] - sleeping for 20 secs
[junit] 2017-02-20 08:24:00,470 [myid:] - INFO [main:ZKTestCase$1@65] - SUCCEEDED testQuota
[junit] 2017-02-20 08:24:00,470 [myid:] - INFO [main:ZKTestCase$1@60] - FINISHED testQuota
[junit] Tests run: 1, Failures: 0, Errors: 0, Time elapsed: 1.163 sec
fail.build.on.test.failure:
BUILD FAILED
/zonestorage/hudson_solaris/home/hudson/hudson-slave/workspace/ZooKeeper-trunk-solaris/build.xml:1242: The following error occurred while executing this line:
/zonestorage/hudson_solaris/home/hudson/hudson-slave/workspace/ZooKeeper-trunk-solaris/build.xml:1216: Tests failed!
Total time: 67 minutes 45 seconds
Build step 'Invoke Ant' marked build as failure
[locks-and-latches] Releasing all the locks
[locks-and-latches] All the locks released
Recording test results
Email was triggered for: Failure - Any
Sending email for trigger: Failure - Any
###################################################################################
############################## FAILED TESTS (if any) ##############################
2 tests failed.
FAILED: org.apache.zookeeper.test.ReconfigTest.testPortChangeToBlockedPortLeader
Error Message:
client could not connect to reestablished quorum: giving up after 30+ seconds.
Stack Trace:
junit.framework.AssertionFailedError: client could not connect to reestablished quorum: giving up after 30+ seconds.
at org.apache.zookeeper.test.ReconfigTest.testNormalOperation(ReconfigTest.java:183)
at org.apache.zookeeper.test.ReconfigTest.testPortChangeToBlockedPort(ReconfigTest.java:796)
at org.apache.zookeeper.test.ReconfigTest.testPortChangeToBlockedPortLeader(ReconfigTest.java:719)
at org.apache.zookeeper.JUnit4ZKTestRunner$LoggedInvokeMethod.evaluate(JUnit4ZKTestRunner.java:79)
FAILED: org.apache.zookeeper.test.ReconfigTest.testPortChangeToBlockedPortFollower
Error Message:
client could not connect to reestablished quorum: giving up after 30+ seconds.
Stack Trace:
junit.framework.AssertionFailedError: client could not connect to reestablished quorum: giving up after 30+ seconds.
at org.apache.zookeeper.test.ReconfigTest.testNormalOperation(ReconfigTest.java:183)
at org.apache.zookeeper.test.ReconfigTest.testPortChangeToBlockedPort(ReconfigTest.java:796)
at org.apache.zookeeper.test.ReconfigTest.testPortChangeToBlockedPortFollower(ReconfigTest.java:715)
at org.apache.zookeeper.JUnit4ZKTestRunner$LoggedInvokeMethod.evaluate(JUnit4ZKTestRunner.java:79)
ZooKeeper-trunk-solaris - Build # 1513 - Still Failing
Posted by Apache Jenkins Server <je...@builds.apache.org>.
See https://builds.apache.org/job/ZooKeeper-trunk-solaris/1513/
###################################################################################
########################## LAST 60 LINES OF THE CONSOLE ###########################
[...truncated 14.92 MB...]
[junit] 2017-02-19 07:44:49,708 [myid:] - INFO [main:FourLetterWordMain@85] - connecting to 127.0.0.1 11222
[junit] 2017-02-19 07:44:49,709 [myid:] - INFO [NIOServerCxnFactory.AcceptThread:0.0.0.0/0.0.0.0:11222:NIOServerCnxnFactory$AcceptThread@296] - Accepted socket connection from /127.0.0.1:51749
[junit] 2017-02-19 07:44:49,710 [myid:] - INFO [NIOWorkerThread-1:NIOServerCnxn@485] - Processing stat command from /127.0.0.1:51749
[junit] 2017-02-19 07:44:49,710 [myid:] - INFO [NIOWorkerThread-1:StatCommand@49] - Stat command output
[junit] 2017-02-19 07:44:49,710 [myid:] - INFO [NIOWorkerThread-1:NIOServerCnxn@614] - Closed socket connection for client /127.0.0.1:51749 (no session established for client)
[junit] 2017-02-19 07:44:49,710 [myid:] - INFO [main:ZooKeeper@863] - Initiating client connection, connectString=127.0.0.1:11222 sessionTimeout=30000 watcher=org.apache.zookeeper.test.ClientBase$CountdownWatcher@12cc218
[junit] 2017-02-19 07:44:49,711 [myid:] - INFO [main:ClientCnxnSocket@236] - jute.maxbuffer value is 4194304 Bytes
[junit] 2017-02-19 07:44:49,711 [myid:127.0.0.1:11222] - INFO [main-SendThread(127.0.0.1:11222):ClientCnxn$SendThread@1113] - Opening socket connection to server 127.0.0.1/127.0.0.1:11222. Will not attempt to authenticate using SASL (unknown error)
[junit] 2017-02-19 07:44:49,711 [myid:127.0.0.1:11222] - INFO [main-SendThread(127.0.0.1:11222):ClientCnxn$SendThread@948] - Socket connection established, initiating session, client: null, server: null
[junit] 2017-02-19 07:44:49,712 [myid:] - INFO [NIOServerCxnFactory.AcceptThread:0.0.0.0/0.0.0.0:11222:NIOServerCnxnFactory$AcceptThread@296] - Accepted socket connection from /127.0.0.1:51750
[junit] 2017-02-19 07:44:49,714 [myid:] - INFO [NIOWorkerThread-2:ZooKeeperServer@1014] - Client attempting to establish new session at /127.0.0.1:51750
[junit] 2017-02-19 07:44:49,714 [myid:] - INFO [SyncThread:0:FileTxnLog@204] - Creating new log file: log.1
[junit] 2017-02-19 07:44:49,716 [myid:] - INFO [SyncThread:0:ZooKeeperServer@728] - Established session 0x126d24d6fa10000 with negotiated timeout 30000 for client /127.0.0.1:51750
[junit] 2017-02-19 07:44:49,716 [myid:127.0.0.1:11222] - INFO [main-SendThread(127.0.0.1:11222):ClientCnxn$SendThread@1381] - Session establishment complete on server null, sessionid = 0x126d24d6fa10000, negotiated timeout = 30000
[junit] 2017-02-19 07:44:49,847 [myid:] - INFO [NIOWorkerThread-4:ZooKeeperServer@1051] - got auth packet /127.0.0.1:51750
[junit] 2017-02-19 07:44:49,954 [myid:] - INFO [NIOWorkerThread-4:ZooKeeperServer@1069] - auth success /127.0.0.1:51750
[junit] 2017-02-19 07:44:49,961 [myid:] - INFO [ProcessThread(sid:0 cport:11222)::PrepRequestProcessor@617] - Processed session termination for sessionid: 0x126d24d6fa10000
[junit] 2017-02-19 07:44:49,962 [myid:] - INFO [main:ZooKeeper@1324] - Session: 0x126d24d6fa10000 closed
[junit] 2017-02-19 07:44:49,962 [myid:] - INFO [main-EventThread:ClientCnxn$EventThread@513] - EventThread shut down for session: 0x126d24d6fa10000
[junit] 2017-02-19 07:44:49,962 [myid:] - INFO [NIOWorkerThread-8:MBeanRegistry@128] - Unregister MBean [org.apache.ZooKeeperService:name0=StandaloneServer_port11222,name1=Connections,name2=127.0.0.1,name3=0x126d24d6fa10000]
[junit] 2017-02-19 07:44:49,963 [myid:] - INFO [ConnnectionExpirer:NIOServerCnxnFactory$ConnectionExpirerThread@583] - ConnnectionExpirerThread interrupted
[junit] 2017-02-19 07:44:49,963 [myid:] - INFO [NIOServerCxnFactory.AcceptThread:0.0.0.0/0.0.0.0:11222:NIOServerCnxnFactory$AcceptThread@219] - accept thread exitted run method
[junit] 2017-02-19 07:44:49,964 [myid:] - INFO [NIOServerCxnFactory.SelectorThread-1:NIOServerCnxnFactory$SelectorThread@420] - selector thread exitted run method
[junit] 2017-02-19 07:44:49,964 [myid:] - INFO [NIOServerCxnFactory.SelectorThread-0:NIOServerCnxnFactory$SelectorThread@420] - selector thread exitted run method
[junit] 2017-02-19 07:44:49,964 [myid:] - INFO [NIOWorkerThread-8:NIOServerCnxn@614] - Closed socket connection for client /127.0.0.1:51750 which had sessionid 0x126d24d6fa10000
[junit] 2017-02-19 07:44:49,966 [myid:] - INFO [main:ZooKeeperServer@542] - shutting down
[junit] 2017-02-19 07:44:49,966 [myid:] - ERROR [main:ZooKeeperServer@506] - ZKShutdownHandler is not registered, so ZooKeeper server won't take any action on ERROR or SHUTDOWN server state changes
[junit] 2017-02-19 07:44:49,966 [myid:] - INFO [main:SessionTrackerImpl@232] - Shutting down
[junit] 2017-02-19 07:44:49,966 [myid:] - INFO [main:PrepRequestProcessor@1008] - Shutting down
[junit] 2017-02-19 07:44:49,966 [myid:] - INFO [main:SyncRequestProcessor@191] - Shutting down
[junit] 2017-02-19 07:44:49,966 [myid:] - INFO [ProcessThread(sid:0 cport:11222)::PrepRequestProcessor@157] - PrepRequestProcessor exited loop!
[junit] 2017-02-19 07:44:49,966 [myid:] - INFO [SyncThread:0:SyncRequestProcessor@169] - SyncRequestProcessor exited!
[junit] 2017-02-19 07:44:49,967 [myid:] - INFO [main:FinalRequestProcessor@481] - shutdown of request processor complete
[junit] 2017-02-19 07:44:49,967 [myid:] - INFO [main:MBeanRegistry@128] - Unregister MBean [org.apache.ZooKeeperService:name0=StandaloneServer_port11222,name1=InMemoryDataTree]
[junit] 2017-02-19 07:44:49,967 [myid:] - INFO [main:MBeanRegistry@128] - Unregister MBean [org.apache.ZooKeeperService:name0=StandaloneServer_port11222]
[junit] 2017-02-19 07:44:49,967 [myid:] - INFO [main:FourLetterWordMain@85] - connecting to 127.0.0.1 11222
[junit] 2017-02-19 07:44:49,968 [myid:] - INFO [main:JUnit4ZKTestRunner$LoggedInvokeMethod@82] - Memory used 16061
[junit] 2017-02-19 07:44:49,968 [myid:] - INFO [main:JUnit4ZKTestRunner$LoggedInvokeMethod@87] - Number of threads 10
[junit] 2017-02-19 07:44:49,968 [myid:] - INFO [main:JUnit4ZKTestRunner$LoggedInvokeMethod@102] - FINISHED TEST METHOD testDisconnectedAddAuth
[junit] 2017-02-19 07:44:49,968 [myid:] - INFO [main:ZKTestCase$1@65] - SUCCEEDED testDisconnectedAddAuth
[junit] 2017-02-19 07:44:49,968 [myid:] - INFO [main:ZKTestCase$1@60] - FINISHED testDisconnectedAddAuth
[junit] Tests run: 3, Failures: 0, Errors: 0, Time elapsed: 14.595 sec
[junit] 2017-02-19 07:44:50,261 [myid:] - INFO [SessionTracker:SessionTrackerImpl@158] - SessionTrackerImpl exited loop!
[junit] 2017-02-19 07:44:50,261 [myid:] - INFO [SessionTracker:SessionTrackerImpl@158] - SessionTrackerImpl exited loop!
[junit] 2017-02-19 07:44:50,261 [myid:] - INFO [SessionTracker:SessionTrackerImpl@158] - SessionTrackerImpl exited loop!
[junit] 2017-02-19 07:44:50,261 [myid:] - INFO [SessionTracker:SessionTrackerImpl@158] - SessionTrackerImpl exited loop!
[junit] Running org.apache.zookeeper.test.AsyncHammerTest
[junit] Tests run: 1, Failures: 0, Errors: 1, Time elapsed: 0 sec
BUILD FAILED
/zonestorage/hudson_solaris/home/hudson/hudson-slave/workspace/ZooKeeper-trunk-solaris/build.xml:1228: Process fork failed.
Total time: 28 minutes 0 seconds
Build step 'Invoke Ant' marked build as failure
[locks-and-latches] Releasing all the locks
[locks-and-latches] All the locks released
Recording test results
Email was triggered for: Failure - Any
Sending email for trigger: Failure - Any
###################################################################################
############################## FAILED TESTS (if any) ##############################
2 tests failed.
FAILED: org.apache.zookeeper.test.AsyncHammerTest.unknown
Error Message:
Forked Java VM exited abnormally. Please note the time in the report does not reflect the time until the VM exit.
Stack Trace:
junit.framework.AssertionFailedError: Forked Java VM exited abnormally. Please note the time in the report does not reflect the time until the VM exit.
FAILED: org.apache.zookeeper.server.quorum.Zab1_0Test.testNormalFollowerRunWithDiff
Error Message:
expected:<4294967298> but was:<4294967297>
Stack Trace:
junit.framework.AssertionFailedError: expected:<4294967298> but was:<4294967297>
at org.apache.zookeeper.server.quorum.Zab1_0Test$5.converseWithFollower(Zab1_0Test.java:869)
at org.apache.zookeeper.server.quorum.Zab1_0Test.testFollowerConversation(Zab1_0Test.java:517)
at org.apache.zookeeper.server.quorum.Zab1_0Test.testNormalFollowerRunWithDiff(Zab1_0Test.java:784)
at org.apache.zookeeper.JUnit4ZKTestRunner$LoggedInvokeMethod.evaluate(JUnit4ZKTestRunner.java:79)
ZooKeeper-trunk-solaris - Build # 1512 - Still Failing
Posted by Apache Jenkins Server <je...@builds.apache.org>.
See https://builds.apache.org/job/ZooKeeper-trunk-solaris/1512/
###################################################################################
########################## LAST 60 LINES OF THE CONSOLE ###########################
[...truncated 468702 lines...]
[junit] 2017-02-18 08:23:32,287 [myid:] - INFO [main:ClientBase@376] - STARTING server instance 127.0.0.1:11222
[junit] 2017-02-18 08:23:32,287 [myid:] - INFO [main:ZooKeeperServer@908] - minSessionTimeout set to 6000
[junit] 2017-02-18 08:23:32,287 [myid:] - INFO [main:ZooKeeperServer@917] - maxSessionTimeout set to 60000
[junit] 2017-02-18 08:23:32,287 [myid:] - INFO [main:ZooKeeperServer@160] - Created server with tickTime 3000 minSessionTimeout 6000 maxSessionTimeout 60000 datadir /zonestorage/hudson_solaris/home/hudson/hudson-slave/workspace/ZooKeeper-trunk-solaris/build/test/tmp/test8845554367838284315.junit.dir/version-2 snapdir /zonestorage/hudson_solaris/home/hudson/hudson-slave/workspace/ZooKeeper-trunk-solaris/build/test/tmp/test8845554367838284315.junit.dir/version-2
[junit] 2017-02-18 08:23:32,288 [myid:] - INFO [main:FileSnap@83] - Reading snapshot /zonestorage/hudson_solaris/home/hudson/hudson-slave/workspace/ZooKeeper-trunk-solaris/build/test/tmp/test8845554367838284315.junit.dir/version-2/snapshot.b
[junit] 2017-02-18 08:23:32,290 [myid:] - INFO [main:FileTxnSnapLog@346] - Snapshotting: 0xb to /zonestorage/hudson_solaris/home/hudson/hudson-slave/workspace/ZooKeeper-trunk-solaris/build/test/tmp/test8845554367838284315.junit.dir/version-2/snapshot.b
[junit] 2017-02-18 08:23:32,292 [myid:] - ERROR [main:ZooKeeperServer@506] - ZKShutdownHandler is not registered, so ZooKeeper server won't take any action on ERROR or SHUTDOWN server state changes
[junit] 2017-02-18 08:23:32,292 [myid:] - INFO [main:FourLetterWordMain@85] - connecting to 127.0.0.1 11222
[junit] 2017-02-18 08:23:32,292 [myid:] - INFO [NIOServerCxnFactory.AcceptThread:0.0.0.0/0.0.0.0:11222:NIOServerCnxnFactory$AcceptThread@296] - Accepted socket connection from /127.0.0.1:43244
[junit] 2017-02-18 08:23:32,293 [myid:] - INFO [NIOWorkerThread-1:NIOServerCnxn@485] - Processing stat command from /127.0.0.1:43244
[junit] 2017-02-18 08:23:32,293 [myid:] - INFO [NIOWorkerThread-1:StatCommand@49] - Stat command output
[junit] 2017-02-18 08:23:32,293 [myid:] - INFO [NIOWorkerThread-1:NIOServerCnxn@614] - Closed socket connection for client /127.0.0.1:43244 (no session established for client)
[junit] 2017-02-18 08:23:32,294 [myid:] - INFO [main:JMXEnv@228] - ensureParent:[InMemoryDataTree, StandaloneServer_port]
[junit] 2017-02-18 08:23:32,295 [myid:] - INFO [main:JMXEnv@245] - expect:InMemoryDataTree
[junit] 2017-02-18 08:23:32,295 [myid:] - INFO [main:JMXEnv@249] - found:InMemoryDataTree org.apache.ZooKeeperService:name0=StandaloneServer_port11222,name1=InMemoryDataTree
[junit] 2017-02-18 08:23:32,295 [myid:] - INFO [main:JMXEnv@245] - expect:StandaloneServer_port
[junit] 2017-02-18 08:23:32,295 [myid:] - INFO [main:JMXEnv@249] - found:StandaloneServer_port org.apache.ZooKeeperService:name0=StandaloneServer_port11222
[junit] 2017-02-18 08:23:32,296 [myid:] - INFO [main:JUnit4ZKTestRunner$LoggedInvokeMethod@82] - Memory used 18001
[junit] 2017-02-18 08:23:32,296 [myid:] - INFO [main:JUnit4ZKTestRunner$LoggedInvokeMethod@87] - Number of threads 24
[junit] 2017-02-18 08:23:32,296 [myid:] - INFO [main:JUnit4ZKTestRunner$LoggedInvokeMethod@102] - FINISHED TEST METHOD testQuota
[junit] 2017-02-18 08:23:32,296 [myid:] - INFO [main:ClientBase@558] - tearDown starting
[junit] 2017-02-18 08:23:32,373 [myid:] - INFO [main:ZooKeeper@1324] - Session: 0x126cd4a836d0000 closed
[junit] 2017-02-18 08:23:32,373 [myid:] - INFO [main-EventThread:ClientCnxn$EventThread@513] - EventThread shut down for session: 0x126cd4a836d0000
[junit] 2017-02-18 08:23:32,373 [myid:] - INFO [main:ClientBase@528] - STOPPING server
[junit] 2017-02-18 08:23:32,374 [myid:] - INFO [NIOServerCxnFactory.AcceptThread:0.0.0.0/0.0.0.0:11222:NIOServerCnxnFactory$AcceptThread@219] - accept thread exitted run method
[junit] 2017-02-18 08:23:32,374 [myid:] - INFO [NIOServerCxnFactory.SelectorThread-1:NIOServerCnxnFactory$SelectorThread@420] - selector thread exitted run method
[junit] 2017-02-18 08:23:32,374 [myid:] - INFO [NIOServerCxnFactory.SelectorThread-0:NIOServerCnxnFactory$SelectorThread@420] - selector thread exitted run method
[junit] 2017-02-18 08:23:32,374 [myid:] - INFO [ConnnectionExpirer:NIOServerCnxnFactory$ConnectionExpirerThread@583] - ConnnectionExpirerThread interrupted
[junit] 2017-02-18 08:23:32,375 [myid:] - INFO [main:ZooKeeperServer@542] - shutting down
[junit] 2017-02-18 08:23:32,375 [myid:] - ERROR [main:ZooKeeperServer@506] - ZKShutdownHandler is not registered, so ZooKeeper server won't take any action on ERROR or SHUTDOWN server state changes
[junit] 2017-02-18 08:23:32,375 [myid:] - INFO [main:SessionTrackerImpl@232] - Shutting down
[junit] 2017-02-18 08:23:32,376 [myid:] - INFO [main:PrepRequestProcessor@1008] - Shutting down
[junit] 2017-02-18 08:23:32,376 [myid:] - INFO [main:SyncRequestProcessor@191] - Shutting down
[junit] 2017-02-18 08:23:32,376 [myid:] - INFO [ProcessThread(sid:0 cport:11222)::PrepRequestProcessor@157] - PrepRequestProcessor exited loop!
[junit] 2017-02-18 08:23:32,376 [myid:] - INFO [SyncThread:0:SyncRequestProcessor@169] - SyncRequestProcessor exited!
[junit] 2017-02-18 08:23:32,377 [myid:] - INFO [main:FinalRequestProcessor@481] - shutdown of request processor complete
[junit] 2017-02-18 08:23:32,377 [myid:] - INFO [main:MBeanRegistry@128] - Unregister MBean [org.apache.ZooKeeperService:name0=StandaloneServer_port11222,name1=InMemoryDataTree]
[junit] 2017-02-18 08:23:32,377 [myid:] - INFO [main:MBeanRegistry@128] - Unregister MBean [org.apache.ZooKeeperService:name0=StandaloneServer_port11222]
[junit] 2017-02-18 08:23:32,378 [myid:] - INFO [main:FourLetterWordMain@85] - connecting to 127.0.0.1 11222
[junit] 2017-02-18 08:23:32,378 [myid:] - INFO [main:JMXEnv@146] - ensureOnly:[]
[junit] 2017-02-18 08:23:32,384 [myid:] - INFO [main:ClientBase@583] - fdcount after test is: 60 at start it was 43
[junit] 2017-02-18 08:23:32,385 [myid:] - INFO [main:ClientBase@585] - sleeping for 20 secs
[junit] 2017-02-18 08:23:32,386 [myid:] - INFO [main:ZKTestCase$1@65] - SUCCEEDED testQuota
[junit] 2017-02-18 08:23:32,387 [myid:] - INFO [main:ZKTestCase$1@60] - FINISHED testQuota
[junit] Tests run: 1, Failures: 0, Errors: 0, Time elapsed: 0.935 sec
fail.build.on.test.failure:
BUILD FAILED
/zonestorage/hudson_solaris/home/hudson/hudson-slave/workspace/ZooKeeper-trunk-solaris/build.xml:1242: The following error occurred while executing this line:
/zonestorage/hudson_solaris/home/hudson/hudson-slave/workspace/ZooKeeper-trunk-solaris/build.xml:1216: Tests failed!
Total time: 67 minutes 50 seconds
Build step 'Invoke Ant' marked build as failure
[locks-and-latches] Releasing all the locks
[locks-and-latches] All the locks released
Recording test results
Email was triggered for: Failure - Any
Sending email for trigger: Failure - Any
###################################################################################
############################## FAILED TESTS (if any) ##############################
4 tests failed.
FAILED: org.apache.zookeeper.server.quorum.Zab1_0Test.testNormalFollowerRunWithDiff
Error Message:
expected:<4294967298> but was:<4294967297>
Stack Trace:
junit.framework.AssertionFailedError: expected:<4294967298> but was:<4294967297>
at org.apache.zookeeper.server.quorum.Zab1_0Test$5.converseWithFollower(Zab1_0Test.java:869)
at org.apache.zookeeper.server.quorum.Zab1_0Test.testFollowerConversation(Zab1_0Test.java:517)
at org.apache.zookeeper.server.quorum.Zab1_0Test.testNormalFollowerRunWithDiff(Zab1_0Test.java:784)
at org.apache.zookeeper.JUnit4ZKTestRunner$LoggedInvokeMethod.evaluate(JUnit4ZKTestRunner.java:79)
FAILED: org.apache.zookeeper.test.WatchEventWhenAutoResetTest.testNodeDataChanged
Error Message:
expected:<NodeDataChanged> but was:<NodeDeleted>
Stack Trace:
junit.framework.AssertionFailedError: expected:<NodeDataChanged> but was:<NodeDeleted>
at org.apache.zookeeper.test.WatchEventWhenAutoResetTest$EventsWatcher.assertEvent(WatchEventWhenAutoResetTest.java:67)
at org.apache.zookeeper.test.WatchEventWhenAutoResetTest.testNodeDataChanged(WatchEventWhenAutoResetTest.java:126)
at org.apache.zookeeper.JUnit4ZKTestRunner$LoggedInvokeMethod.evaluate(JUnit4ZKTestRunner.java:79)
FAILED: org.apache.zookeeper.test.ReconfigTest.testPortChangeToBlockedPortLeader
Error Message:
client could not connect to reestablished quorum: giving up after 30+ seconds.
Stack Trace:
junit.framework.AssertionFailedError: client could not connect to reestablished quorum: giving up after 30+ seconds.
at org.apache.zookeeper.test.ReconfigTest.testNormalOperation(ReconfigTest.java:183)
at org.apache.zookeeper.test.ReconfigTest.testPortChangeToBlockedPort(ReconfigTest.java:796)
at org.apache.zookeeper.test.ReconfigTest.testPortChangeToBlockedPortLeader(ReconfigTest.java:719)
at org.apache.zookeeper.JUnit4ZKTestRunner$LoggedInvokeMethod.evaluate(JUnit4ZKTestRunner.java:79)
FAILED: org.apache.zookeeper.test.ReconfigTest.testPortChangeToBlockedPortFollower
Error Message:
client could not connect to reestablished quorum: giving up after 30+ seconds.
Stack Trace:
junit.framework.AssertionFailedError: client could not connect to reestablished quorum: giving up after 30+ seconds.
at org.apache.zookeeper.test.ReconfigTest.testNormalOperation(ReconfigTest.java:183)
at org.apache.zookeeper.test.ReconfigTest.testPortChangeToBlockedPort(ReconfigTest.java:796)
at org.apache.zookeeper.test.ReconfigTest.testPortChangeToBlockedPortFollower(ReconfigTest.java:715)
at org.apache.zookeeper.JUnit4ZKTestRunner$LoggedInvokeMethod.evaluate(JUnit4ZKTestRunner.java:79)
ZooKeeper-trunk-solaris - Build # 1511 - Still Failing
Posted by Apache Jenkins Server <je...@builds.apache.org>.
See https://builds.apache.org/job/ZooKeeper-trunk-solaris/1511/
###################################################################################
########################## LAST 60 LINES OF THE CONSOLE ###########################
[...truncated 473689 lines...]
[junit] 2017-02-17 08:25:59,609 [myid:] - INFO [main:ClientBase@376] - STARTING server instance 127.0.0.1:11222
[junit] 2017-02-17 08:25:59,609 [myid:] - INFO [main:ZooKeeperServer@908] - minSessionTimeout set to 6000
[junit] 2017-02-17 08:25:59,609 [myid:] - INFO [main:ZooKeeperServer@917] - maxSessionTimeout set to 60000
[junit] 2017-02-17 08:25:59,609 [myid:] - INFO [main:ZooKeeperServer@160] - Created server with tickTime 3000 minSessionTimeout 6000 maxSessionTimeout 60000 datadir /zonestorage/hudson_solaris/home/hudson/hudson-slave/workspace/ZooKeeper-trunk-solaris/build/test/tmp/test1265351251219871236.junit.dir/version-2 snapdir /zonestorage/hudson_solaris/home/hudson/hudson-slave/workspace/ZooKeeper-trunk-solaris/build/test/tmp/test1265351251219871236.junit.dir/version-2
[junit] 2017-02-17 08:25:59,610 [myid:] - INFO [main:FileSnap@83] - Reading snapshot /zonestorage/hudson_solaris/home/hudson/hudson-slave/workspace/ZooKeeper-trunk-solaris/build/test/tmp/test1265351251219871236.junit.dir/version-2/snapshot.b
[junit] 2017-02-17 08:25:59,612 [myid:] - INFO [main:FileTxnSnapLog@346] - Snapshotting: 0xb to /zonestorage/hudson_solaris/home/hudson/hudson-slave/workspace/ZooKeeper-trunk-solaris/build/test/tmp/test1265351251219871236.junit.dir/version-2/snapshot.b
[junit] 2017-02-17 08:25:59,613 [myid:] - ERROR [main:ZooKeeperServer@506] - ZKShutdownHandler is not registered, so ZooKeeper server won't take any action on ERROR or SHUTDOWN server state changes
[junit] 2017-02-17 08:25:59,614 [myid:] - INFO [main:FourLetterWordMain@85] - connecting to 127.0.0.1 11222
[junit] 2017-02-17 08:25:59,614 [myid:] - INFO [NIOServerCxnFactory.AcceptThread:0.0.0.0/0.0.0.0:11222:NIOServerCnxnFactory$AcceptThread@296] - Accepted socket connection from /127.0.0.1:61570
[junit] 2017-02-17 08:25:59,615 [myid:] - INFO [NIOWorkerThread-1:NIOServerCnxn@485] - Processing stat command from /127.0.0.1:61570
[junit] 2017-02-17 08:25:59,615 [myid:] - INFO [NIOWorkerThread-1:StatCommand@49] - Stat command output
[junit] 2017-02-17 08:25:59,615 [myid:] - INFO [NIOWorkerThread-1:NIOServerCnxn@614] - Closed socket connection for client /127.0.0.1:61570 (no session established for client)
[junit] 2017-02-17 08:25:59,615 [myid:] - INFO [main:JMXEnv@228] - ensureParent:[InMemoryDataTree, StandaloneServer_port]
[junit] 2017-02-17 08:25:59,617 [myid:] - INFO [main:JMXEnv@245] - expect:InMemoryDataTree
[junit] 2017-02-17 08:25:59,617 [myid:] - INFO [main:JMXEnv@249] - found:InMemoryDataTree org.apache.ZooKeeperService:name0=StandaloneServer_port11222,name1=InMemoryDataTree
[junit] 2017-02-17 08:25:59,617 [myid:] - INFO [main:JMXEnv@245] - expect:StandaloneServer_port
[junit] 2017-02-17 08:25:59,617 [myid:] - INFO [main:JMXEnv@249] - found:StandaloneServer_port org.apache.ZooKeeperService:name0=StandaloneServer_port11222
[junit] 2017-02-17 08:25:59,617 [myid:] - INFO [main:JUnit4ZKTestRunner$LoggedInvokeMethod@82] - Memory used 17906
[junit] 2017-02-17 08:25:59,618 [myid:] - INFO [main:JUnit4ZKTestRunner$LoggedInvokeMethod@87] - Number of threads 24
[junit] 2017-02-17 08:25:59,618 [myid:] - INFO [main:JUnit4ZKTestRunner$LoggedInvokeMethod@102] - FINISHED TEST METHOD testQuota
[junit] 2017-02-17 08:25:59,618 [myid:] - INFO [main:ClientBase@558] - tearDown starting
[junit] 2017-02-17 08:25:59,702 [myid:] - INFO [main:ZooKeeper@1324] - Session: 0x126c8266adc0000 closed
[junit] 2017-02-17 08:25:59,702 [myid:] - INFO [main-EventThread:ClientCnxn$EventThread@513] - EventThread shut down for session: 0x126c8266adc0000
[junit] 2017-02-17 08:25:59,702 [myid:] - INFO [main:ClientBase@528] - STOPPING server
[junit] 2017-02-17 08:25:59,703 [myid:] - INFO [ConnnectionExpirer:NIOServerCnxnFactory$ConnectionExpirerThread@583] - ConnnectionExpirerThread interrupted
[junit] 2017-02-17 08:25:59,703 [myid:] - INFO [NIOServerCxnFactory.SelectorThread-1:NIOServerCnxnFactory$SelectorThread@420] - selector thread exitted run method
[junit] 2017-02-17 08:25:59,703 [myid:] - INFO [NIOServerCxnFactory.SelectorThread-0:NIOServerCnxnFactory$SelectorThread@420] - selector thread exitted run method
[junit] 2017-02-17 08:25:59,703 [myid:] - INFO [NIOServerCxnFactory.AcceptThread:0.0.0.0/0.0.0.0:11222:NIOServerCnxnFactory$AcceptThread@219] - accept thread exitted run method
[junit] 2017-02-17 08:25:59,703 [myid:] - INFO [main:ZooKeeperServer@542] - shutting down
[junit] 2017-02-17 08:25:59,704 [myid:] - ERROR [main:ZooKeeperServer@506] - ZKShutdownHandler is not registered, so ZooKeeper server won't take any action on ERROR or SHUTDOWN server state changes
[junit] 2017-02-17 08:25:59,704 [myid:] - INFO [main:SessionTrackerImpl@232] - Shutting down
[junit] 2017-02-17 08:25:59,704 [myid:] - INFO [main:PrepRequestProcessor@1008] - Shutting down
[junit] 2017-02-17 08:25:59,704 [myid:] - INFO [main:SyncRequestProcessor@191] - Shutting down
[junit] 2017-02-17 08:25:59,704 [myid:] - INFO [ProcessThread(sid:0 cport:11222)::PrepRequestProcessor@157] - PrepRequestProcessor exited loop!
[junit] 2017-02-17 08:25:59,704 [myid:] - INFO [SyncThread:0:SyncRequestProcessor@169] - SyncRequestProcessor exited!
[junit] 2017-02-17 08:25:59,704 [myid:] - INFO [main:FinalRequestProcessor@481] - shutdown of request processor complete
[junit] 2017-02-17 08:25:59,705 [myid:] - INFO [main:MBeanRegistry@128] - Unregister MBean [org.apache.ZooKeeperService:name0=StandaloneServer_port11222,name1=InMemoryDataTree]
[junit] 2017-02-17 08:25:59,705 [myid:] - INFO [main:MBeanRegistry@128] - Unregister MBean [org.apache.ZooKeeperService:name0=StandaloneServer_port11222]
[junit] 2017-02-17 08:25:59,705 [myid:] - INFO [main:FourLetterWordMain@85] - connecting to 127.0.0.1 11222
[junit] 2017-02-17 08:25:59,706 [myid:] - INFO [main:JMXEnv@146] - ensureOnly:[]
[junit] 2017-02-17 08:25:59,710 [myid:] - INFO [main:ClientBase@583] - fdcount after test is: 60 at start it was 43
[junit] 2017-02-17 08:25:59,711 [myid:] - INFO [main:ClientBase@585] - sleeping for 20 secs
[junit] 2017-02-17 08:25:59,712 [myid:] - INFO [main:ZKTestCase$1@65] - SUCCEEDED testQuota
[junit] 2017-02-17 08:25:59,712 [myid:] - INFO [main:ZKTestCase$1@60] - FINISHED testQuota
[junit] Tests run: 1, Failures: 0, Errors: 0, Time elapsed: 1.78 sec
fail.build.on.test.failure:
BUILD FAILED
/zonestorage/hudson_solaris/home/hudson/hudson-slave/workspace/ZooKeeper-trunk-solaris/build.xml:1242: The following error occurred while executing this line:
/zonestorage/hudson_solaris/home/hudson/hudson-slave/workspace/ZooKeeper-trunk-solaris/build.xml:1216: Tests failed!
Total time: 70 minutes 1 second
Build step 'Invoke Ant' marked build as failure
[locks-and-latches] Releasing all the locks
[locks-and-latches] All the locks released
Recording test results
Email was triggered for: Failure - Any
Sending email for trigger: Failure - Any
###################################################################################
############################## FAILED TESTS (if any) ##############################
2 tests failed.
FAILED: org.apache.zookeeper.test.ReconfigTest.testPortChangeToBlockedPortLeader
Error Message:
client could not connect to reestablished quorum: giving up after 30+ seconds.
Stack Trace:
junit.framework.AssertionFailedError: client could not connect to reestablished quorum: giving up after 30+ seconds.
at org.apache.zookeeper.test.ReconfigTest.testNormalOperation(ReconfigTest.java:183)
at org.apache.zookeeper.test.ReconfigTest.testPortChangeToBlockedPort(ReconfigTest.java:796)
at org.apache.zookeeper.test.ReconfigTest.testPortChangeToBlockedPortLeader(ReconfigTest.java:719)
at org.apache.zookeeper.JUnit4ZKTestRunner$LoggedInvokeMethod.evaluate(JUnit4ZKTestRunner.java:79)
FAILED: org.apache.zookeeper.test.ReconfigTest.testPortChangeToBlockedPortFollower
Error Message:
client could not connect to reestablished quorum: giving up after 30+ seconds.
Stack Trace:
junit.framework.AssertionFailedError: client could not connect to reestablished quorum: giving up after 30+ seconds.
at org.apache.zookeeper.test.ReconfigTest.testNormalOperation(ReconfigTest.java:183)
at org.apache.zookeeper.test.ReconfigTest.testPortChangeToBlockedPort(ReconfigTest.java:796)
at org.apache.zookeeper.test.ReconfigTest.testPortChangeToBlockedPortFollower(ReconfigTest.java:715)
at org.apache.zookeeper.JUnit4ZKTestRunner$LoggedInvokeMethod.evaluate(JUnit4ZKTestRunner.java:79)
ZooKeeper-trunk-solaris - Build # 1510 - Still Failing
Posted by Apache Jenkins Server <je...@builds.apache.org>.
See https://builds.apache.org/job/ZooKeeper-trunk-solaris/1510/
###################################################################################
########################## LAST 60 LINES OF THE CONSOLE ###########################
[...truncated 466546 lines...]
[junit] 2017-02-16 08:37:11,250 [myid:] - INFO [main:ClientBase@376] - STARTING server instance 127.0.0.1:11222
[junit] 2017-02-16 08:37:11,250 [myid:] - INFO [main:ZooKeeperServer@908] - minSessionTimeout set to 6000
[junit] 2017-02-16 08:37:11,251 [myid:] - INFO [main:ZooKeeperServer@917] - maxSessionTimeout set to 60000
[junit] 2017-02-16 08:37:11,251 [myid:] - INFO [main:ZooKeeperServer@160] - Created server with tickTime 3000 minSessionTimeout 6000 maxSessionTimeout 60000 datadir /zonestorage/hudson_solaris/home/hudson/hudson-slave/workspace/ZooKeeper-trunk-solaris/build/test/tmp/test7873774018192078359.junit.dir/version-2 snapdir /zonestorage/hudson_solaris/home/hudson/hudson-slave/workspace/ZooKeeper-trunk-solaris/build/test/tmp/test7873774018192078359.junit.dir/version-2
[junit] 2017-02-16 08:37:11,251 [myid:] - INFO [main:FileSnap@83] - Reading snapshot /zonestorage/hudson_solaris/home/hudson/hudson-slave/workspace/ZooKeeper-trunk-solaris/build/test/tmp/test7873774018192078359.junit.dir/version-2/snapshot.b
[junit] 2017-02-16 08:37:11,253 [myid:] - INFO [main:FileTxnSnapLog@346] - Snapshotting: 0xb to /zonestorage/hudson_solaris/home/hudson/hudson-slave/workspace/ZooKeeper-trunk-solaris/build/test/tmp/test7873774018192078359.junit.dir/version-2/snapshot.b
[junit] 2017-02-16 08:37:11,255 [myid:] - ERROR [main:ZooKeeperServer@506] - ZKShutdownHandler is not registered, so ZooKeeper server won't take any action on ERROR or SHUTDOWN server state changes
[junit] 2017-02-16 08:37:11,255 [myid:] - INFO [main:FourLetterWordMain@85] - connecting to 127.0.0.1 11222
[junit] 2017-02-16 08:37:11,255 [myid:] - INFO [NIOServerCxnFactory.AcceptThread:0.0.0.0/0.0.0.0:11222:NIOServerCnxnFactory$AcceptThread@296] - Accepted socket connection from /127.0.0.1:47133
[junit] 2017-02-16 08:37:11,256 [myid:] - INFO [NIOWorkerThread-1:NIOServerCnxn@485] - Processing stat command from /127.0.0.1:47133
[junit] 2017-02-16 08:37:11,256 [myid:] - INFO [NIOWorkerThread-1:StatCommand@49] - Stat command output
[junit] 2017-02-16 08:37:11,256 [myid:] - INFO [NIOWorkerThread-1:NIOServerCnxn@614] - Closed socket connection for client /127.0.0.1:47133 (no session established for client)
[junit] 2017-02-16 08:37:11,257 [myid:] - INFO [main:JMXEnv@228] - ensureParent:[InMemoryDataTree, StandaloneServer_port]
[junit] 2017-02-16 08:37:11,258 [myid:] - INFO [main:JMXEnv@245] - expect:InMemoryDataTree
[junit] 2017-02-16 08:37:11,258 [myid:] - INFO [main:JMXEnv@249] - found:InMemoryDataTree org.apache.ZooKeeperService:name0=StandaloneServer_port11222,name1=InMemoryDataTree
[junit] 2017-02-16 08:37:11,258 [myid:] - INFO [main:JMXEnv@245] - expect:StandaloneServer_port
[junit] 2017-02-16 08:37:11,258 [myid:] - INFO [main:JMXEnv@249] - found:StandaloneServer_port org.apache.ZooKeeperService:name0=StandaloneServer_port11222
[junit] 2017-02-16 08:37:11,259 [myid:] - INFO [main:JUnit4ZKTestRunner$LoggedInvokeMethod@82] - Memory used 17909
[junit] 2017-02-16 08:37:11,259 [myid:] - INFO [main:JUnit4ZKTestRunner$LoggedInvokeMethod@87] - Number of threads 24
[junit] 2017-02-16 08:37:11,259 [myid:] - INFO [main:JUnit4ZKTestRunner$LoggedInvokeMethod@102] - FINISHED TEST METHOD testQuota
[junit] 2017-02-16 08:37:11,259 [myid:] - INFO [main:ClientBase@558] - tearDown starting
[junit] 2017-02-16 08:37:11,332 [myid:] - INFO [main:ZooKeeper@1324] - Session: 0x126c30a51d20000 closed
[junit] 2017-02-16 08:37:11,332 [myid:] - INFO [main-EventThread:ClientCnxn$EventThread@513] - EventThread shut down for session: 0x126c30a51d20000
[junit] 2017-02-16 08:37:11,332 [myid:] - INFO [main:ClientBase@528] - STOPPING server
[junit] 2017-02-16 08:37:11,332 [myid:] - INFO [ConnnectionExpirer:NIOServerCnxnFactory$ConnectionExpirerThread@583] - ConnnectionExpirerThread interrupted
[junit] 2017-02-16 08:37:11,332 [myid:] - INFO [NIOServerCxnFactory.SelectorThread-1:NIOServerCnxnFactory$SelectorThread@420] - selector thread exitted run method
[junit] 2017-02-16 08:37:11,332 [myid:] - INFO [NIOServerCxnFactory.AcceptThread:0.0.0.0/0.0.0.0:11222:NIOServerCnxnFactory$AcceptThread@219] - accept thread exitted run method
[junit] 2017-02-16 08:37:11,332 [myid:] - INFO [NIOServerCxnFactory.SelectorThread-0:NIOServerCnxnFactory$SelectorThread@420] - selector thread exitted run method
[junit] 2017-02-16 08:37:11,333 [myid:] - INFO [main:ZooKeeperServer@542] - shutting down
[junit] 2017-02-16 08:37:11,333 [myid:] - ERROR [main:ZooKeeperServer@506] - ZKShutdownHandler is not registered, so ZooKeeper server won't take any action on ERROR or SHUTDOWN server state changes
[junit] 2017-02-16 08:37:11,333 [myid:] - INFO [main:SessionTrackerImpl@232] - Shutting down
[junit] 2017-02-16 08:37:11,333 [myid:] - INFO [main:PrepRequestProcessor@1008] - Shutting down
[junit] 2017-02-16 08:37:11,333 [myid:] - INFO [main:SyncRequestProcessor@191] - Shutting down
[junit] 2017-02-16 08:37:11,334 [myid:] - INFO [ProcessThread(sid:0 cport:11222)::PrepRequestProcessor@157] - PrepRequestProcessor exited loop!
[junit] 2017-02-16 08:37:11,334 [myid:] - INFO [SyncThread:0:SyncRequestProcessor@169] - SyncRequestProcessor exited!
[junit] 2017-02-16 08:37:11,334 [myid:] - INFO [main:FinalRequestProcessor@481] - shutdown of request processor complete
[junit] 2017-02-16 08:37:11,334 [myid:] - INFO [main:MBeanRegistry@128] - Unregister MBean [org.apache.ZooKeeperService:name0=StandaloneServer_port11222,name1=InMemoryDataTree]
[junit] 2017-02-16 08:37:11,334 [myid:] - INFO [main:MBeanRegistry@128] - Unregister MBean [org.apache.ZooKeeperService:name0=StandaloneServer_port11222]
[junit] 2017-02-16 08:37:11,335 [myid:] - INFO [main:FourLetterWordMain@85] - connecting to 127.0.0.1 11222
[junit] 2017-02-16 08:37:11,335 [myid:] - INFO [main:JMXEnv@146] - ensureOnly:[]
[junit] 2017-02-16 08:37:11,339 [myid:] - INFO [main:ClientBase@583] - fdcount after test is: 60 at start it was 43
[junit] 2017-02-16 08:37:11,339 [myid:] - INFO [main:ClientBase@585] - sleeping for 20 secs
[junit] 2017-02-16 08:37:11,340 [myid:] - INFO [main:ZKTestCase$1@65] - SUCCEEDED testQuota
[junit] 2017-02-16 08:37:11,340 [myid:] - INFO [main:ZKTestCase$1@60] - FINISHED testQuota
[junit] Tests run: 1, Failures: 0, Errors: 0, Time elapsed: 0.889 sec
fail.build.on.test.failure:
BUILD FAILED
/zonestorage/hudson_solaris/home/hudson/hudson-slave/workspace/ZooKeeper-trunk-solaris/build.xml:1242: The following error occurred while executing this line:
/zonestorage/hudson_solaris/home/hudson/hudson-slave/workspace/ZooKeeper-trunk-solaris/build.xml:1216: Tests failed!
Total time: 80 minutes 25 seconds
Build step 'Invoke Ant' marked build as failure
[locks-and-latches] Releasing all the locks
[locks-and-latches] All the locks released
Recording test results
Email was triggered for: Failure - Any
Sending email for trigger: Failure - Any
###################################################################################
############################## FAILED TESTS (if any) ##############################
3 tests failed.
FAILED: org.apache.zookeeper.server.quorum.StandaloneDisabledTest.startSingleServerTest
Error Message:
Timeout occurred. Please note the time in the report does not reflect the time until the timeout.
Stack Trace:
junit.framework.AssertionFailedError: Timeout occurred. Please note the time in the report does not reflect the time until the timeout.
FAILED: org.apache.zookeeper.test.ReconfigTest.testPortChangeToBlockedPortLeader
Error Message:
client could not connect to reestablished quorum: giving up after 30+ seconds.
Stack Trace:
junit.framework.AssertionFailedError: client could not connect to reestablished quorum: giving up after 30+ seconds.
at org.apache.zookeeper.test.ReconfigTest.testNormalOperation(ReconfigTest.java:183)
at org.apache.zookeeper.test.ReconfigTest.testPortChangeToBlockedPort(ReconfigTest.java:796)
at org.apache.zookeeper.test.ReconfigTest.testPortChangeToBlockedPortLeader(ReconfigTest.java:719)
at org.apache.zookeeper.JUnit4ZKTestRunner$LoggedInvokeMethod.evaluate(JUnit4ZKTestRunner.java:79)
FAILED: org.apache.zookeeper.test.ReconfigTest.testPortChangeToBlockedPortFollower
Error Message:
client could not connect to reestablished quorum: giving up after 30+ seconds.
Stack Trace:
junit.framework.AssertionFailedError: client could not connect to reestablished quorum: giving up after 30+ seconds.
at org.apache.zookeeper.test.ReconfigTest.testNormalOperation(ReconfigTest.java:183)
at org.apache.zookeeper.test.ReconfigTest.testPortChangeToBlockedPort(ReconfigTest.java:796)
at org.apache.zookeeper.test.ReconfigTest.testPortChangeToBlockedPortFollower(ReconfigTest.java:715)
at org.apache.zookeeper.JUnit4ZKTestRunner$LoggedInvokeMethod.evaluate(JUnit4ZKTestRunner.java:79)
ZooKeeper-trunk-solaris - Build # 1509 - Still Failing
Posted by Apache Jenkins Server <je...@builds.apache.org>.
See https://builds.apache.org/job/ZooKeeper-trunk-solaris/1509/
###################################################################################
########################## LAST 60 LINES OF THE CONSOLE ###########################
[...truncated 469059 lines...]
[junit] 2017-02-16 02:23:03,891 [myid:] - INFO [main:ClientBase@376] - STARTING server instance 127.0.0.1:11222
[junit] 2017-02-16 02:23:03,891 [myid:] - INFO [main:ZooKeeperServer@908] - minSessionTimeout set to 6000
[junit] 2017-02-16 02:23:03,892 [myid:] - INFO [main:ZooKeeperServer@917] - maxSessionTimeout set to 60000
[junit] 2017-02-16 02:23:03,892 [myid:] - INFO [main:ZooKeeperServer@160] - Created server with tickTime 3000 minSessionTimeout 6000 maxSessionTimeout 60000 datadir /zonestorage/hudson_solaris/home/hudson/hudson-slave/workspace/ZooKeeper-trunk-solaris/build/test/tmp/test2082144820932083031.junit.dir/version-2 snapdir /zonestorage/hudson_solaris/home/hudson/hudson-slave/workspace/ZooKeeper-trunk-solaris/build/test/tmp/test2082144820932083031.junit.dir/version-2
[junit] 2017-02-16 02:23:03,893 [myid:] - INFO [main:FileSnap@83] - Reading snapshot /zonestorage/hudson_solaris/home/hudson/hudson-slave/workspace/ZooKeeper-trunk-solaris/build/test/tmp/test2082144820932083031.junit.dir/version-2/snapshot.b
[junit] 2017-02-16 02:23:03,895 [myid:] - INFO [main:FileTxnSnapLog@346] - Snapshotting: 0xb to /zonestorage/hudson_solaris/home/hudson/hudson-slave/workspace/ZooKeeper-trunk-solaris/build/test/tmp/test2082144820932083031.junit.dir/version-2/snapshot.b
[junit] 2017-02-16 02:23:03,896 [myid:] - ERROR [main:ZooKeeperServer@506] - ZKShutdownHandler is not registered, so ZooKeeper server won't take any action on ERROR or SHUTDOWN server state changes
[junit] 2017-02-16 02:23:03,896 [myid:] - INFO [main:FourLetterWordMain@85] - connecting to 127.0.0.1 11222
[junit] 2017-02-16 02:23:03,896 [myid:] - INFO [NIOServerCxnFactory.AcceptThread:0.0.0.0/0.0.0.0:11222:NIOServerCnxnFactory$AcceptThread@296] - Accepted socket connection from /127.0.0.1:42844
[junit] 2017-02-16 02:23:03,897 [myid:] - INFO [NIOWorkerThread-1:NIOServerCnxn@485] - Processing stat command from /127.0.0.1:42844
[junit] 2017-02-16 02:23:03,897 [myid:] - INFO [NIOWorkerThread-1:StatCommand@49] - Stat command output
[junit] 2017-02-16 02:23:03,898 [myid:] - INFO [NIOWorkerThread-1:NIOServerCnxn@614] - Closed socket connection for client /127.0.0.1:42844 (no session established for client)
[junit] 2017-02-16 02:23:03,898 [myid:] - INFO [main:JMXEnv@228] - ensureParent:[InMemoryDataTree, StandaloneServer_port]
[junit] 2017-02-16 02:23:03,899 [myid:] - INFO [main:JMXEnv@245] - expect:InMemoryDataTree
[junit] 2017-02-16 02:23:03,899 [myid:] - INFO [main:JMXEnv@249] - found:InMemoryDataTree org.apache.ZooKeeperService:name0=StandaloneServer_port11222,name1=InMemoryDataTree
[junit] 2017-02-16 02:23:03,899 [myid:] - INFO [main:JMXEnv@245] - expect:StandaloneServer_port
[junit] 2017-02-16 02:23:03,900 [myid:] - INFO [main:JMXEnv@249] - found:StandaloneServer_port org.apache.ZooKeeperService:name0=StandaloneServer_port11222
[junit] 2017-02-16 02:23:03,900 [myid:] - INFO [main:JUnit4ZKTestRunner$LoggedInvokeMethod@82] - Memory used 17906
[junit] 2017-02-16 02:23:03,900 [myid:] - INFO [main:JUnit4ZKTestRunner$LoggedInvokeMethod@87] - Number of threads 24
[junit] 2017-02-16 02:23:03,900 [myid:] - INFO [main:JUnit4ZKTestRunner$LoggedInvokeMethod@102] - FINISHED TEST METHOD testQuota
[junit] 2017-02-16 02:23:03,900 [myid:] - INFO [main:ClientBase@558] - tearDown starting
[junit] 2017-02-16 02:23:03,972 [myid:] - INFO [main:ZooKeeper@1324] - Session: 0x126c1b3d4730000 closed
[junit] 2017-02-16 02:23:03,972 [myid:] - INFO [main:ClientBase@528] - STOPPING server
[junit] 2017-02-16 02:23:03,972 [myid:] - INFO [main-EventThread:ClientCnxn$EventThread@513] - EventThread shut down for session: 0x126c1b3d4730000
[junit] 2017-02-16 02:23:03,973 [myid:] - INFO [NIOServerCxnFactory.SelectorThread-1:NIOServerCnxnFactory$SelectorThread@420] - selector thread exitted run method
[junit] 2017-02-16 02:23:03,973 [myid:] - INFO [ConnnectionExpirer:NIOServerCnxnFactory$ConnectionExpirerThread@583] - ConnnectionExpirerThread interrupted
[junit] 2017-02-16 02:23:03,973 [myid:] - INFO [NIOServerCxnFactory.AcceptThread:0.0.0.0/0.0.0.0:11222:NIOServerCnxnFactory$AcceptThread@219] - accept thread exitted run method
[junit] 2017-02-16 02:23:03,973 [myid:] - INFO [NIOServerCxnFactory.SelectorThread-0:NIOServerCnxnFactory$SelectorThread@420] - selector thread exitted run method
[junit] 2017-02-16 02:23:03,974 [myid:] - INFO [main:ZooKeeperServer@542] - shutting down
[junit] 2017-02-16 02:23:03,974 [myid:] - ERROR [main:ZooKeeperServer@506] - ZKShutdownHandler is not registered, so ZooKeeper server won't take any action on ERROR or SHUTDOWN server state changes
[junit] 2017-02-16 02:23:03,974 [myid:] - INFO [main:SessionTrackerImpl@232] - Shutting down
[junit] 2017-02-16 02:23:03,974 [myid:] - INFO [main:PrepRequestProcessor@1008] - Shutting down
[junit] 2017-02-16 02:23:03,974 [myid:] - INFO [main:SyncRequestProcessor@191] - Shutting down
[junit] 2017-02-16 02:23:03,974 [myid:] - INFO [ProcessThread(sid:0 cport:11222)::PrepRequestProcessor@157] - PrepRequestProcessor exited loop!
[junit] 2017-02-16 02:23:03,975 [myid:] - INFO [SyncThread:0:SyncRequestProcessor@169] - SyncRequestProcessor exited!
[junit] 2017-02-16 02:23:03,975 [myid:] - INFO [main:FinalRequestProcessor@481] - shutdown of request processor complete
[junit] 2017-02-16 02:23:03,975 [myid:] - INFO [main:MBeanRegistry@128] - Unregister MBean [org.apache.ZooKeeperService:name0=StandaloneServer_port11222,name1=InMemoryDataTree]
[junit] 2017-02-16 02:23:03,975 [myid:] - INFO [main:MBeanRegistry@128] - Unregister MBean [org.apache.ZooKeeperService:name0=StandaloneServer_port11222]
[junit] 2017-02-16 02:23:03,976 [myid:] - INFO [main:FourLetterWordMain@85] - connecting to 127.0.0.1 11222
[junit] 2017-02-16 02:23:03,976 [myid:] - INFO [main:JMXEnv@146] - ensureOnly:[]
[junit] 2017-02-16 02:23:03,990 [myid:] - INFO [main:ClientBase@583] - fdcount after test is: 60 at start it was 43
[junit] 2017-02-16 02:23:03,990 [myid:] - INFO [main:ClientBase@585] - sleeping for 20 secs
[junit] 2017-02-16 02:23:03,991 [myid:] - INFO [main:ZKTestCase$1@65] - SUCCEEDED testQuota
[junit] 2017-02-16 02:23:03,991 [myid:] - INFO [main:ZKTestCase$1@60] - FINISHED testQuota
[junit] Tests run: 1, Failures: 0, Errors: 0, Time elapsed: 6.703 sec
fail.build.on.test.failure:
BUILD FAILED
/zonestorage/hudson_solaris/home/hudson/hudson-slave/workspace/ZooKeeper-trunk-solaris/build.xml:1242: The following error occurred while executing this line:
/zonestorage/hudson_solaris/home/hudson/hudson-slave/workspace/ZooKeeper-trunk-solaris/build.xml:1216: Tests failed!
Total time: 66 minutes 30 seconds
Build step 'Invoke Ant' marked build as failure
[locks-and-latches] Releasing all the locks
[locks-and-latches] All the locks released
Recording test results
Email was triggered for: Failure - Any
Sending email for trigger: Failure - Any
###################################################################################
############################## FAILED TESTS (if any) ##############################
2 tests failed.
FAILED: org.apache.zookeeper.test.ReconfigTest.testPortChangeToBlockedPortLeader
Error Message:
client could not connect to reestablished quorum: giving up after 30+ seconds.
Stack Trace:
junit.framework.AssertionFailedError: client could not connect to reestablished quorum: giving up after 30+ seconds.
at org.apache.zookeeper.test.ReconfigTest.testNormalOperation(ReconfigTest.java:183)
at org.apache.zookeeper.test.ReconfigTest.testPortChangeToBlockedPort(ReconfigTest.java:796)
at org.apache.zookeeper.test.ReconfigTest.testPortChangeToBlockedPortLeader(ReconfigTest.java:719)
at org.apache.zookeeper.JUnit4ZKTestRunner$LoggedInvokeMethod.evaluate(JUnit4ZKTestRunner.java:79)
FAILED: org.apache.zookeeper.test.ReconfigTest.testPortChangeToBlockedPortFollower
Error Message:
client could not connect to reestablished quorum: giving up after 30+ seconds.
Stack Trace:
junit.framework.AssertionFailedError: client could not connect to reestablished quorum: giving up after 30+ seconds.
at org.apache.zookeeper.test.ReconfigTest.testNormalOperation(ReconfigTest.java:183)
at org.apache.zookeeper.test.ReconfigTest.testPortChangeToBlockedPort(ReconfigTest.java:796)
at org.apache.zookeeper.test.ReconfigTest.testPortChangeToBlockedPortFollower(ReconfigTest.java:715)
at org.apache.zookeeper.JUnit4ZKTestRunner$LoggedInvokeMethod.evaluate(JUnit4ZKTestRunner.java:79)
ZooKeeper-trunk-solaris - Build # 1508 - Still Failing
Posted by Apache Jenkins Server <je...@builds.apache.org>.
See https://builds.apache.org/job/ZooKeeper-trunk-solaris/1508/
###################################################################################
########################## LAST 60 LINES OF THE CONSOLE ###########################
[...truncated 473162 lines...]
[junit] 2017-02-15 18:24:34,506 [myid:] - INFO [main:ClientBase@376] - STARTING server instance 127.0.0.1:11222
[junit] 2017-02-15 18:24:34,507 [myid:] - INFO [main:ZooKeeperServer@908] - minSessionTimeout set to 6000
[junit] 2017-02-15 18:24:34,507 [myid:] - INFO [main:ZooKeeperServer@917] - maxSessionTimeout set to 60000
[junit] 2017-02-15 18:24:34,507 [myid:] - INFO [main:ZooKeeperServer@160] - Created server with tickTime 3000 minSessionTimeout 6000 maxSessionTimeout 60000 datadir /zonestorage/hudson_solaris/home/hudson/hudson-slave/workspace/ZooKeeper-trunk-solaris/build/test/tmp/test3416908710221408693.junit.dir/version-2 snapdir /zonestorage/hudson_solaris/home/hudson/hudson-slave/workspace/ZooKeeper-trunk-solaris/build/test/tmp/test3416908710221408693.junit.dir/version-2
[junit] 2017-02-15 18:24:34,508 [myid:] - INFO [main:FileSnap@83] - Reading snapshot /zonestorage/hudson_solaris/home/hudson/hudson-slave/workspace/ZooKeeper-trunk-solaris/build/test/tmp/test3416908710221408693.junit.dir/version-2/snapshot.b
[junit] 2017-02-15 18:24:34,510 [myid:] - INFO [main:FileTxnSnapLog@346] - Snapshotting: 0xb to /zonestorage/hudson_solaris/home/hudson/hudson-slave/workspace/ZooKeeper-trunk-solaris/build/test/tmp/test3416908710221408693.junit.dir/version-2/snapshot.b
[junit] 2017-02-15 18:24:34,511 [myid:] - ERROR [main:ZooKeeperServer@506] - ZKShutdownHandler is not registered, so ZooKeeper server won't take any action on ERROR or SHUTDOWN server state changes
[junit] 2017-02-15 18:24:34,511 [myid:] - INFO [main:FourLetterWordMain@85] - connecting to 127.0.0.1 11222
[junit] 2017-02-15 18:24:34,512 [myid:] - INFO [NIOServerCxnFactory.AcceptThread:0.0.0.0/0.0.0.0:11222:NIOServerCnxnFactory$AcceptThread@296] - Accepted socket connection from /127.0.0.1:44717
[junit] 2017-02-15 18:24:34,512 [myid:] - INFO [NIOWorkerThread-1:NIOServerCnxn@485] - Processing stat command from /127.0.0.1:44717
[junit] 2017-02-15 18:24:34,513 [myid:] - INFO [NIOWorkerThread-1:StatCommand@49] - Stat command output
[junit] 2017-02-15 18:24:34,513 [myid:] - INFO [NIOWorkerThread-1:NIOServerCnxn@614] - Closed socket connection for client /127.0.0.1:44717 (no session established for client)
[junit] 2017-02-15 18:24:34,513 [myid:] - INFO [main:JMXEnv@228] - ensureParent:[InMemoryDataTree, StandaloneServer_port]
[junit] 2017-02-15 18:24:34,514 [myid:] - INFO [main:JMXEnv@245] - expect:InMemoryDataTree
[junit] 2017-02-15 18:24:34,514 [myid:] - INFO [main:JMXEnv@249] - found:InMemoryDataTree org.apache.ZooKeeperService:name0=StandaloneServer_port11222,name1=InMemoryDataTree
[junit] 2017-02-15 18:24:34,515 [myid:] - INFO [main:JMXEnv@245] - expect:StandaloneServer_port
[junit] 2017-02-15 18:24:34,515 [myid:] - INFO [main:JMXEnv@249] - found:StandaloneServer_port org.apache.ZooKeeperService:name0=StandaloneServer_port11222
[junit] 2017-02-15 18:24:34,515 [myid:] - INFO [main:JUnit4ZKTestRunner$LoggedInvokeMethod@82] - Memory used 17904
[junit] 2017-02-15 18:24:34,515 [myid:] - INFO [main:JUnit4ZKTestRunner$LoggedInvokeMethod@87] - Number of threads 24
[junit] 2017-02-15 18:24:34,515 [myid:] - INFO [main:JUnit4ZKTestRunner$LoggedInvokeMethod@102] - FINISHED TEST METHOD testQuota
[junit] 2017-02-15 18:24:34,515 [myid:] - INFO [main:ClientBase@558] - tearDown starting
[junit] 2017-02-15 18:24:34,592 [myid:] - INFO [main:ZooKeeper@1324] - Session: 0x126bffdc2f60000 closed
[junit] 2017-02-15 18:24:34,592 [myid:] - INFO [main-EventThread:ClientCnxn$EventThread@513] - EventThread shut down for session: 0x126bffdc2f60000
[junit] 2017-02-15 18:24:34,592 [myid:] - INFO [main:ClientBase@528] - STOPPING server
[junit] 2017-02-15 18:24:34,593 [myid:] - INFO [NIOServerCxnFactory.AcceptThread:0.0.0.0/0.0.0.0:11222:NIOServerCnxnFactory$AcceptThread@219] - accept thread exitted run method
[junit] 2017-02-15 18:24:34,593 [myid:] - INFO [ConnnectionExpirer:NIOServerCnxnFactory$ConnectionExpirerThread@583] - ConnnectionExpirerThread interrupted
[junit] 2017-02-15 18:24:34,593 [myid:] - INFO [NIOServerCxnFactory.SelectorThread-0:NIOServerCnxnFactory$SelectorThread@420] - selector thread exitted run method
[junit] 2017-02-15 18:24:34,593 [myid:] - INFO [NIOServerCxnFactory.SelectorThread-1:NIOServerCnxnFactory$SelectorThread@420] - selector thread exitted run method
[junit] 2017-02-15 18:24:34,593 [myid:] - INFO [main:ZooKeeperServer@542] - shutting down
[junit] 2017-02-15 18:24:34,593 [myid:] - ERROR [main:ZooKeeperServer@506] - ZKShutdownHandler is not registered, so ZooKeeper server won't take any action on ERROR or SHUTDOWN server state changes
[junit] 2017-02-15 18:24:34,593 [myid:] - INFO [main:SessionTrackerImpl@232] - Shutting down
[junit] 2017-02-15 18:24:34,594 [myid:] - INFO [main:PrepRequestProcessor@1008] - Shutting down
[junit] 2017-02-15 18:24:34,594 [myid:] - INFO [main:SyncRequestProcessor@191] - Shutting down
[junit] 2017-02-15 18:24:34,594 [myid:] - INFO [ProcessThread(sid:0 cport:11222)::PrepRequestProcessor@157] - PrepRequestProcessor exited loop!
[junit] 2017-02-15 18:24:34,594 [myid:] - INFO [SyncThread:0:SyncRequestProcessor@169] - SyncRequestProcessor exited!
[junit] 2017-02-15 18:24:34,594 [myid:] - INFO [main:FinalRequestProcessor@481] - shutdown of request processor complete
[junit] 2017-02-15 18:24:34,594 [myid:] - INFO [main:MBeanRegistry@128] - Unregister MBean [org.apache.ZooKeeperService:name0=StandaloneServer_port11222,name1=InMemoryDataTree]
[junit] 2017-02-15 18:24:34,595 [myid:] - INFO [main:MBeanRegistry@128] - Unregister MBean [org.apache.ZooKeeperService:name0=StandaloneServer_port11222]
[junit] 2017-02-15 18:24:34,595 [myid:] - INFO [main:FourLetterWordMain@85] - connecting to 127.0.0.1 11222
[junit] 2017-02-15 18:24:34,595 [myid:] - INFO [main:JMXEnv@146] - ensureOnly:[]
[junit] 2017-02-15 18:24:34,600 [myid:] - INFO [main:ClientBase@583] - fdcount after test is: 60 at start it was 43
[junit] 2017-02-15 18:24:34,600 [myid:] - INFO [main:ClientBase@585] - sleeping for 20 secs
[junit] 2017-02-15 18:24:34,601 [myid:] - INFO [main:ZKTestCase$1@65] - SUCCEEDED testQuota
[junit] 2017-02-15 18:24:34,601 [myid:] - INFO [main:ZKTestCase$1@60] - FINISHED testQuota
[junit] Tests run: 1, Failures: 0, Errors: 0, Time elapsed: 1.07 sec
fail.build.on.test.failure:
BUILD FAILED
/zonestorage/hudson_solaris/home/hudson/hudson-slave/workspace/ZooKeeper-trunk-solaris/build.xml:1242: The following error occurred while executing this line:
/zonestorage/hudson_solaris/home/hudson/hudson-slave/workspace/ZooKeeper-trunk-solaris/build.xml:1216: Tests failed!
Total time: 66 minutes 31 seconds
Build step 'Invoke Ant' marked build as failure
[locks-and-latches] Releasing all the locks
[locks-and-latches] All the locks released
Recording test results
Email was triggered for: Failure - Any
Sending email for trigger: Failure - Any
###################################################################################
############################## FAILED TESTS (if any) ##############################
3 tests failed.
FAILED: org.apache.zookeeper.test.ReadOnlyModeTest.testSessionEstablishment
Error Message:
KeeperErrorCode = ConnectionLoss for /test
Stack Trace:
org.apache.zookeeper.KeeperException$ConnectionLossException: KeeperErrorCode = ConnectionLoss for /test
at org.apache.zookeeper.KeeperException.create(KeeperException.java:99)
at org.apache.zookeeper.KeeperException.create(KeeperException.java:51)
at org.apache.zookeeper.ZooKeeper.create(ZooKeeper.java:1424)
at org.apache.zookeeper.test.ReadOnlyModeTest.testSessionEstablishment(ReadOnlyModeTest.java:238)
at org.apache.zookeeper.JUnit4ZKTestRunner$LoggedInvokeMethod.evaluate(JUnit4ZKTestRunner.java:79)
at java.util.concurrent.FutureTask.run(FutureTask.java:262)
at java.lang.Thread.run(Thread.java:745)
FAILED: org.apache.zookeeper.test.ReconfigTest.testPortChangeToBlockedPortLeader
Error Message:
client could not connect to reestablished quorum: giving up after 30+ seconds.
Stack Trace:
junit.framework.AssertionFailedError: client could not connect to reestablished quorum: giving up after 30+ seconds.
at org.apache.zookeeper.test.ReconfigTest.testNormalOperation(ReconfigTest.java:183)
at org.apache.zookeeper.test.ReconfigTest.testPortChangeToBlockedPort(ReconfigTest.java:796)
at org.apache.zookeeper.test.ReconfigTest.testPortChangeToBlockedPortLeader(ReconfigTest.java:719)
at org.apache.zookeeper.JUnit4ZKTestRunner$LoggedInvokeMethod.evaluate(JUnit4ZKTestRunner.java:79)
FAILED: org.apache.zookeeper.test.ReconfigTest.testPortChangeToBlockedPortFollower
Error Message:
client could not connect to reestablished quorum: giving up after 30+ seconds.
Stack Trace:
junit.framework.AssertionFailedError: client could not connect to reestablished quorum: giving up after 30+ seconds.
at org.apache.zookeeper.test.ReconfigTest.testNormalOperation(ReconfigTest.java:183)
at org.apache.zookeeper.test.ReconfigTest.testPortChangeToBlockedPort(ReconfigTest.java:796)
at org.apache.zookeeper.test.ReconfigTest.testPortChangeToBlockedPortFollower(ReconfigTest.java:715)
at org.apache.zookeeper.JUnit4ZKTestRunner$LoggedInvokeMethod.evaluate(JUnit4ZKTestRunner.java:79)
ZooKeeper-trunk-solaris - Build # 1507 - Still Failing
Posted by Apache Jenkins Server <je...@builds.apache.org>.
See https://builds.apache.org/job/ZooKeeper-trunk-solaris/1507/
###################################################################################
########################## LAST 60 LINES OF THE CONSOLE ###########################
[...truncated 535652 lines...]
[junit] 2017-02-15 08:50:41,408 [myid:] - INFO [main:JMXEnv@245] - expect:InMemoryDataTree
[junit] 2017-02-15 08:50:41,408 [myid:] - INFO [main:JMXEnv@249] - found:InMemoryDataTree org.apache.ZooKeeperService:name0=StandaloneServer_port11222,name1=InMemoryDataTree
[junit] 2017-02-15 08:50:41,408 [myid:] - INFO [main:JMXEnv@245] - expect:StandaloneServer_port
[junit] 2017-02-15 08:50:41,408 [myid:] - INFO [main:JMXEnv@249] - found:StandaloneServer_port org.apache.ZooKeeperService:name0=StandaloneServer_port11222
[junit] 2017-02-15 08:50:41,408 [myid:] - INFO [main:JUnit4ZKTestRunner$LoggedInvokeMethod@82] - Memory used 17906
[junit] 2017-02-15 08:50:41,409 [myid:] - INFO [main:JUnit4ZKTestRunner$LoggedInvokeMethod@87] - Number of threads 24
[junit] 2017-02-15 08:50:41,409 [myid:] - INFO [main:JUnit4ZKTestRunner$LoggedInvokeMethod@102] - FINISHED TEST METHOD testQuota
[junit] 2017-02-15 08:50:41,409 [myid:] - INFO [main:ClientBase@558] - tearDown starting
[junit] 2017-02-15 08:50:42,671 [myid:127.0.0.1:11222] - INFO [main-SendThread(127.0.0.1:11222):ClientCnxn$SendThread@1113] - Opening socket connection to server 127.0.0.1/127.0.0.1:11222. Will not attempt to authenticate using SASL (unknown error)
[junit] 2017-02-15 08:50:42,671 [myid:127.0.0.1:11222] - INFO [main-SendThread(127.0.0.1:11222):ClientCnxn$SendThread@948] - Socket connection established, initiating session, client: null, server: null
[junit] 2017-02-15 08:50:42,672 [myid:] - INFO [NIOServerCxnFactory.AcceptThread:0.0.0.0/0.0.0.0:11222:NIOServerCnxnFactory$AcceptThread@296] - Accepted socket connection from /127.0.0.1:62934
[junit] 2017-02-15 08:50:42,673 [myid:] - INFO [NIOWorkerThread-2:ZooKeeperServer@1019] - Client attempting to renew session 0x126bdf041cf0000 at /127.0.0.1:62934
[junit] 2017-02-15 08:50:42,674 [myid:] - INFO [NIOWorkerThread-2:ZooKeeperServer@728] - Established session 0x126bdf041cf0000 with negotiated timeout 30000 for client /127.0.0.1:62934
[junit] 2017-02-15 08:50:42,674 [myid:127.0.0.1:11222] - INFO [main-SendThread(127.0.0.1:11222):ClientCnxn$SendThread@1381] - Session establishment complete on server null, sessionid = 0x126bdf041cf0000, negotiated timeout = 30000
[junit] 2017-02-15 08:50:42,675 [myid:] - INFO [ProcessThread(sid:0 cport:11222)::PrepRequestProcessor@617] - Processed session termination for sessionid: 0x126bdf041cf0000
[junit] 2017-02-15 08:50:42,675 [myid:] - INFO [SyncThread:0:FileTxnLog@204] - Creating new log file: log.c
[junit] 2017-02-15 08:50:42,728 [myid:] - INFO [NIOWorkerThread-5:MBeanRegistry@128] - Unregister MBean [org.apache.ZooKeeperService:name0=StandaloneServer_port11222,name1=Connections,name2=127.0.0.1,name3=0x126bdf041cf0000]
[junit] 2017-02-15 08:50:42,728 [myid:] - INFO [main-EventThread:ClientCnxn$EventThread@513] - EventThread shut down for session: 0x126bdf041cf0000
[junit] 2017-02-15 08:50:42,728 [myid:] - INFO [main:ZooKeeper@1324] - Session: 0x126bdf041cf0000 closed
[junit] 2017-02-15 08:50:42,729 [myid:] - INFO [NIOWorkerThread-5:NIOServerCnxn@614] - Closed socket connection for client /127.0.0.1:62934 which had sessionid 0x126bdf041cf0000
[junit] 2017-02-15 08:50:42,729 [myid:] - INFO [main:ClientBase@528] - STOPPING server
[junit] 2017-02-15 08:50:42,730 [myid:] - INFO [ConnnectionExpirer:NIOServerCnxnFactory$ConnectionExpirerThread@583] - ConnnectionExpirerThread interrupted
[junit] 2017-02-15 08:50:42,730 [myid:] - INFO [NIOServerCxnFactory.AcceptThread:0.0.0.0/0.0.0.0:11222:NIOServerCnxnFactory$AcceptThread@219] - accept thread exitted run method
[junit] 2017-02-15 08:50:42,730 [myid:] - INFO [NIOServerCxnFactory.SelectorThread-1:NIOServerCnxnFactory$SelectorThread@420] - selector thread exitted run method
[junit] 2017-02-15 08:50:42,730 [myid:] - INFO [NIOServerCxnFactory.SelectorThread-0:NIOServerCnxnFactory$SelectorThread@420] - selector thread exitted run method
[junit] 2017-02-15 08:50:42,731 [myid:] - INFO [main:ZooKeeperServer@542] - shutting down
[junit] 2017-02-15 08:50:42,731 [myid:] - ERROR [main:ZooKeeperServer@506] - ZKShutdownHandler is not registered, so ZooKeeper server won't take any action on ERROR or SHUTDOWN server state changes
[junit] 2017-02-15 08:50:42,731 [myid:] - INFO [main:SessionTrackerImpl@232] - Shutting down
[junit] 2017-02-15 08:50:42,731 [myid:] - INFO [main:PrepRequestProcessor@1008] - Shutting down
[junit] 2017-02-15 08:50:42,731 [myid:] - INFO [main:SyncRequestProcessor@191] - Shutting down
[junit] 2017-02-15 08:50:42,731 [myid:] - INFO [ProcessThread(sid:0 cport:11222)::PrepRequestProcessor@157] - PrepRequestProcessor exited loop!
[junit] 2017-02-15 08:50:42,732 [myid:] - INFO [SyncThread:0:SyncRequestProcessor@169] - SyncRequestProcessor exited!
[junit] 2017-02-15 08:50:42,732 [myid:] - INFO [main:FinalRequestProcessor@481] - shutdown of request processor complete
[junit] 2017-02-15 08:50:42,732 [myid:] - INFO [main:MBeanRegistry@128] - Unregister MBean [org.apache.ZooKeeperService:name0=StandaloneServer_port11222,name1=InMemoryDataTree]
[junit] 2017-02-15 08:50:42,732 [myid:] - INFO [main:MBeanRegistry@128] - Unregister MBean [org.apache.ZooKeeperService:name0=StandaloneServer_port11222]
[junit] 2017-02-15 08:50:42,733 [myid:] - INFO [main:FourLetterWordMain@85] - connecting to 127.0.0.1 11222
[junit] 2017-02-15 08:50:42,733 [myid:] - INFO [main:JMXEnv@146] - ensureOnly:[]
[junit] 2017-02-15 08:50:42,957 [myid:] - INFO [main:ClientBase@583] - fdcount after test is: 57 at start it was 43
[junit] 2017-02-15 08:50:42,957 [myid:] - INFO [main:ClientBase@585] - sleeping for 20 secs
[junit] 2017-02-15 08:50:43,057 [myid:] - INFO [main:ZKTestCase$1@65] - SUCCEEDED testQuota
[junit] 2017-02-15 08:50:43,057 [myid:] - INFO [main:ZKTestCase$1@60] - FINISHED testQuota
[junit] 2017-02-15 08:50:43,261 [myid:] - INFO [SessionTracker:SessionTrackerImpl@158] - SessionTrackerImpl exited loop!
[junit] 2017-02-15 08:50:43,261 [myid:] - INFO [SessionTracker:SessionTrackerImpl@158] - SessionTrackerImpl exited loop!
[junit] 2017-02-15 08:50:43,261 [myid:] - INFO [SessionTracker:SessionTrackerImpl@158] - SessionTrackerImpl exited loop!
[junit] Tests run: 1, Failures: 0, Errors: 0, Time elapsed: 17.876 sec
fail.build.on.test.failure:
BUILD FAILED
/zonestorage/hudson_solaris/home/hudson/hudson-slave/workspace/ZooKeeper-trunk-solaris/build.xml:1242: The following error occurred while executing this line:
/zonestorage/hudson_solaris/home/hudson/hudson-slave/workspace/ZooKeeper-trunk-solaris/build.xml:1216: Tests failed!
Total time: 91 minutes 15 seconds
Build step 'Invoke Ant' marked build as failure
[locks-and-latches] Releasing all the locks
[locks-and-latches] All the locks released
Recording test results
Email was triggered for: Failure - Any
Sending email for trigger: Failure - Any
###################################################################################
############################## FAILED TESTS (if any) ##############################
2 tests failed.
FAILED: org.apache.zookeeper.test.ReconfigTest.testJMXBeanAfterRoleChange
Error Message:
Timeout occurred. Please note the time in the report does not reflect the time until the timeout.
Stack Trace:
junit.framework.AssertionFailedError: Timeout occurred. Please note the time in the report does not reflect the time until the timeout.
FAILED: org.apache.zookeeper.test.SSLTest.testSecureQuorumServer
Error Message:
waiting for server 0 being up
Stack Trace:
junit.framework.AssertionFailedError: waiting for server 0 being up
at org.apache.zookeeper.test.SSLTest.testSecureQuorumServer(SSLTest.java:96)
at org.apache.zookeeper.JUnit4ZKTestRunner$LoggedInvokeMethod.evaluate(JUnit4ZKTestRunner.java:79)
ZooKeeper-trunk-solaris - Build # 1506 - Still Failing
Posted by Apache Jenkins Server <je...@builds.apache.org>.
See https://builds.apache.org/job/ZooKeeper-trunk-solaris/1506/
###################################################################################
########################## LAST 60 LINES OF THE CONSOLE ###########################
[...truncated 473737 lines...]
[junit] 2017-02-14 08:25:17,261 [myid:] - INFO [main:ClientBase@376] - STARTING server instance 127.0.0.1:11222
[junit] 2017-02-14 08:25:17,261 [myid:] - INFO [main:ZooKeeperServer@908] - minSessionTimeout set to 6000
[junit] 2017-02-14 08:25:17,261 [myid:] - INFO [main:ZooKeeperServer@917] - maxSessionTimeout set to 60000
[junit] 2017-02-14 08:25:17,262 [myid:] - INFO [main:ZooKeeperServer@160] - Created server with tickTime 3000 minSessionTimeout 6000 maxSessionTimeout 60000 datadir /zonestorage/hudson_solaris/home/hudson/hudson-slave/workspace/ZooKeeper-trunk-solaris/build/test/tmp/test7540179695344657669.junit.dir/version-2 snapdir /zonestorage/hudson_solaris/home/hudson/hudson-slave/workspace/ZooKeeper-trunk-solaris/build/test/tmp/test7540179695344657669.junit.dir/version-2
[junit] 2017-02-14 08:25:17,262 [myid:] - INFO [main:FileSnap@83] - Reading snapshot /zonestorage/hudson_solaris/home/hudson/hudson-slave/workspace/ZooKeeper-trunk-solaris/build/test/tmp/test7540179695344657669.junit.dir/version-2/snapshot.b
[junit] 2017-02-14 08:25:17,265 [myid:] - INFO [main:FileTxnSnapLog@346] - Snapshotting: 0xb to /zonestorage/hudson_solaris/home/hudson/hudson-slave/workspace/ZooKeeper-trunk-solaris/build/test/tmp/test7540179695344657669.junit.dir/version-2/snapshot.b
[junit] 2017-02-14 08:25:17,266 [myid:] - ERROR [main:ZooKeeperServer@506] - ZKShutdownHandler is not registered, so ZooKeeper server won't take any action on ERROR or SHUTDOWN server state changes
[junit] 2017-02-14 08:25:17,266 [myid:] - INFO [main:FourLetterWordMain@85] - connecting to 127.0.0.1 11222
[junit] 2017-02-14 08:25:17,267 [myid:] - INFO [NIOServerCxnFactory.AcceptThread:0.0.0.0/0.0.0.0:11222:NIOServerCnxnFactory$AcceptThread@296] - Accepted socket connection from /127.0.0.1:56485
[junit] 2017-02-14 08:25:17,269 [myid:] - INFO [NIOWorkerThread-1:NIOServerCnxn@485] - Processing stat command from /127.0.0.1:56485
[junit] 2017-02-14 08:25:17,269 [myid:] - INFO [NIOWorkerThread-1:StatCommand@49] - Stat command output
[junit] 2017-02-14 08:25:17,269 [myid:] - INFO [NIOWorkerThread-1:NIOServerCnxn@614] - Closed socket connection for client /127.0.0.1:56485 (no session established for client)
[junit] 2017-02-14 08:25:17,270 [myid:] - INFO [main:JMXEnv@228] - ensureParent:[InMemoryDataTree, StandaloneServer_port]
[junit] 2017-02-14 08:25:17,273 [myid:] - INFO [main:JMXEnv@245] - expect:InMemoryDataTree
[junit] 2017-02-14 08:25:17,274 [myid:] - INFO [main:JMXEnv@249] - found:InMemoryDataTree org.apache.ZooKeeperService:name0=StandaloneServer_port11222,name1=InMemoryDataTree
[junit] 2017-02-14 08:25:17,274 [myid:] - INFO [main:JMXEnv@245] - expect:StandaloneServer_port
[junit] 2017-02-14 08:25:17,274 [myid:] - INFO [main:JMXEnv@249] - found:StandaloneServer_port org.apache.ZooKeeperService:name0=StandaloneServer_port11222
[junit] 2017-02-14 08:25:17,274 [myid:] - INFO [main:JUnit4ZKTestRunner$LoggedInvokeMethod@82] - Memory used 17904
[junit] 2017-02-14 08:25:17,274 [myid:] - INFO [main:JUnit4ZKTestRunner$LoggedInvokeMethod@87] - Number of threads 24
[junit] 2017-02-14 08:25:17,275 [myid:] - INFO [main:JUnit4ZKTestRunner$LoggedInvokeMethod@102] - FINISHED TEST METHOD testQuota
[junit] 2017-02-14 08:25:17,275 [myid:] - INFO [main:ClientBase@558] - tearDown starting
[junit] 2017-02-14 08:25:17,352 [myid:] - INFO [main:ZooKeeper@1324] - Session: 0x126b8b2b4cf0000 closed
[junit] 2017-02-14 08:25:17,352 [myid:] - INFO [main:ClientBase@528] - STOPPING server
[junit] 2017-02-14 08:25:17,352 [myid:] - INFO [main-EventThread:ClientCnxn$EventThread@513] - EventThread shut down for session: 0x126b8b2b4cf0000
[junit] 2017-02-14 08:25:17,353 [myid:] - INFO [ConnnectionExpirer:NIOServerCnxnFactory$ConnectionExpirerThread@583] - ConnnectionExpirerThread interrupted
[junit] 2017-02-14 08:25:17,353 [myid:] - INFO [NIOServerCxnFactory.SelectorThread-0:NIOServerCnxnFactory$SelectorThread@420] - selector thread exitted run method
[junit] 2017-02-14 08:25:17,353 [myid:] - INFO [NIOServerCxnFactory.AcceptThread:0.0.0.0/0.0.0.0:11222:NIOServerCnxnFactory$AcceptThread@219] - accept thread exitted run method
[junit] 2017-02-14 08:25:17,353 [myid:] - INFO [NIOServerCxnFactory.SelectorThread-1:NIOServerCnxnFactory$SelectorThread@420] - selector thread exitted run method
[junit] 2017-02-14 08:25:17,353 [myid:] - INFO [main:ZooKeeperServer@542] - shutting down
[junit] 2017-02-14 08:25:17,353 [myid:] - ERROR [main:ZooKeeperServer@506] - ZKShutdownHandler is not registered, so ZooKeeper server won't take any action on ERROR or SHUTDOWN server state changes
[junit] 2017-02-14 08:25:17,354 [myid:] - INFO [main:SessionTrackerImpl@232] - Shutting down
[junit] 2017-02-14 08:25:17,354 [myid:] - INFO [main:PrepRequestProcessor@1008] - Shutting down
[junit] 2017-02-14 08:25:17,354 [myid:] - INFO [main:SyncRequestProcessor@191] - Shutting down
[junit] 2017-02-14 08:25:17,354 [myid:] - INFO [ProcessThread(sid:0 cport:11222)::PrepRequestProcessor@157] - PrepRequestProcessor exited loop!
[junit] 2017-02-14 08:25:17,354 [myid:] - INFO [SyncThread:0:SyncRequestProcessor@169] - SyncRequestProcessor exited!
[junit] 2017-02-14 08:25:17,354 [myid:] - INFO [main:FinalRequestProcessor@481] - shutdown of request processor complete
[junit] 2017-02-14 08:25:17,355 [myid:] - INFO [main:MBeanRegistry@128] - Unregister MBean [org.apache.ZooKeeperService:name0=StandaloneServer_port11222,name1=InMemoryDataTree]
[junit] 2017-02-14 08:25:17,355 [myid:] - INFO [main:MBeanRegistry@128] - Unregister MBean [org.apache.ZooKeeperService:name0=StandaloneServer_port11222]
[junit] 2017-02-14 08:25:17,355 [myid:] - INFO [main:FourLetterWordMain@85] - connecting to 127.0.0.1 11222
[junit] 2017-02-14 08:25:17,355 [myid:] - INFO [main:JMXEnv@146] - ensureOnly:[]
[junit] 2017-02-14 08:25:17,360 [myid:] - INFO [main:ClientBase@583] - fdcount after test is: 60 at start it was 43
[junit] 2017-02-14 08:25:17,360 [myid:] - INFO [main:ClientBase@585] - sleeping for 20 secs
[junit] 2017-02-14 08:25:17,361 [myid:] - INFO [main:ZKTestCase$1@65] - SUCCEEDED testQuota
[junit] 2017-02-14 08:25:17,362 [myid:] - INFO [main:ZKTestCase$1@60] - FINISHED testQuota
[junit] Tests run: 1, Failures: 0, Errors: 0, Time elapsed: 3.254 sec
fail.build.on.test.failure:
BUILD FAILED
/zonestorage/hudson_solaris/home/hudson/hudson-slave/workspace/ZooKeeper-trunk-solaris/build.xml:1242: The following error occurred while executing this line:
/zonestorage/hudson_solaris/home/hudson/hudson-slave/workspace/ZooKeeper-trunk-solaris/build.xml:1216: Tests failed!
Total time: 68 minutes 51 seconds
Build step 'Invoke Ant' marked build as failure
[locks-and-latches] Releasing all the locks
[locks-and-latches] All the locks released
Recording test results
Email was triggered for: Failure - Any
Sending email for trigger: Failure - Any
###################################################################################
############################## FAILED TESTS (if any) ##############################
2 tests failed.
FAILED: org.apache.zookeeper.test.ReconfigTest.testPortChangeToBlockedPortLeader
Error Message:
client could not connect to reestablished quorum: giving up after 30+ seconds.
Stack Trace:
junit.framework.AssertionFailedError: client could not connect to reestablished quorum: giving up after 30+ seconds.
at org.apache.zookeeper.test.ReconfigTest.testNormalOperation(ReconfigTest.java:183)
at org.apache.zookeeper.test.ReconfigTest.testPortChangeToBlockedPort(ReconfigTest.java:796)
at org.apache.zookeeper.test.ReconfigTest.testPortChangeToBlockedPortLeader(ReconfigTest.java:719)
at org.apache.zookeeper.JUnit4ZKTestRunner$LoggedInvokeMethod.evaluate(JUnit4ZKTestRunner.java:79)
FAILED: org.apache.zookeeper.test.ReconfigTest.testPortChangeToBlockedPortFollower
Error Message:
client could not connect to reestablished quorum: giving up after 30+ seconds.
Stack Trace:
junit.framework.AssertionFailedError: client could not connect to reestablished quorum: giving up after 30+ seconds.
at org.apache.zookeeper.test.ReconfigTest.testNormalOperation(ReconfigTest.java:183)
at org.apache.zookeeper.test.ReconfigTest.testPortChangeToBlockedPort(ReconfigTest.java:796)
at org.apache.zookeeper.test.ReconfigTest.testPortChangeToBlockedPortFollower(ReconfigTest.java:715)
at org.apache.zookeeper.JUnit4ZKTestRunner$LoggedInvokeMethod.evaluate(JUnit4ZKTestRunner.java:79)
ZooKeeper-trunk-solaris - Build # 1505 - Still Failing
Posted by Apache Jenkins Server <je...@builds.apache.org>.
See https://builds.apache.org/job/ZooKeeper-trunk-solaris/1505/
###################################################################################
########################## LAST 60 LINES OF THE CONSOLE ###########################
[...truncated 472408 lines...]
[junit] 2017-02-14 05:50:36,898 [myid:] - INFO [main:ClientBase@376] - STARTING server instance 127.0.0.1:11222
[junit] 2017-02-14 05:50:36,899 [myid:] - INFO [main:ZooKeeperServer@908] - minSessionTimeout set to 6000
[junit] 2017-02-14 05:50:36,899 [myid:] - INFO [main:ZooKeeperServer@917] - maxSessionTimeout set to 60000
[junit] 2017-02-14 05:50:36,899 [myid:] - INFO [main:ZooKeeperServer@160] - Created server with tickTime 3000 minSessionTimeout 6000 maxSessionTimeout 60000 datadir /zonestorage/hudson_solaris/home/hudson/hudson-slave/workspace/ZooKeeper-trunk-solaris/build/test/tmp/test2394915992578299615.junit.dir/version-2 snapdir /zonestorage/hudson_solaris/home/hudson/hudson-slave/workspace/ZooKeeper-trunk-solaris/build/test/tmp/test2394915992578299615.junit.dir/version-2
[junit] 2017-02-14 05:50:36,900 [myid:] - INFO [main:FileSnap@83] - Reading snapshot /zonestorage/hudson_solaris/home/hudson/hudson-slave/workspace/ZooKeeper-trunk-solaris/build/test/tmp/test2394915992578299615.junit.dir/version-2/snapshot.b
[junit] 2017-02-14 05:50:36,902 [myid:] - INFO [main:FileTxnSnapLog@346] - Snapshotting: 0xb to /zonestorage/hudson_solaris/home/hudson/hudson-slave/workspace/ZooKeeper-trunk-solaris/build/test/tmp/test2394915992578299615.junit.dir/version-2/snapshot.b
[junit] 2017-02-14 05:50:36,903 [myid:] - ERROR [main:ZooKeeperServer@506] - ZKShutdownHandler is not registered, so ZooKeeper server won't take any action on ERROR or SHUTDOWN server state changes
[junit] 2017-02-14 05:50:36,903 [myid:] - INFO [main:FourLetterWordMain@85] - connecting to 127.0.0.1 11222
[junit] 2017-02-14 05:50:36,904 [myid:] - INFO [NIOServerCxnFactory.AcceptThread:0.0.0.0/0.0.0.0:11222:NIOServerCnxnFactory$AcceptThread@296] - Accepted socket connection from /127.0.0.1:37319
[junit] 2017-02-14 05:50:36,904 [myid:] - INFO [NIOWorkerThread-1:NIOServerCnxn@485] - Processing stat command from /127.0.0.1:37319
[junit] 2017-02-14 05:50:36,904 [myid:] - INFO [NIOWorkerThread-1:StatCommand@49] - Stat command output
[junit] 2017-02-14 05:50:36,905 [myid:] - INFO [NIOWorkerThread-1:NIOServerCnxn@614] - Closed socket connection for client /127.0.0.1:37319 (no session established for client)
[junit] 2017-02-14 05:50:36,905 [myid:] - INFO [main:JMXEnv@228] - ensureParent:[InMemoryDataTree, StandaloneServer_port]
[junit] 2017-02-14 05:50:36,906 [myid:] - INFO [main:JMXEnv@245] - expect:InMemoryDataTree
[junit] 2017-02-14 05:50:36,907 [myid:] - INFO [main:JMXEnv@249] - found:InMemoryDataTree org.apache.ZooKeeperService:name0=StandaloneServer_port11222,name1=InMemoryDataTree
[junit] 2017-02-14 05:50:36,907 [myid:] - INFO [main:JMXEnv@245] - expect:StandaloneServer_port
[junit] 2017-02-14 05:50:36,907 [myid:] - INFO [main:JMXEnv@249] - found:StandaloneServer_port org.apache.ZooKeeperService:name0=StandaloneServer_port11222
[junit] 2017-02-14 05:50:36,907 [myid:] - INFO [main:JUnit4ZKTestRunner$LoggedInvokeMethod@82] - Memory used 17901
[junit] 2017-02-14 05:50:36,907 [myid:] - INFO [main:JUnit4ZKTestRunner$LoggedInvokeMethod@87] - Number of threads 24
[junit] 2017-02-14 05:50:36,907 [myid:] - INFO [main:JUnit4ZKTestRunner$LoggedInvokeMethod@102] - FINISHED TEST METHOD testQuota
[junit] 2017-02-14 05:50:36,908 [myid:] - INFO [main:ClientBase@558] - tearDown starting
[junit] 2017-02-14 05:50:36,982 [myid:] - INFO [main:ZooKeeper@1324] - Session: 0x126b82529480000 closed
[junit] 2017-02-14 05:50:36,982 [myid:] - INFO [main:ClientBase@528] - STOPPING server
[junit] 2017-02-14 05:50:36,982 [myid:] - INFO [main-EventThread:ClientCnxn$EventThread@513] - EventThread shut down for session: 0x126b82529480000
[junit] 2017-02-14 05:50:36,982 [myid:] - INFO [ConnnectionExpirer:NIOServerCnxnFactory$ConnectionExpirerThread@583] - ConnnectionExpirerThread interrupted
[junit] 2017-02-14 05:50:36,982 [myid:] - INFO [NIOServerCxnFactory.SelectorThread-1:NIOServerCnxnFactory$SelectorThread@420] - selector thread exitted run method
[junit] 2017-02-14 05:50:36,982 [myid:] - INFO [NIOServerCxnFactory.SelectorThread-0:NIOServerCnxnFactory$SelectorThread@420] - selector thread exitted run method
[junit] 2017-02-14 05:50:36,982 [myid:] - INFO [NIOServerCxnFactory.AcceptThread:0.0.0.0/0.0.0.0:11222:NIOServerCnxnFactory$AcceptThread@219] - accept thread exitted run method
[junit] 2017-02-14 05:50:36,983 [myid:] - INFO [main:ZooKeeperServer@542] - shutting down
[junit] 2017-02-14 05:50:36,983 [myid:] - ERROR [main:ZooKeeperServer@506] - ZKShutdownHandler is not registered, so ZooKeeper server won't take any action on ERROR or SHUTDOWN server state changes
[junit] 2017-02-14 05:50:36,983 [myid:] - INFO [main:SessionTrackerImpl@232] - Shutting down
[junit] 2017-02-14 05:50:36,983 [myid:] - INFO [main:PrepRequestProcessor@1008] - Shutting down
[junit] 2017-02-14 05:50:36,983 [myid:] - INFO [main:SyncRequestProcessor@191] - Shutting down
[junit] 2017-02-14 05:50:36,984 [myid:] - INFO [ProcessThread(sid:0 cport:11222)::PrepRequestProcessor@157] - PrepRequestProcessor exited loop!
[junit] 2017-02-14 05:50:36,984 [myid:] - INFO [SyncThread:0:SyncRequestProcessor@169] - SyncRequestProcessor exited!
[junit] 2017-02-14 05:50:36,984 [myid:] - INFO [main:FinalRequestProcessor@481] - shutdown of request processor complete
[junit] 2017-02-14 05:50:36,984 [myid:] - INFO [main:MBeanRegistry@128] - Unregister MBean [org.apache.ZooKeeperService:name0=StandaloneServer_port11222,name1=InMemoryDataTree]
[junit] 2017-02-14 05:50:36,985 [myid:] - INFO [main:MBeanRegistry@128] - Unregister MBean [org.apache.ZooKeeperService:name0=StandaloneServer_port11222]
[junit] 2017-02-14 05:50:36,985 [myid:] - INFO [main:FourLetterWordMain@85] - connecting to 127.0.0.1 11222
[junit] 2017-02-14 05:50:36,985 [myid:] - INFO [main:JMXEnv@146] - ensureOnly:[]
[junit] 2017-02-14 05:50:36,989 [myid:] - INFO [main:ClientBase@583] - fdcount after test is: 60 at start it was 43
[junit] 2017-02-14 05:50:36,989 [myid:] - INFO [main:ClientBase@585] - sleeping for 20 secs
[junit] 2017-02-14 05:50:36,991 [myid:] - INFO [main:ZKTestCase$1@65] - SUCCEEDED testQuota
[junit] 2017-02-14 05:50:36,991 [myid:] - INFO [main:ZKTestCase$1@60] - FINISHED testQuota
[junit] Tests run: 1, Failures: 0, Errors: 0, Time elapsed: 0.902 sec
fail.build.on.test.failure:
BUILD FAILED
/zonestorage/hudson_solaris/home/hudson/hudson-slave/workspace/ZooKeeper-trunk-solaris/build.xml:1242: The following error occurred while executing this line:
/zonestorage/hudson_solaris/home/hudson/hudson-slave/workspace/ZooKeeper-trunk-solaris/build.xml:1216: Tests failed!
Total time: 87 minutes 1 second
Build step 'Invoke Ant' marked build as failure
[locks-and-latches] Releasing all the locks
[locks-and-latches] All the locks released
Recording test results
Email was triggered for: Failure - Any
Sending email for trigger: Failure - Any
###################################################################################
############################## FAILED TESTS (if any) ##############################
6 tests failed.
FAILED: org.apache.zookeeper.server.quorum.RaceConditionTest.testRaceConditionBetweenLeaderAndAckRequestProcessor
Error Message:
test timed out after 30000 milliseconds
Stack Trace:
at java.lang.Thread.sleep(Native Method)
at org.apache.zookeeper.test.ClientBase.waitForServerState(ClientBase.java:301)
at org.apache.zookeeper.server.quorum.RaceConditionTest.testRaceConditionBetweenLeaderAndAckRequestProcessor(RaceConditionTest.java:77)
at org.apache.zookeeper.JUnit4ZKTestRunner$LoggedInvokeMethod.evaluate(JUnit4ZKTestRunner.java:79)
at java.util.concurrent.FutureTask.run(FutureTask.java:262)
at java.lang.Thread.run(Thread.java:745)
FAILED: org.apache.zookeeper.server.quorum.Zab1_0Test.testNormalFollowerRun
Error Message:
null
Stack Trace:
java.io.EOFException
at java.io.DataInputStream.readInt(DataInputStream.java:392)
at org.apache.jute.BinaryInputArchive.readInt(BinaryInputArchive.java:63)
at org.apache.zookeeper.server.quorum.QuorumPacket.deserialize(QuorumPacket.java:83)
at org.apache.jute.BinaryInputArchive.readRecord(BinaryInputArchive.java:99)
at org.apache.zookeeper.server.quorum.Zab1_0Test.readPacketSkippingPing(Zab1_0Test.java:346)
at org.apache.zookeeper.server.quorum.Zab1_0Test$4.converseWithFollower(Zab1_0Test.java:688)
at org.apache.zookeeper.server.quorum.Zab1_0Test.testFollowerConversation(Zab1_0Test.java:517)
at org.apache.zookeeper.server.quorum.Zab1_0Test.testNormalFollowerRun(Zab1_0Test.java:649)
at org.apache.zookeeper.JUnit4ZKTestRunner$LoggedInvokeMethod.evaluate(JUnit4ZKTestRunner.java:79)
FAILED: org.apache.zookeeper.server.quorum.Zab1_0Test.testNormalFollowerRunWithDiff
Error Message:
expected:<4294967298> but was:<4294967297>
Stack Trace:
junit.framework.AssertionFailedError: expected:<4294967298> but was:<4294967297>
at org.apache.zookeeper.server.quorum.Zab1_0Test$5.converseWithFollower(Zab1_0Test.java:869)
at org.apache.zookeeper.server.quorum.Zab1_0Test.testFollowerConversation(Zab1_0Test.java:517)
at org.apache.zookeeper.server.quorum.Zab1_0Test.testNormalFollowerRunWithDiff(Zab1_0Test.java:784)
at org.apache.zookeeper.JUnit4ZKTestRunner$LoggedInvokeMethod.evaluate(JUnit4ZKTestRunner.java:79)
FAILED: org.apache.zookeeper.test.WatchEventWhenAutoResetTest.testNodeDataChanged
Error Message:
expected:<NodeDataChanged> but was:<NodeDeleted>
Stack Trace:
junit.framework.AssertionFailedError: expected:<NodeDataChanged> but was:<NodeDeleted>
at org.apache.zookeeper.test.WatchEventWhenAutoResetTest$EventsWatcher.assertEvent(WatchEventWhenAutoResetTest.java:67)
at org.apache.zookeeper.test.WatchEventWhenAutoResetTest.testNodeDataChanged(WatchEventWhenAutoResetTest.java:117)
at org.apache.zookeeper.JUnit4ZKTestRunner$LoggedInvokeMethod.evaluate(JUnit4ZKTestRunner.java:79)
FAILED: org.apache.zookeeper.test.ReconfigTest.testPortChangeToBlockedPortLeader
Error Message:
client could not connect to reestablished quorum: giving up after 30+ seconds.
Stack Trace:
junit.framework.AssertionFailedError: client could not connect to reestablished quorum: giving up after 30+ seconds.
at org.apache.zookeeper.test.ReconfigTest.testNormalOperation(ReconfigTest.java:183)
at org.apache.zookeeper.test.ReconfigTest.testPortChangeToBlockedPort(ReconfigTest.java:796)
at org.apache.zookeeper.test.ReconfigTest.testPortChangeToBlockedPortLeader(ReconfigTest.java:719)
at org.apache.zookeeper.JUnit4ZKTestRunner$LoggedInvokeMethod.evaluate(JUnit4ZKTestRunner.java:79)
FAILED: org.apache.zookeeper.test.ReconfigTest.testPortChangeToBlockedPortFollower
Error Message:
client could not connect to reestablished quorum: giving up after 30+ seconds.
Stack Trace:
junit.framework.AssertionFailedError: client could not connect to reestablished quorum: giving up after 30+ seconds.
at org.apache.zookeeper.test.ReconfigTest.testNormalOperation(ReconfigTest.java:183)
at org.apache.zookeeper.test.ReconfigTest.testPortChangeToBlockedPort(ReconfigTest.java:796)
at org.apache.zookeeper.test.ReconfigTest.testPortChangeToBlockedPortFollower(ReconfigTest.java:715)
at org.apache.zookeeper.JUnit4ZKTestRunner$LoggedInvokeMethod.evaluate(JUnit4ZKTestRunner.java:79)