You are viewing a plain text version of this content. The canonical link for it is here.
Posted to notifications@cxf.apache.org by Apache Hudson Server <hu...@hudson.zones.apache.org> on 2009/07/24 21:39:15 UTC

Build failed in Hudson: CXF-2.1.x-JDK15 » Apache CXF System Tests #199

See http://hudson.zones.apache.org/hudson/job/CXF-2.1.x-JDK15/org.apache.cxf$cxf-systests/199/

------------------------------------------
[INFO] ------------------------------------------------------------------------
[INFO] Building Apache CXF System Tests
[INFO]    task-segment: [clean, install]
[INFO] ------------------------------------------------------------------------
[INFO] [clean:clean]
[INFO] Deleting directory http://hudson.zones.apache.org/hudson/job/CXF-2.1.x-JDK15/org.apache.cxf$cxf-systests/ws/target 
Downloading: http://repo1.maven.org/maven2/org/apache/servicemix/servicemix-core/3.3.1/servicemix-core-3.3.1.pom
11K downloaded
Downloading: http://repo1.maven.org/maven2/org/apache/servicemix/core/3.3.1/core-3.3.1.pom
2K downloaded
Downloading: http://repo1.maven.org/maven2/org/apache/servicemix/parent/3.3.1/parent-3.3.1.pom
7K downloaded
Downloading: http://repo1.maven.org/maven2/org/apache/servicemix/servicemix/3.3.1/servicemix-3.3.1.pom
82K downloaded
Downloading: http://repo1.maven.org/maven2/org/apache/servicemix/servicemix-pom/3/servicemix-pom-3.pom
9K downloaded
Downloading: http://svn.apache.org/repos/asf/servicemix/m2-repo//org/apache/apache/6/apache-6.pom
Downloading: http://people.apache.org/repo/m2-incubating-repository/org/apache/apache/6/apache-6.pom
Downloading: http://repository.codehaus.org/org/apache/apache/6/apache-6.pom
Downloading: http://download.java.net/maven/1/org.apache/poms/apache-6.pom
Downloading: http://repo1.maven.org/maven2/org/apache/apache/6/apache-6.pom
12K downloaded
Downloading: http://repo1.maven.org/maven2/org/apache/servicemix/servicemix-utils/1.1.0/servicemix-utils-1.1.0.pom
13K downloaded
Downloading: http://repo1.maven.org/maven2/org/apache/geronimo/modules/geronimo-connector/2.0.2/geronimo-connector-2.0.2.pom
3K downloaded
Downloading: http://repo1.maven.org/maven2/org/apache/geronimo/modules/modules/2.0.2/modules-2.0.2.pom
5K downloaded
Downloading: http://repo1.maven.org/maven2/org/apache/geronimo/geronimo/2.0.2/geronimo-2.0.2.pom
81K downloaded
Downloading: http://repo1.maven.org/maven2/org/apache/geronimo/components/geronimo-connector/2.0.2/geronimo-connector-2.0.2.pom
1K downloaded
Downloading: http://repo1.maven.org/maven2/org/apache/geronimo/components/geronimo-txmanager-parent/2.0.2/geronimo-txmanager-parent-2.0.2.pom
8K downloaded
Downloading: http://repo1.maven.org/maven2/org/apache/geronimo/components/geronimo-transaction/2.0.2/geronimo-transaction-2.0.2.pom
2K downloaded
Downloading: http://repo1.maven.org/maven2/org/apache/geronimo/modules/geronimo-transaction/2.0.2/geronimo-transaction-2.0.2.pom
2K downloaded
Downloading: http://repo1.maven.org/maven2/org/apache/activemq/activemq-pool/5.2.0/activemq-pool-5.2.0.pom
3K downloaded
Downloading: http://repo1.maven.org/maven2/org/apache/activemq/activemq-parent/5.2.0/activemq-parent-5.2.0.pom
44K downloaded
Downloading: http://repo1.maven.org/maven2/commons-logging/commons-logging-api/1.1/commons-logging-api-1.1.pom
5K downloaded
Downloading: http://repo1.maven.org/maven2/commons-pool/commons-pool/1.4/commons-pool-1.4.pom
7K downloaded
Downloading: http://repo1.maven.org/maven2/org/apache/xbean/xbean-spring/3.4.3/xbean-spring-3.4.3.pom
6K downloaded
Downloading: http://repo1.maven.org/maven2/org/apache/xbean/xbean/3.4.3/xbean-3.4.3.pom
18K downloaded
Downloading: http://repo1.maven.org/maven2/org/apache/xbean/xbean-classloader/3.4.3/xbean-classloader-3.4.3.pom
2K downloaded
Downloading: http://repo1.maven.org/maven2/com/thoughtworks/xstream/xstream/1.3/xstream-1.3.pom
11K downloaded
Downloading: http://repo1.maven.org/maven2/com/thoughtworks/xstream/xstream-parent/1.3/xstream-parent-1.3.pom
13K downloaded
Downloading: http://repo1.maven.org/maven2/xpp3/xpp3_min/1.1.4c/xpp3_min-1.1.4c.pom
1K downloaded
Downloading: http://repo1.maven.org/maven2/org/apache/servicemix/servicemix-core/3.3.1/servicemix-core-3.3.1.jar
597K downloaded
Downloading: http://svn.apache.org/repos/asf/servicemix/m2-repo//org/apache/servicemix/servicemix-utils/1.1.0/servicemix-utils-1.1.0.jar
Downloading: http://people.apache.org/repo/m2-incubating-repository/org/apache/servicemix/servicemix-utils/1.1.0/servicemix-utils-1.1.0.jar
Downloading: http://repository.codehaus.org/org/apache/servicemix/servicemix-utils/1.1.0/servicemix-utils-1.1.0.jar
Downloading: http://download.java.net/maven/1/org.apache.servicemix/jars/servicemix-utils-1.1.0.jar
Downloading: http://repo1.maven.org/maven2/org/apache/servicemix/servicemix-utils/1.1.0/servicemix-utils-1.1.0.jar
182K downloaded
Downloading: http://svn.apache.org/repos/asf/servicemix/m2-repo//org/apache/geronimo/modules/geronimo-connector/2.0.2/geronimo-connector-2.0.2.jar
Downloading: http://people.apache.org/repo/m2-incubating-repository/org/apache/geronimo/modules/geronimo-connector/2.0.2/geronimo-connector-2.0.2.jar
Downloading: http://repository.codehaus.org/org/apache/geronimo/modules/geronimo-connector/2.0.2/geronimo-connector-2.0.2.jar
Downloading: http://download.java.net/maven/1/org.apache.geronimo.modules/jars/geronimo-connector-2.0.2.jar
Downloading: http://repo1.maven.org/maven2/org/apache/geronimo/modules/geronimo-connector/2.0.2/geronimo-connector-2.0.2.jar
44K downloaded
Downloading: http://download.java.net/maven/1//org.apache.geronimo.components/jars/geronimo-connector-2.0.2.jar
Downloading: http://people.apache.org/repo/m2-incubating-repository//org/apache/geronimo/components/geronimo-connector/2.0.2/geronimo-connector-2.0.2.jar
Downloading: http://repo1.maven.org/maven2/org/apache/geronimo/components/geronimo-connector/2.0.2/geronimo-connector-2.0.2.jar
98K downloaded
Downloading: http://download.java.net/maven/1//org.apache.geronimo.components/jars/geronimo-transaction-2.0.2.jar
Downloading: http://people.apache.org/repo/m2-incubating-repository//org/apache/geronimo/components/geronimo-transaction/2.0.2/geronimo-transaction-2.0.2.jar
Downloading: http://repo1.maven.org/maven2/org/apache/geronimo/components/geronimo-transaction/2.0.2/geronimo-transaction-2.0.2.jar
49K downloaded
Downloading: http://svn.apache.org/repos/asf/servicemix/m2-repo//org/apache/geronimo/modules/geronimo-transaction/2.0.2/geronimo-transaction-2.0.2.jar
Downloading: http://people.apache.org/repo/m2-incubating-repository/org/apache/geronimo/modules/geronimo-transaction/2.0.2/geronimo-transaction-2.0.2.jar
Downloading: http://repository.codehaus.org/org/apache/geronimo/modules/geronimo-transaction/2.0.2/geronimo-transaction-2.0.2.jar
Downloading: http://download.java.net/maven/1/org.apache.geronimo.modules/jars/geronimo-transaction-2.0.2.jar
Downloading: http://repo1.maven.org/maven2/org/apache/geronimo/modules/geronimo-transaction/2.0.2/geronimo-transaction-2.0.2.jar
9K downloaded
Downloading: http://svn.apache.org/repos/asf/servicemix/m2-repo//org/apache/activemq/activemq-pool/5.2.0/activemq-pool-5.2.0.jar
Downloading: http://people.apache.org/repo/m2-incubating-repository/org/apache/activemq/activemq-pool/5.2.0/activemq-pool-5.2.0.jar
Downloading: http://repository.codehaus.org/org/apache/activemq/activemq-pool/5.2.0/activemq-pool-5.2.0.jar
Downloading: http://download.java.net/maven/1/org.apache.activemq/jars/activemq-pool-5.2.0.jar
Downloading: http://repo1.maven.org/maven2/org/apache/activemq/activemq-pool/5.2.0/activemq-pool-5.2.0.jar
37K downloaded
Downloading: http://repo1.maven.org/maven2/commons-logging/commons-logging-api/1.1/commons-logging-api-1.1.jar
43K downloaded
Downloading: http://svn.apache.org/repos/asf/servicemix/m2-repo//org/apache/xbean/xbean-spring/3.4.3/xbean-spring-3.4.3.jar
Downloading: http://people.apache.org/repo/m2-incubating-repository/org/apache/xbean/xbean-spring/3.4.3/xbean-spring-3.4.3.jar
Downloading: http://repository.codehaus.org/org/apache/xbean/xbean-spring/3.4.3/xbean-spring-3.4.3.jar
Downloading: http://download.java.net/maven/1/org.apache.xbean/jars/xbean-spring-3.4.3.jar
Downloading: http://repo1.maven.org/maven2/org/apache/xbean/xbean-spring/3.4.3/xbean-spring-3.4.3.jar
127K downloaded
Downloading: http://svn.apache.org/repos/asf/servicemix/m2-repo//org/apache/xbean/xbean-classloader/3.4.3/xbean-classloader-3.4.3.jar
Downloading: http://people.apache.org/repo/m2-incubating-repository/org/apache/xbean/xbean-classloader/3.4.3/xbean-classloader-3.4.3.jar
Downloading: http://repository.codehaus.org/org/apache/xbean/xbean-classloader/3.4.3/xbean-classloader-3.4.3.jar
Downloading: http://download.java.net/maven/1/org.apache.xbean/jars/xbean-classloader-3.4.3.jar
Downloading: http://repo1.maven.org/maven2/org/apache/xbean/xbean-classloader/3.4.3/xbean-classloader-3.4.3.jar
46K downloaded
Downloading: http://svn.apache.org/repos/asf/servicemix/m2-repo//com/thoughtworks/xstream/xstream/1.3/xstream-1.3.jar
Downloading: http://people.apache.org/repo/m2-incubating-repository/com/thoughtworks/xstream/xstream/1.3/xstream-1.3.jar
Downloading: http://repository.codehaus.org/com/thoughtworks/xstream/xstream/1.3/xstream-1.3.jar
401K downloaded
Downloading: http://repo1.maven.org/maven2/xpp3/xpp3_min/1.1.4c/xpp3_min-1.1.4c.jar
24K downloaded
[INFO] [checkstyle:checkstyle {execution: validate}]
[INFO] Starting audit...
http://hudson.zones.apache.org/hudson/job/CXF-2.1.x-JDK15/org.apache.cxf$cxf-systests/ws/src/test/java/org/apache/cxf/systest/jms/JMSClientServerTest.java :37:8: Unused import - javax.xml.ws.soap.SOAPFaultException.
Audit done.

[HUDSON] Archiving http://hudson.zones.apache.org/hudson/job/CXF-2.1.x-JDK15/org.apache.cxf$cxf-systests/ws/pom.xml  to /export/home/hudson/hudson/jobs/CXF-2.1.x-JDK15/modules/org.apache.cxf$cxf-systests/builds/2009-07-24_19-11-48/archive/org.apache.cxf/cxf-systests/2.1.6-SNAPSHOT/pom.xml
[INFO] ------------------------------------------------------------------------
[ERROR] BUILD ERROR
[INFO] ------------------------------------------------------------------------
[INFO] An error has occurred in Checkstyle report generation.

Embedded error: There are 1 checkstyle errors.
[INFO] ------------------------------------------------------------------------
[INFO] Trace
org.apache.maven.lifecycle.LifecycleExecutionException: An error has occurred in Checkstyle report generation.
	at org.apache.maven.lifecycle.DefaultLifecycleExecutor.executeGoals(DefaultLifecycleExecutor.java:583)
	at org.apache.maven.lifecycle.DefaultLifecycleExecutor.executeGoalWithLifecycle(DefaultLifecycleExecutor.java:499)
	at org.apache.maven.lifecycle.DefaultLifecycleExecutor.executeGoal(DefaultLifecycleExecutor.java:478)
	at org.apache.maven.lifecycle.DefaultLifecycleExecutor.executeGoalAndHandleFailures(DefaultLifecycleExecutor.java:330)
	at org.apache.maven.lifecycle.DefaultLifecycleExecutor.executeTaskSegments(DefaultLifecycleExecutor.java:291)
	at org.apache.maven.lifecycle.DefaultLifecycleExecutor.execute(DefaultLifecycleExecutor.java:142)
	at org.apache.maven.lifecycle.LifecycleExecutorInterceptor.execute(LifecycleExecutorInterceptor.java:65)
	at org.apache.maven.DefaultMaven.doExecute(DefaultMaven.java:336)
	at org.apache.maven.DefaultMaven.execute(DefaultMaven.java:129)
	at org.apache.maven.cli.MavenCli.main(MavenCli.java:287)
	at sun.reflect.NativeMethodAccessorImpl.invoke0(Native Method)
	at sun.reflect.NativeMethodAccessorImpl.invoke(NativeMethodAccessorImpl.java:39)
	at sun.reflect.DelegatingMethodAccessorImpl.invoke(DelegatingMethodAccessorImpl.java:25)
	at java.lang.reflect.Method.invoke(Method.java:585)
	at org.codehaus.classworlds.Launcher.launchEnhanced(Launcher.java:315)
	at org.codehaus.classworlds.Launcher.launch(Launcher.java:255)
	at hudson.maven.agent.Main.launch(Main.java:158)
	at hudson.maven.MavenBuilder.call(MavenBuilder.java:162)
	at hudson.maven.MavenModuleSetBuild$Builder.call(MavenModuleSetBuild.java:579)
	at hudson.maven.MavenModuleSetBuild$Builder.call(MavenModuleSetBuild.java:525)
	at hudson.remoting.UserRequest.perform(UserRequest.java:69)
	at hudson.remoting.UserRequest.perform(UserRequest.java:23)
	at hudson.remoting.Request$2.run(Request.java:213)
	at java.util.concurrent.Executors$RunnableAdapter.call(Executors.java:417)
	at java.util.concurrent.FutureTask$Sync.innerRun(FutureTask.java:269)
	at java.util.concurrent.FutureTask.run(FutureTask.java:123)
	at java.util.concurrent.ThreadPoolExecutor$Worker.runTask(ThreadPoolExecutor.java:650)
	at java.util.concurrent.ThreadPoolExecutor$Worker.run(ThreadPoolExecutor.java:675)
	at java.lang.Thread.run(Thread.java:595)
Caused by: org.apache.maven.plugin.MojoExecutionException: An error has occurred in Checkstyle report generation.
	at org.apache.maven.reporting.AbstractMavenReport.execute(AbstractMavenReport.java:79)
	at org.apache.maven.plugin.DefaultPluginManager.executeMojo(DefaultPluginManager.java:451)
	at hudson.maven.agent.PluginManagerInterceptor.executeMojo(PluginManagerInterceptor.java:182)
	at org.apache.maven.lifecycle.DefaultLifecycleExecutor.executeGoals(DefaultLifecycleExecutor.java:558)
	... 28 more
Caused by: org.apache.maven.reporting.MavenReportException: There are 1 checkstyle errors.
	at org.apache.maven.plugin.checkstyle.CheckstyleReport.executeCheckstyle(CheckstyleReport.java:955)
	at org.apache.maven.plugin.checkstyle.CheckstyleReport.executeReport(CheckstyleReport.java:635)
	at org.apache.maven.reporting.AbstractMavenReport.generate(AbstractMavenReport.java:98)
	at org.apache.maven.reporting.AbstractMavenReport.execute(AbstractMavenReport.java:73)
	... 31 more
[INFO] ------------------------------------------------------------------------
[INFO] Total time: 26 minutes 53 seconds
[INFO] Finished at: Fri Jul 24 19:38:54 UTC 2009
[INFO] Final Memory: 94M/170M
[INFO] ------------------------------------------------------------------------
Waiting for Hudson to finish collecting data


Hudson build is back to stable: CXF-2.1.x-JDK15 » Apache CXF System Tests #202

Posted by Apache Hudson Server <hu...@hudson.zones.apache.org>.
See http://hudson.zones.apache.org/hudson/job/CXF-2.1.x-JDK15/org.apache.cxf$cxf-systests/202/



Hudson build is still unstable: CXF-2.1.x-JDK15 » Apache CXF System Tests #201

Posted by Apache Hudson Server <hu...@hudson.zones.apache.org>.
See http://hudson.zones.apache.org/hudson/job/CXF-2.1.x-JDK15/org.apache.cxf$cxf-systests/201/



Hudson build is unstable: CXF-2.1.x-JDK15 » Apache CXF System Tests #200

Posted by Apache Hudson Server <hu...@hudson.zones.apache.org>.
See http://hudson.zones.apache.org/hudson/job/CXF-2.1.x-JDK15/org.apache.cxf$cxf-systests/200/