You are viewing a plain text version of this content. The canonical link for it is here.
Posted to builds@beam.apache.org by Apache Jenkins Server <je...@builds.apache.org> on 2023/07/29 08:35:36 UTC
Build failed in Jenkins: beam_PostCommit_Go #11589
See <https://ci-beam.apache.org/job/beam_PostCommit_Go/11589/display/redirect>
Changes:
------------------------------------------
[...truncated 9.38 KB...]
> Task :model:pipeline:processResources
> Task :model:pipeline:classes
> Task :model:pipeline:jar
> Task :model:fn-execution:extractIncludeProto
> Task :model:fn-execution:extractProto
> Task :model:fn-execution:generateProto FROM-CACHE
> Task :model:fn-execution:compileJava FROM-CACHE
> Task :model:fn-execution:processResources
> Task :model:fn-execution:classes
> Task :model:pipeline:shadowJar FROM-CACHE
> Task :model:fn-execution:shadowJar FROM-CACHE
> Task :model:job-management:createCheckerFrameworkManifest
> Task :model:job-management:extractIncludeProto
> Task :model:job-management:extractProto
> Task :model:job-management:generateProto FROM-CACHE
> Task :model:job-management:compileJava FROM-CACHE
> Task :model:job-management:processResources
> Task :model:job-management:classes
> Task :model:job-management:shadowJar FROM-CACHE
> Task :runners:core-construction-java:createCheckerFrameworkManifest
> Task :sdks:java:core:createCheckerFrameworkManifest
> Task :sdks:java:core:generateAvroProtocol NO-SOURCE
> Task :sdks:java:core:generateAvroJava NO-SOURCE
> Task :sdks:java:core:generateGrammarSource FROM-CACHE
> Task :sdks:java:core:compileJava FROM-CACHE
> Task :sdks:java:core:processResources
> Task :sdks:java:core:classes
> Task :sdks:java:core:shadowJar FROM-CACHE
> Task :sdks:java:fn-execution:createCheckerFrameworkManifest
> Task :sdks:java:fn-execution:compileJava FROM-CACHE
> Task :sdks:java:fn-execution:processResources NO-SOURCE
> Task :sdks:java:fn-execution:classes UP-TO-DATE
> Task :sdks:java:fn-execution:jar
> Task :sdks:java:extensions:avro:createCheckerFrameworkManifest
> Task :sdks:java:extensions:avro:generateAvroProtocol NO-SOURCE
> Task :sdks:java:extensions:avro:generateAvroJava NO-SOURCE
> Task :sdks:java:extensions:avro:compileJava FROM-CACHE
> Task :sdks:java:extensions:avro:processResources NO-SOURCE
> Task :sdks:java:extensions:avro:classes UP-TO-DATE
> Task :sdks:java:extensions:avro:jar
> Task :runners:core-construction-java:compileJava FROM-CACHE
> Task :runners:core-construction-java:processResources NO-SOURCE
> Task :runners:core-construction-java:classes UP-TO-DATE
> Task :runners:core-construction-java:jar
> Task :runners:core-java:createCheckerFrameworkManifest
> Task :runners:core-java:compileJava FROM-CACHE
> Task :runners:core-java:processResources NO-SOURCE
> Task :runners:core-java:classes UP-TO-DATE
> Task :runners:core-java:jar
> Task :runners:google-cloud-dataflow-java:createCheckerFrameworkManifest
> Task :sdks:java:extensions:google-cloud-platform-core:createCheckerFrameworkManifest
> Task :sdks:java:extensions:google-cloud-platform-core:compileJava FROM-CACHE
> Task :sdks:java:extensions:google-cloud-platform-core:processResources NO-SOURCE
> Task :sdks:java:extensions:google-cloud-platform-core:classes UP-TO-DATE
> Task :sdks:java:extensions:google-cloud-platform-core:jar
> Task :runners:java-fn-execution:createCheckerFrameworkManifest
> Task :sdks:java:harness:createCheckerFrameworkManifest
> Task :sdks:java:harness:compileJava FROM-CACHE
> Task :sdks:java:harness:processResources NO-SOURCE
> Task :sdks:java:harness:classes UP-TO-DATE
> Task :sdks:java:harness:jar
> Task :runners:java-fn-execution:compileJava FROM-CACHE
> Task :runners:java-fn-execution:processResources NO-SOURCE
> Task :runners:java-fn-execution:classes UP-TO-DATE
> Task :runners:java-fn-execution:jar
> Task :sdks:java:expansion-service:createCheckerFrameworkManifest
> Task :sdks:java:expansion-service:compileJava FROM-CACHE
> Task :sdks:java:expansion-service:processResources NO-SOURCE
> Task :sdks:java:expansion-service:classes UP-TO-DATE
> Task :sdks:java:expansion-service:jar
> Task :sdks:java:extensions:arrow:createCheckerFrameworkManifest
> Task :sdks:java:extensions:arrow:compileJava FROM-CACHE
> Task :sdks:java:extensions:arrow:processResources NO-SOURCE
> Task :sdks:java:extensions:arrow:classes UP-TO-DATE
> Task :sdks:java:extensions:arrow:jar
> Task :sdks:java:extensions:protobuf:createCheckerFrameworkManifest
> Task :sdks:java:extensions:protobuf:extractIncludeProto
> Task :sdks:java:extensions:protobuf:extractProto
> Task :sdks:java:extensions:protobuf:generateProto NO-SOURCE
> Task :sdks:java:extensions:protobuf:compileJava FROM-CACHE
> Task :sdks:java:extensions:protobuf:processResources NO-SOURCE
> Task :sdks:java:extensions:protobuf:classes UP-TO-DATE
> Task :sdks:java:extensions:protobuf:jar
> Task :sdks:java:io:google-cloud-platform:createCheckerFrameworkManifest
> Task :sdks:java:io:google-cloud-platform:compileJava FROM-CACHE
> Task :sdks:java:io:google-cloud-platform:processResources NO-SOURCE
> Task :sdks:java:io:google-cloud-platform:classes UP-TO-DATE
> Task :sdks:java:io:google-cloud-platform:jar
> Task :sdks:java:io:kafka:createCheckerFrameworkManifest
> Task :sdks:java:io:kafka:compileJava FROM-CACHE
> Task :sdks:java:io:kafka:processResources NO-SOURCE
> Task :sdks:java:io:kafka:classes UP-TO-DATE
> Task :sdks:java:io:kafka:jar
> Task :runners:google-cloud-dataflow-java:compileJava FROM-CACHE
> Task :runners:google-cloud-dataflow-java:processResources
> Task :runners:google-cloud-dataflow-java:classes
> Task :runners:google-cloud-dataflow-java:jar
> Task :runners:google-cloud-dataflow-java:worker:createCheckerFrameworkManifest
> Task :runners:google-cloud-dataflow-java:worker:windmill:createCheckerFrameworkManifest
> Task :runners:google-cloud-dataflow-java:worker:windmill:extractIncludeProto
> Task :runners:google-cloud-dataflow-java:worker:windmill:extractProto
> Task :runners:google-cloud-dataflow-java:worker:windmill:generateProto FROM-CACHE
> Task :runners:google-cloud-dataflow-java:worker:windmill:compileJava FROM-CACHE
> Task :runners:google-cloud-dataflow-java:worker:windmill:processResources
> Task :runners:google-cloud-dataflow-java:worker:windmill:classes
> Task :runners:google-cloud-dataflow-java:worker:windmill:shadowJar FROM-CACHE
> Task :runners:google-cloud-dataflow-java:worker:compileJava FROM-CACHE
> Task :runners:google-cloud-dataflow-java:worker:processResources
> Task :runners:google-cloud-dataflow-java:worker:classes
> Task :sdks:java:harness:shadowJar FROM-CACHE
> Task :runners:google-cloud-dataflow-java:worker:shadowJar FROM-CACHE
> Task :sdks:go:test:assemble UP-TO-DATE
> Task :sdks:go:test:test UP-TO-DATE
> Task :sdks:go:test:check UP-TO-DATE
> Task :sdks:go:test:build UP-TO-DATE
> Task :goIntegrationTests
$ CURRENT_DIRECTORY=<https://ci-beam.apache.org/job/beam_PostCommit_Go/ws/src/sdks/go/test>
$ TESTS=./test/integration/... ./test/regression
$ RUNNER=portable
$ TIMEOUT=3h
$ SIMULTANEOUS=3
$ GCS_LOCATION=gs://temp-storage-for-end-to-end-tests
$ GCS_SUBFOLDER=test8811
$ PROJECT=apache-beam-testing
$ DATAFLOW_PROJECT=apache-beam-testing
$ REGION=us-central1
$ trap exit_background_processes SIGINT SIGTERM EXIT
$ key=--runner
$ case --runner in
$ RUNNER=dataflow
$ cd <https://ci-beam.apache.org/job/beam_PostCommit_Go/ws/src>
$ test -d sdks/go/test
$ command -v docker
/usr/bin/docker
$ docker -v
Docker version 20.10.23, build 7155243
$ command -v gcloud
/usr/bin/gcloud
$ gcloud --version
Google Cloud SDK 406.0.0
alpha 2022.10.17
beta 2022.10.17
bq 2.0.79
bundled-python3-unix 3.9.12
core 2022.10.17
gcloud-crc32c 1.0.0
gsutil 5.14
$ TMPDIR=/tmp/tmp.ErNoguWltv
$ gcloud_ver=406.0.0
$ TAG=20230729-083458
$ CONTAINER=us.gcr.io/apache-beam-testing/jenkins/beam_go_sdk
Using container us.gcr.io/apache-beam-testing/jenkins/beam_go_sdk
$ ./gradlew :sdks:go:container:docker -Pdocker-repository-root=us.gcr.io/apache-beam-testing/jenkins -Pdocker-tag=20230729-083458 -Pcontainer-architecture-list=arm64,amd64 -Ppush-containers
To honour the JVM settings for this build a single-use Daemon process will be forked. See https://docs.gradle.org/7.6.2/userguide/gradle_daemon.html#sec:disabling_the_daemon.
Daemon will be stopped at the end of the build
Configuration on demand is an incubating feature.
Gradle Enterprise plugins resolution: https://plugins.gradle.org/m2
Enforcing Gradle Enterprise: https://ge.apache.org, allowUntrustedServer: false
> Task :buildSrc:compileJava NO-SOURCE
> Task :buildSrc:compileGroovy UP-TO-DATE
> Task :buildSrc:pluginDescriptors UP-TO-DATE
> Task :buildSrc:processResources UP-TO-DATE
> Task :buildSrc:classes UP-TO-DATE
> Task :buildSrc:jar UP-TO-DATE
> Task :buildSrc:assemble UP-TO-DATE
> Task :buildSrc:spotlessGroovy UP-TO-DATE
> Task :buildSrc:spotlessGroovyCheck UP-TO-DATE
> Task :buildSrc:spotlessGroovyGradle UP-TO-DATE
> Task :buildSrc:spotlessGroovyGradleCheck UP-TO-DATE
> Task :buildSrc:spotlessCheck UP-TO-DATE
> Task :buildSrc:compileTestJava NO-SOURCE
> Task :buildSrc:compileTestGroovy NO-SOURCE
> Task :buildSrc:pluginUnderTestMetadata UP-TO-DATE
> Task :buildSrc:processTestResources NO-SOURCE
> Task :buildSrc:testClasses UP-TO-DATE
> Task :buildSrc:test NO-SOURCE
> Task :buildSrc:validatePlugins UP-TO-DATE
> Task :buildSrc:check UP-TO-DATE
> Task :buildSrc:build UP-TO-DATE
> Configure project :sdks:go:container
docker-pull-licenses not set, skipping go-licenses
System Go installation: /snap/bin/go is go version go1.16.15 linux/amd64; Preparing to use /home/jenkins/go/bin/go1.20.6
GOCMD=/home/jenkins/go/bin/go1.20.6
go1.20.6: already downloaded in /home/jenkins/sdk/go1.20.6
> Task :sdks:go:container:copyLicenses
> Task :sdks:go:container:dockerClean UP-TO-DATE
> Task :sdks:go:container:goPrepare UP-TO-DATE
> Task :sdks:go:container:goBuild
/home/jenkins/go/bin/go1.20.6 build -o ./build/target/linux_arm64/boot boot.go boot_test.go
/home/jenkins/go/bin/go1.20.6 build -o ./build/target/linux_amd64/boot boot.go boot_test.go
> Task :sdks:go:container:skipPullLicenses
> Task :sdks:go:container:dockerPrepare
ERROR: multiple platforms feature is currently not supported for docker driver. Please switch to a different driver (eg. "docker buildx create --use")
> Task :sdks:go:container:docker FAILED
FAILURE: Build failed with an exception.
* What went wrong:
Execution failed for task ':sdks:go:container:docker'.
16 actionable tasks: 5 executed, 11 up-to-date
> Process 'command 'docker'' finished with non-zero exit value 1
* Try:
> Run with --stacktrace option to get the stack trace.
> Run with --info or --debug option to get more log output.
* Get more help at https://help.gradle.org
BUILD FAILED in 33s
Publishing build scan...
https://ge.apache.org/s/xtsyfo33zl462
$ ./gradlew :sdks:go:container:docker -Pdocker-repository-root=us.gcr.io/apache-beam-testing/jenkins -Pdocker-tag=20230729-083458 -Pcontainer-architecture-list=arm64,amd64 -Ppush-containers
> Task :goIntegrationTests FAILED
FAILURE: Build failed with an exception.
* What went wrong:
Execution failed for task ':goIntegrationTests'.
> Process 'command 'sh'' finished with non-zero exit value 1
* Try:
> Run with --stacktrace option to get the stack trace.
> Run with --info or --debug option to get more log output.
* Get more help at https://help.gradle.org
Deprecated Gradle features were used in this build, making it incompatible with Gradle 8.0.
You can use '--warning-mode all' to show the individual deprecation warnings and determine if they come from your own scripts or plugins.
See https://docs.gradle.org/7.6.2/userguide/command_line_interface.html#sec:command_line_warnings
BUILD FAILED in 1m 9s
92 actionable tasks: 55 executed, 35 from cache, 2 up-to-date
Publishing build scan...
https://ge.apache.org/s/ni3j5b2hejsky
Build step 'Invoke Gradle script' changed build result to FAILURE
Build step 'Invoke Gradle script' marked build as failure
---------------------------------------------------------------------
To unsubscribe, e-mail: builds-unsubscribe@beam.apache.org
For additional commands, e-mail: builds-help@beam.apache.org
Jenkins build is back to normal : beam_PostCommit_Go #11593
Posted by Apache Jenkins Server <je...@builds.apache.org>.
See <https://ci-beam.apache.org/job/beam_PostCommit_Go/11593/display/redirect?page=changes>
---------------------------------------------------------------------
To unsubscribe, e-mail: builds-unsubscribe@beam.apache.org
For additional commands, e-mail: builds-help@beam.apache.org
Build failed in Jenkins: beam_PostCommit_Go #11592
Posted by Apache Jenkins Server <je...@builds.apache.org>.
See <https://ci-beam.apache.org/job/beam_PostCommit_Go/11592/display/redirect?page=changes>
Changes:
[noreply] Bump hbase client to 2.x (#27746)
------------------------------------------
[...truncated 16.96 KB...]
> Task :sdks:java:fn-execution:jar
> Task :sdks:java:extensions:avro:createCheckerFrameworkManifest
> Task :sdks:java:extensions:avro:generateAvroProtocol NO-SOURCE
> Task :sdks:java:extensions:avro:generateAvroJava NO-SOURCE
> Task :sdks:java:extensions:avro:compileJava FROM-CACHE
> Task :sdks:java:extensions:avro:processResources NO-SOURCE
> Task :sdks:java:extensions:avro:classes UP-TO-DATE
> Task :sdks:java:extensions:avro:jar
> Task :runners:core-construction-java:compileJava FROM-CACHE
> Task :runners:core-construction-java:processResources NO-SOURCE
> Task :runners:core-construction-java:classes UP-TO-DATE
> Task :runners:core-construction-java:jar
> Task :runners:core-java:createCheckerFrameworkManifest
> Task :runners:core-java:compileJava FROM-CACHE
> Task :runners:core-java:processResources NO-SOURCE
> Task :runners:core-java:classes UP-TO-DATE
> Task :runners:core-java:jar
> Task :runners:google-cloud-dataflow-java:createCheckerFrameworkManifest
> Task :sdks:java:extensions:google-cloud-platform-core:createCheckerFrameworkManifest
> Task :sdks:java:extensions:google-cloud-platform-core:compileJava FROM-CACHE
> Task :sdks:java:extensions:google-cloud-platform-core:processResources NO-SOURCE
> Task :sdks:java:extensions:google-cloud-platform-core:classes UP-TO-DATE
> Task :sdks:java:extensions:google-cloud-platform-core:jar
> Task :runners:java-fn-execution:createCheckerFrameworkManifest
> Task :sdks:java:harness:createCheckerFrameworkManifest
> Task :sdks:java:harness:compileJava FROM-CACHE
> Task :sdks:java:harness:processResources NO-SOURCE
> Task :sdks:java:harness:classes UP-TO-DATE
> Task :sdks:java:harness:jar
> Task :runners:java-fn-execution:compileJava FROM-CACHE
> Task :runners:java-fn-execution:processResources NO-SOURCE
> Task :runners:java-fn-execution:classes UP-TO-DATE
> Task :runners:java-fn-execution:jar
> Task :sdks:java:expansion-service:createCheckerFrameworkManifest
> Task :sdks:java:expansion-service:compileJava FROM-CACHE
> Task :sdks:java:expansion-service:processResources NO-SOURCE
> Task :sdks:java:expansion-service:classes UP-TO-DATE
> Task :sdks:java:expansion-service:jar
> Task :sdks:java:extensions:arrow:createCheckerFrameworkManifest
> Task :sdks:java:extensions:arrow:compileJava FROM-CACHE
> Task :sdks:java:extensions:arrow:processResources NO-SOURCE
> Task :sdks:java:extensions:arrow:classes UP-TO-DATE
> Task :sdks:java:extensions:arrow:jar
> Task :sdks:java:extensions:protobuf:createCheckerFrameworkManifest
> Task :sdks:java:extensions:protobuf:extractIncludeProto
> Task :sdks:java:extensions:protobuf:extractProto
> Task :sdks:java:extensions:protobuf:generateProto NO-SOURCE
> Task :sdks:java:extensions:protobuf:compileJava FROM-CACHE
> Task :sdks:java:extensions:protobuf:processResources NO-SOURCE
> Task :sdks:java:extensions:protobuf:classes UP-TO-DATE
> Task :sdks:java:extensions:protobuf:jar
> Task :sdks:java:io:google-cloud-platform:createCheckerFrameworkManifest
> Task :sdks:java:io:google-cloud-platform:compileJava FROM-CACHE
> Task :sdks:java:io:google-cloud-platform:processResources NO-SOURCE
> Task :sdks:java:io:google-cloud-platform:classes UP-TO-DATE
> Task :sdks:java:io:google-cloud-platform:jar
> Task :sdks:java:io:kafka:createCheckerFrameworkManifest
> Task :sdks:java:io:kafka:compileJava FROM-CACHE
> Task :sdks:java:io:kafka:processResources NO-SOURCE
> Task :sdks:java:io:kafka:classes UP-TO-DATE
> Task :sdks:java:io:kafka:jar
> Task :runners:google-cloud-dataflow-java:compileJava FROM-CACHE
> Task :runners:google-cloud-dataflow-java:processResources
> Task :runners:google-cloud-dataflow-java:classes
> Task :runners:google-cloud-dataflow-java:jar
> Task :runners:google-cloud-dataflow-java:worker:createCheckerFrameworkManifest
> Task :runners:google-cloud-dataflow-java:worker:windmill:createCheckerFrameworkManifest
> Task :runners:google-cloud-dataflow-java:worker:windmill:extractIncludeProto
> Task :runners:google-cloud-dataflow-java:worker:windmill:extractProto
> Task :runners:google-cloud-dataflow-java:worker:windmill:generateProto FROM-CACHE
> Task :runners:google-cloud-dataflow-java:worker:windmill:compileJava FROM-CACHE
> Task :runners:google-cloud-dataflow-java:worker:windmill:processResources
> Task :runners:google-cloud-dataflow-java:worker:windmill:classes
> Task :runners:google-cloud-dataflow-java:worker:windmill:shadowJar FROM-CACHE
> Task :runners:google-cloud-dataflow-java:worker:compileJava FROM-CACHE
> Task :runners:google-cloud-dataflow-java:worker:processResources
> Task :runners:google-cloud-dataflow-java:worker:classes
> Task :sdks:java:harness:shadowJar FROM-CACHE
> Task :runners:google-cloud-dataflow-java:worker:shadowJar FROM-CACHE
> Task :sdks:go:test:assemble UP-TO-DATE
> Task :sdks:go:test:test UP-TO-DATE
> Task :sdks:go:test:check UP-TO-DATE
> Task :sdks:go:test:build UP-TO-DATE
> Task :goIntegrationTests
$ CURRENT_DIRECTORY=<https://ci-beam.apache.org/job/beam_PostCommit_Go/ws/src/sdks/go/test>
$ TESTS=./test/integration/... ./test/regression
$ RUNNER=portable
$ TIMEOUT=3h
$ SIMULTANEOUS=3
$ GCS_LOCATION=gs://temp-storage-for-end-to-end-tests
$ GCS_SUBFOLDER=test19880
$ PROJECT=apache-beam-testing
$ DATAFLOW_PROJECT=apache-beam-testing
$ REGION=us-central1
$ trap exit_background_processes SIGINT SIGTERM EXIT
$ key=--runner
$ case --runner in
$ RUNNER=dataflow
$ cd <https://ci-beam.apache.org/job/beam_PostCommit_Go/ws/src>
$ test -d sdks/go/test
$ command -v docker
/usr/bin/docker
$ docker -v
Docker version 20.10.23, build 7155243
$ command -v gcloud
/usr/bin/gcloud
$ gcloud --version
Google Cloud SDK 406.0.0
alpha 2022.10.17
beta 2022.10.17
bq 2.0.79
bundled-python3-unix 3.9.12
core 2022.10.17
gcloud-crc32c 1.0.0
gsutil 5.14
$ TMPDIR=/tmp/tmp.YIO24TtY07
$ gcloud_ver=406.0.0
$ TAG=20230730-023500
$ CONTAINER=us.gcr.io/apache-beam-testing/jenkins/beam_go_sdk
Using container us.gcr.io/apache-beam-testing/jenkins/beam_go_sdk
$ ./gradlew :sdks:go:container:docker -Pdocker-repository-root=us.gcr.io/apache-beam-testing/jenkins -Pdocker-tag=20230730-023500 -Pcontainer-architecture-list=arm64,amd64 -Ppush-containers
To honour the JVM settings for this build a single-use Daemon process will be forked. See https://docs.gradle.org/7.6.2/userguide/gradle_daemon.html#sec:disabling_the_daemon.
Daemon will be stopped at the end of the build
Configuration on demand is an incubating feature.
Gradle Enterprise plugins resolution: https://plugins.gradle.org/m2
Enforcing Gradle Enterprise: https://ge.apache.org, allowUntrustedServer: false
> Task :buildSrc:compileJava NO-SOURCE
> Task :buildSrc:compileGroovy UP-TO-DATE
> Task :buildSrc:pluginDescriptors UP-TO-DATE
> Task :buildSrc:processResources UP-TO-DATE
> Task :buildSrc:classes UP-TO-DATE
> Task :buildSrc:jar UP-TO-DATE
> Task :buildSrc:assemble UP-TO-DATE
> Task :buildSrc:spotlessGroovy UP-TO-DATE
> Task :buildSrc:spotlessGroovyCheck UP-TO-DATE
> Task :buildSrc:spotlessGroovyGradle UP-TO-DATE
> Task :buildSrc:spotlessGroovyGradleCheck UP-TO-DATE
> Task :buildSrc:spotlessCheck UP-TO-DATE
> Task :buildSrc:compileTestJava NO-SOURCE
> Task :buildSrc:compileTestGroovy NO-SOURCE
> Task :buildSrc:pluginUnderTestMetadata UP-TO-DATE
> Task :buildSrc:processTestResources NO-SOURCE
> Task :buildSrc:testClasses UP-TO-DATE
> Task :buildSrc:test NO-SOURCE
> Task :buildSrc:validatePlugins UP-TO-DATE
> Task :buildSrc:check UP-TO-DATE
> Task :buildSrc:build UP-TO-DATE
> Configure project :sdks:go:container
docker-pull-licenses not set, skipping go-licenses
System Go installation: /snap/bin/go is go version go1.16.15 linux/amd64; Preparing to use /home/jenkins/go/bin/go1.20.6
GOCMD=/home/jenkins/go/bin/go1.20.6
go1.20.6: already downloaded in /home/jenkins/sdk/go1.20.6
> Task :sdks:go:container:copyLicenses
> Task :sdks:go:container:dockerClean UP-TO-DATE
> Task :sdks:go:container:goPrepare UP-TO-DATE
> Task :sdks:go:container:goBuild
/home/jenkins/go/bin/go1.20.6 build -o ./build/target/linux_arm64/boot boot.go boot_test.go
/home/jenkins/go/bin/go1.20.6 build -o ./build/target/linux_amd64/boot boot.go boot_test.go
> Task :sdks:go:container:skipPullLicenses
> Task :sdks:go:container:dockerPrepare
ERROR: multiple platforms feature is currently not supported for docker driver. Please switch to a different driver (eg. "docker buildx create --use")
> Task :sdks:go:container:docker
FAILED
FAILURE: Build failed with an exception.
* What went wrong:
Execution failed for task ':sdks:go:container:docker'.
> Process 'command 'docker'' finished with non-zero exit value 1
* Try:
> Run with --stacktrace option to get the stack trace.
> Run with --info or --debug option to get more log output.
* Get more help at https://help.gradle.org
BUILD FAILED in 24s
16 actionable tasks: 5 executed, 11 up-to-date
Publishing build scan...
Publishing failed.
The response from https://ge.apache.org/scans/publish/gradle/3.13.2/token was not from Gradle Enterprise.
The specified server address may be incorrect, or your network environment may be interfering.
Please report this problem to your Gradle Enterprise administrator via https://ge.apache.org/help and include the following via copy/paste:
----------
Gradle version: 7.6.2
Plugin version: 3.13.2
Request URL: https://ge.apache.org/scans/publish/gradle/3.13.2/token
Request ID: 48e0a781-1941-4c32-b841-9625f1d2dd1b
Response status code: 502
Response content type: text/html
----------
$ ./gradlew :sdks:go:container:docker -Pdocker-repository-root=us.gcr.io/apache-beam-testing/jenkins -Pdocker-tag=20230730-023500 -Pcontainer-architecture-list=arm64,amd64 -Ppush-containers
> Task :goIntegrationTests FAILED
FAILURE: Build failed with an exception.
* What went wrong:
Execution failed for task ':goIntegrationTests'.
> Process 'command 'sh'' finished with non-zero exit value 1
* Try:
> Run with --stacktrace option to get the stack trace.
> Run with --info or --debug option to get more log output.
* Get more help at https://help.gradle.org
Deprecated Gradle features were used in this build, making it incompatible with Gradle 8.0.
You can use '--warning-mode all' to show the individual deprecation warnings and determine if they come from your own scripts or plugins.
See https://docs.gradle.org/7.6.2/userguide/command_line_interface.html#sec:command_line_warnings
BUILD FAILED in 1m
92 actionable tasks: 55 executed, 35 from cache, 2 up-to-date
Publishing build scan...
Publishing build scan failed due to network error 'java.net.SocketTimeoutException: Read timed out' (2 retries remaining)...
Publishing build scan failed due to network error 'java.net.SocketTimeoutException: Read timed out' (1 retry remaining)...
Publishing failed.
The response from https://ge.apache.org/scans/publish/gradle/3.13.2/token was not from Gradle Enterprise.
The specified server address may be incorrect, or your network environment may be interfering.
Please report this problem to your Gradle Enterprise administrator via https://ge.apache.org/help and include the following via copy/paste:
----------
Gradle version: 7.6.2
Plugin version: 3.13.2
Request URL: https://ge.apache.org/scans/publish/gradle/3.13.2/token
Request ID: 7a9ad432-0926-498a-bda7-21c91751fc8e
Response status code: 502
Response content type: text/html
----------
Build step 'Invoke Gradle script' changed build result to FAILURE
Build step 'Invoke Gradle script' marked build as failure
---------------------------------------------------------------------
To unsubscribe, e-mail: builds-unsubscribe@beam.apache.org
For additional commands, e-mail: builds-help@beam.apache.org
Build failed in Jenkins: beam_PostCommit_Go #11591
Posted by Apache Jenkins Server <je...@builds.apache.org>.
See <https://ci-beam.apache.org/job/beam_PostCommit_Go/11591/display/redirect>
Changes:
------------------------------------------
[...truncated 9.38 KB...]
> Task :model:pipeline:processResources
> Task :model:pipeline:classes
> Task :model:pipeline:jar
> Task :model:fn-execution:extractIncludeProto
> Task :model:fn-execution:extractProto
> Task :model:fn-execution:generateProto FROM-CACHE
> Task :model:fn-execution:compileJava FROM-CACHE
> Task :model:fn-execution:processResources
> Task :model:fn-execution:classes
> Task :model:pipeline:shadowJar FROM-CACHE
> Task :model:fn-execution:shadowJar FROM-CACHE
> Task :model:job-management:createCheckerFrameworkManifest
> Task :model:job-management:extractIncludeProto
> Task :model:job-management:extractProto
> Task :model:job-management:generateProto FROM-CACHE
> Task :model:job-management:compileJava FROM-CACHE
> Task :model:job-management:processResources
> Task :model:job-management:classes
> Task :model:job-management:shadowJar FROM-CACHE
> Task :runners:core-construction-java:createCheckerFrameworkManifest
> Task :sdks:java:core:createCheckerFrameworkManifest
> Task :sdks:java:core:generateAvroProtocol NO-SOURCE
> Task :sdks:java:core:generateAvroJava NO-SOURCE
> Task :sdks:java:core:generateGrammarSource FROM-CACHE
> Task :sdks:java:core:compileJava FROM-CACHE
> Task :sdks:java:core:processResources
> Task :sdks:java:core:classes
> Task :sdks:java:core:shadowJar FROM-CACHE
> Task :sdks:java:fn-execution:createCheckerFrameworkManifest
> Task :sdks:java:fn-execution:compileJava FROM-CACHE
> Task :sdks:java:fn-execution:processResources NO-SOURCE
> Task :sdks:java:fn-execution:classes UP-TO-DATE
> Task :sdks:java:fn-execution:jar
> Task :sdks:java:extensions:avro:createCheckerFrameworkManifest
> Task :sdks:java:extensions:avro:generateAvroProtocol NO-SOURCE
> Task :sdks:java:extensions:avro:generateAvroJava NO-SOURCE
> Task :sdks:java:extensions:avro:compileJava FROM-CACHE
> Task :sdks:java:extensions:avro:processResources NO-SOURCE
> Task :sdks:java:extensions:avro:classes UP-TO-DATE
> Task :sdks:java:extensions:avro:jar
> Task :runners:core-construction-java:compileJava FROM-CACHE
> Task :runners:core-construction-java:processResources NO-SOURCE
> Task :runners:core-construction-java:classes UP-TO-DATE
> Task :runners:core-construction-java:jar
> Task :runners:core-java:createCheckerFrameworkManifest
> Task :runners:core-java:compileJava FROM-CACHE
> Task :runners:core-java:processResources NO-SOURCE
> Task :runners:core-java:classes UP-TO-DATE
> Task :runners:core-java:jar
> Task :runners:google-cloud-dataflow-java:createCheckerFrameworkManifest
> Task :sdks:java:extensions:google-cloud-platform-core:createCheckerFrameworkManifest
> Task :sdks:java:extensions:google-cloud-platform-core:compileJava FROM-CACHE
> Task :sdks:java:extensions:google-cloud-platform-core:processResources NO-SOURCE
> Task :sdks:java:extensions:google-cloud-platform-core:classes UP-TO-DATE
> Task :sdks:java:extensions:google-cloud-platform-core:jar
> Task :runners:java-fn-execution:createCheckerFrameworkManifest
> Task :sdks:java:harness:createCheckerFrameworkManifest
> Task :sdks:java:harness:compileJava FROM-CACHE
> Task :sdks:java:harness:processResources NO-SOURCE
> Task :sdks:java:harness:classes UP-TO-DATE
> Task :sdks:java:harness:jar
> Task :runners:java-fn-execution:compileJava FROM-CACHE
> Task :runners:java-fn-execution:processResources NO-SOURCE
> Task :runners:java-fn-execution:classes UP-TO-DATE
> Task :runners:java-fn-execution:jar
> Task :sdks:java:expansion-service:createCheckerFrameworkManifest
> Task :sdks:java:expansion-service:compileJava FROM-CACHE
> Task :sdks:java:expansion-service:processResources NO-SOURCE
> Task :sdks:java:expansion-service:classes UP-TO-DATE
> Task :sdks:java:expansion-service:jar
> Task :sdks:java:extensions:arrow:createCheckerFrameworkManifest
> Task :sdks:java:extensions:arrow:compileJava FROM-CACHE
> Task :sdks:java:extensions:arrow:processResources NO-SOURCE
> Task :sdks:java:extensions:arrow:classes UP-TO-DATE
> Task :sdks:java:extensions:arrow:jar
> Task :sdks:java:extensions:protobuf:createCheckerFrameworkManifest
> Task :sdks:java:extensions:protobuf:extractIncludeProto
> Task :sdks:java:extensions:protobuf:extractProto
> Task :sdks:java:extensions:protobuf:generateProto NO-SOURCE
> Task :sdks:java:extensions:protobuf:compileJava FROM-CACHE
> Task :sdks:java:extensions:protobuf:processResources NO-SOURCE
> Task :sdks:java:extensions:protobuf:classes UP-TO-DATE
> Task :sdks:java:extensions:protobuf:jar
> Task :sdks:java:io:google-cloud-platform:createCheckerFrameworkManifest
> Task :sdks:java:io:google-cloud-platform:compileJava FROM-CACHE
> Task :sdks:java:io:google-cloud-platform:processResources NO-SOURCE
> Task :sdks:java:io:google-cloud-platform:classes UP-TO-DATE
> Task :sdks:java:io:google-cloud-platform:jar
> Task :sdks:java:io:kafka:createCheckerFrameworkManifest
> Task :sdks:java:io:kafka:compileJava FROM-CACHE
> Task :sdks:java:io:kafka:processResources NO-SOURCE
> Task :sdks:java:io:kafka:classes UP-TO-DATE
> Task :sdks:java:io:kafka:jar
> Task :runners:google-cloud-dataflow-java:compileJava FROM-CACHE
> Task :runners:google-cloud-dataflow-java:processResources
> Task :runners:google-cloud-dataflow-java:classes
> Task :runners:google-cloud-dataflow-java:jar
> Task :runners:google-cloud-dataflow-java:worker:createCheckerFrameworkManifest
> Task :runners:google-cloud-dataflow-java:worker:windmill:createCheckerFrameworkManifest
> Task :runners:google-cloud-dataflow-java:worker:windmill:extractIncludeProto
> Task :runners:google-cloud-dataflow-java:worker:windmill:extractProto
> Task :runners:google-cloud-dataflow-java:worker:windmill:generateProto FROM-CACHE
> Task :runners:google-cloud-dataflow-java:worker:windmill:compileJava FROM-CACHE
> Task :runners:google-cloud-dataflow-java:worker:windmill:processResources
> Task :runners:google-cloud-dataflow-java:worker:windmill:classes
> Task :runners:google-cloud-dataflow-java:worker:windmill:shadowJar FROM-CACHE
> Task :runners:google-cloud-dataflow-java:worker:compileJava FROM-CACHE
> Task :runners:google-cloud-dataflow-java:worker:processResources
> Task :runners:google-cloud-dataflow-java:worker:classes
> Task :sdks:java:harness:shadowJar FROM-CACHE
> Task :runners:google-cloud-dataflow-java:worker:shadowJar FROM-CACHE
> Task :sdks:go:test:assemble UP-TO-DATE
> Task :sdks:go:test:test UP-TO-DATE
> Task :sdks:go:test:check UP-TO-DATE
> Task :sdks:go:test:build UP-TO-DATE
> Task :goIntegrationTests
$ CURRENT_DIRECTORY=<https://ci-beam.apache.org/job/beam_PostCommit_Go/ws/src/sdks/go/test>
$ TESTS=./test/integration/... ./test/regression
$ RUNNER=portable
$ TIMEOUT=3h
$ SIMULTANEOUS=3
$ GCS_LOCATION=gs://temp-storage-for-end-to-end-tests
$ GCS_SUBFOLDER=test11815
$ PROJECT=apache-beam-testing
$ DATAFLOW_PROJECT=apache-beam-testing
$ REGION=us-central1
$ trap exit_background_processes SIGINT SIGTERM EXIT
$ key=--runner
$ case --runner in
$ RUNNER=dataflow
$ cd <https://ci-beam.apache.org/job/beam_PostCommit_Go/ws/src>
$ test -d sdks/go/test
$ command -v docker
/usr/bin/docker
$ docker -v
Docker version 20.10.23, build 7155243
$ command -v gcloud
/usr/bin/gcloud
$ gcloud --version
Google Cloud SDK 406.0.0
alpha 2022.10.17
beta 2022.10.17
bq 2.0.79
bundled-python3-unix 3.9.12
core 2022.10.17
gcloud-crc32c 1.0.0
gsutil 5.14
$ TMPDIR=/tmp/tmp.HMk2ptwLpY
$ gcloud_ver=406.0.0
$ TAG=20230729-203455
$ CONTAINER=us.gcr.io/apache-beam-testing/jenkins/beam_go_sdk
Using container us.gcr.io/apache-beam-testing/jenkins/beam_go_sdk
$ ./gradlew :sdks:go:container:docker -Pdocker-repository-root=us.gcr.io/apache-beam-testing/jenkins -Pdocker-tag=20230729-203455 -Pcontainer-architecture-list=arm64,amd64 -Ppush-containers
To honour the JVM settings for this build a single-use Daemon process will be forked. See https://docs.gradle.org/7.6.2/userguide/gradle_daemon.html#sec:disabling_the_daemon.
Daemon will be stopped at the end of the build
Configuration on demand is an incubating feature.
Gradle Enterprise plugins resolution: https://plugins.gradle.org/m2
Enforcing Gradle Enterprise: https://ge.apache.org, allowUntrustedServer: false
> Task :buildSrc:compileJava NO-SOURCE
> Task :buildSrc:compileGroovy UP-TO-DATE
> Task :buildSrc:pluginDescriptors UP-TO-DATE
> Task :buildSrc:processResources UP-TO-DATE
> Task :buildSrc:classes UP-TO-DATE
> Task :buildSrc:jar UP-TO-DATE
> Task :buildSrc:assemble UP-TO-DATE
> Task :buildSrc:spotlessGroovy UP-TO-DATE
> Task :buildSrc:spotlessGroovyCheck UP-TO-DATE
> Task :buildSrc:spotlessGroovyGradle UP-TO-DATE
> Task :buildSrc:spotlessGroovyGradleCheck UP-TO-DATE
> Task :buildSrc:spotlessCheck UP-TO-DATE
> Task :buildSrc:compileTestJava NO-SOURCE
> Task :buildSrc:compileTestGroovy NO-SOURCE
> Task :buildSrc:pluginUnderTestMetadata UP-TO-DATE
> Task :buildSrc:processTestResources NO-SOURCE
> Task :buildSrc:testClasses UP-TO-DATE
> Task :buildSrc:test NO-SOURCE
> Task :buildSrc:validatePlugins UP-TO-DATE
> Task :buildSrc:check UP-TO-DATE
> Task :buildSrc:build UP-TO-DATE
> Configure project :sdks:go:container
docker-pull-licenses not set, skipping go-licenses
System Go installation: /snap/bin/go is go version go1.16.15 linux/amd64; Preparing to use /home/jenkins/go/bin/go1.20.6
GOCMD=/home/jenkins/go/bin/go1.20.6
go1.20.6: already downloaded in /home/jenkins/sdk/go1.20.6
> Task :sdks:go:container:copyLicenses
> Task :sdks:go:container:dockerClean UP-TO-DATE
> Task :sdks:go:container:goPrepare UP-TO-DATE
> Task :sdks:go:container:goBuild
/home/jenkins/go/bin/go1.20.6 build -o ./build/target/linux_arm64/boot boot.go boot_test.go
/home/jenkins/go/bin/go1.20.6 build -o ./build/target/linux_amd64/boot boot.go boot_test.go
> Task :sdks:go:container:skipPullLicenses
> Task :sdks:go:container:dockerPrepare
> Task :sdks:go:container:docker FAILED
ERROR: multiple platforms feature is currently not supported for docker driver. Please switch to a different driver (eg. "docker buildx create --use")
FAILURE: Build failed with an exception.
* What went wrong:
Execution failed for task ':sdks:go:container:docker'.
> Process 'command 'docker'' finished with non-zero exit value 1
* Try:
> Run with --stacktrace option to get the stack trace.
> Run with --info or --debug option to get more log output.
* Get more help at https://help.gradle.org
BUILD FAILED in 20s
16 actionable tasks: 5 executed, 11 up-to-date
Publishing build scan...
https://ge.apache.org/s/jm6bbhxgkeyxe
$ ./gradlew :sdks:go:container:docker -Pdocker-repository-root=us.gcr.io/apache-beam-testing/jenkins -Pdocker-tag=20230729-203455 -Pcontainer-architecture-list=arm64,amd64 -Ppush-containers
> Task :goIntegrationTests FAILED
FAILURE: Build failed with an exception.
* What went wrong:
Execution failed for task ':goIntegrationTests'.
> Process 'command 'sh'' finished with non-zero exit value 1
* Try:
> Run with --stacktrace option to get the stack trace.
> Run with --info or --debug option to get more log output.
* Get more help at https://help.gradle.org
Deprecated Gradle features were used in this build, making it incompatible with Gradle 8.0.
You can use '--warning-mode all' to show the individual deprecation warnings and determine if they come from your own scripts or plugins.
See https://docs.gradle.org/7.6.2/userguide/command_line_interface.html#sec:command_line_warnings
BUILD FAILED in 53s
92 actionable tasks: 55 executed, 35 from cache, 2 up-to-date
Publishing build scan...
https://ge.apache.org/s/ci3jkrwmhnnms
Build step 'Invoke Gradle script' changed build result to FAILURE
Build step 'Invoke Gradle script' marked build as failure
---------------------------------------------------------------------
To unsubscribe, e-mail: builds-unsubscribe@beam.apache.org
For additional commands, e-mail: builds-help@beam.apache.org
Build failed in Jenkins: beam_PostCommit_Go #11590
Posted by Apache Jenkins Server <je...@builds.apache.org>.
See <https://ci-beam.apache.org/job/beam_PostCommit_Go/11590/display/redirect>
Changes:
------------------------------------------
[...truncated 9.38 KB...]
> Task :model:pipeline:processResources
> Task :model:pipeline:classes
> Task :model:pipeline:jar
> Task :model:fn-execution:extractIncludeProto
> Task :model:fn-execution:extractProto
> Task :model:fn-execution:generateProto FROM-CACHE
> Task :model:fn-execution:compileJava FROM-CACHE
> Task :model:fn-execution:processResources
> Task :model:fn-execution:classes
> Task :model:pipeline:shadowJar FROM-CACHE
> Task :model:fn-execution:shadowJar FROM-CACHE
> Task :model:job-management:createCheckerFrameworkManifest
> Task :model:job-management:extractIncludeProto
> Task :model:job-management:extractProto
> Task :model:job-management:generateProto FROM-CACHE
> Task :model:job-management:compileJava FROM-CACHE
> Task :model:job-management:processResources
> Task :model:job-management:classes
> Task :model:job-management:shadowJar FROM-CACHE
> Task :runners:core-construction-java:createCheckerFrameworkManifest
> Task :sdks:java:core:createCheckerFrameworkManifest
> Task :sdks:java:core:generateAvroProtocol NO-SOURCE
> Task :sdks:java:core:generateAvroJava NO-SOURCE
> Task :sdks:java:core:generateGrammarSource FROM-CACHE
> Task :sdks:java:core:compileJava FROM-CACHE
> Task :sdks:java:core:processResources
> Task :sdks:java:core:classes
> Task :sdks:java:core:shadowJar FROM-CACHE
> Task :sdks:java:fn-execution:createCheckerFrameworkManifest
> Task :sdks:java:fn-execution:compileJava FROM-CACHE
> Task :sdks:java:fn-execution:processResources NO-SOURCE
> Task :sdks:java:fn-execution:classes UP-TO-DATE
> Task :sdks:java:fn-execution:jar
> Task :sdks:java:extensions:avro:createCheckerFrameworkManifest
> Task :sdks:java:extensions:avro:generateAvroProtocol NO-SOURCE
> Task :sdks:java:extensions:avro:generateAvroJava NO-SOURCE
> Task :sdks:java:extensions:avro:compileJava FROM-CACHE
> Task :sdks:java:extensions:avro:processResources NO-SOURCE
> Task :sdks:java:extensions:avro:classes UP-TO-DATE
> Task :sdks:java:extensions:avro:jar
> Task :runners:core-construction-java:processResources NO-SOURCE
> Task :runners:core-construction-java:compileJava FROM-CACHE
> Task :runners:core-construction-java:classes UP-TO-DATE
> Task :runners:core-construction-java:jar
> Task :runners:core-java:createCheckerFrameworkManifest
> Task :runners:core-java:compileJava FROM-CACHE
> Task :runners:core-java:processResources NO-SOURCE
> Task :runners:core-java:classes UP-TO-DATE
> Task :runners:core-java:jar
> Task :runners:google-cloud-dataflow-java:createCheckerFrameworkManifest
> Task :sdks:java:extensions:google-cloud-platform-core:createCheckerFrameworkManifest
> Task :sdks:java:extensions:google-cloud-platform-core:compileJava FROM-CACHE
> Task :sdks:java:extensions:google-cloud-platform-core:processResources NO-SOURCE
> Task :sdks:java:extensions:google-cloud-platform-core:classes UP-TO-DATE
> Task :sdks:java:extensions:google-cloud-platform-core:jar
> Task :runners:java-fn-execution:createCheckerFrameworkManifest
> Task :sdks:java:harness:createCheckerFrameworkManifest
> Task :sdks:java:harness:compileJava FROM-CACHE
> Task :sdks:java:harness:processResources NO-SOURCE
> Task :sdks:java:harness:classes UP-TO-DATE
> Task :sdks:java:harness:jar
> Task :runners:java-fn-execution:processResources NO-SOURCE
> Task :runners:java-fn-execution:compileJava FROM-CACHE
> Task :runners:java-fn-execution:classes UP-TO-DATE
> Task :runners:java-fn-execution:jar
> Task :sdks:java:expansion-service:createCheckerFrameworkManifest
> Task :sdks:java:expansion-service:compileJava FROM-CACHE
> Task :sdks:java:expansion-service:processResources NO-SOURCE
> Task :sdks:java:expansion-service:classes UP-TO-DATE
> Task :sdks:java:expansion-service:jar
> Task :sdks:java:extensions:arrow:createCheckerFrameworkManifest
> Task :sdks:java:extensions:arrow:compileJava FROM-CACHE
> Task :sdks:java:extensions:arrow:processResources NO-SOURCE
> Task :sdks:java:extensions:arrow:classes UP-TO-DATE
> Task :sdks:java:extensions:arrow:jar
> Task :sdks:java:extensions:protobuf:createCheckerFrameworkManifest
> Task :sdks:java:extensions:protobuf:extractIncludeProto
> Task :sdks:java:extensions:protobuf:extractProto
> Task :sdks:java:extensions:protobuf:generateProto NO-SOURCE
> Task :sdks:java:extensions:protobuf:compileJava FROM-CACHE
> Task :sdks:java:extensions:protobuf:processResources NO-SOURCE
> Task :sdks:java:extensions:protobuf:classes UP-TO-DATE
> Task :sdks:java:extensions:protobuf:jar
> Task :sdks:java:io:google-cloud-platform:createCheckerFrameworkManifest
> Task :sdks:java:io:google-cloud-platform:compileJava FROM-CACHE
> Task :sdks:java:io:google-cloud-platform:processResources NO-SOURCE
> Task :sdks:java:io:google-cloud-platform:classes UP-TO-DATE
> Task :sdks:java:io:google-cloud-platform:jar
> Task :sdks:java:io:kafka:createCheckerFrameworkManifest
> Task :sdks:java:io:kafka:compileJava FROM-CACHE
> Task :sdks:java:io:kafka:processResources NO-SOURCE
> Task :sdks:java:io:kafka:classes UP-TO-DATE
> Task :sdks:java:io:kafka:jar
> Task :runners:google-cloud-dataflow-java:processResources
> Task :runners:google-cloud-dataflow-java:compileJava FROM-CACHE
> Task :runners:google-cloud-dataflow-java:classes
> Task :runners:google-cloud-dataflow-java:jar
> Task :runners:google-cloud-dataflow-java:worker:createCheckerFrameworkManifest
> Task :runners:google-cloud-dataflow-java:worker:windmill:createCheckerFrameworkManifest
> Task :runners:google-cloud-dataflow-java:worker:windmill:extractIncludeProto
> Task :runners:google-cloud-dataflow-java:worker:windmill:extractProto
> Task :runners:google-cloud-dataflow-java:worker:windmill:generateProto FROM-CACHE
> Task :runners:google-cloud-dataflow-java:worker:windmill:compileJava FROM-CACHE
> Task :runners:google-cloud-dataflow-java:worker:windmill:processResources
> Task :runners:google-cloud-dataflow-java:worker:windmill:classes
> Task :runners:google-cloud-dataflow-java:worker:windmill:shadowJar FROM-CACHE
> Task :runners:google-cloud-dataflow-java:worker:compileJava FROM-CACHE
> Task :runners:google-cloud-dataflow-java:worker:processResources
> Task :runners:google-cloud-dataflow-java:worker:classes
> Task :sdks:java:harness:shadowJar FROM-CACHE
> Task :sdks:go:test:assemble UP-TO-DATE
> Task :runners:google-cloud-dataflow-java:worker:shadowJar FROM-CACHE
> Task :sdks:go:test:test UP-TO-DATE
> Task :sdks:go:test:check UP-TO-DATE
> Task :sdks:go:test:build UP-TO-DATE
> Task :goIntegrationTests
$ CURRENT_DIRECTORY=<https://ci-beam.apache.org/job/beam_PostCommit_Go/ws/src/sdks/go/test>
$ TESTS=./test/integration/... ./test/regression
$ RUNNER=portable
$ TIMEOUT=3h
$ SIMULTANEOUS=3
$ GCS_LOCATION=gs://temp-storage-for-end-to-end-tests
$ GCS_SUBFOLDER=test30818
$ PROJECT=apache-beam-testing
$ DATAFLOW_PROJECT=apache-beam-testing
$ REGION=us-central1
$ trap exit_background_processes SIGINT SIGTERM EXIT
$ key=--runner
$ case --runner in
$ RUNNER=dataflow
$ cd <https://ci-beam.apache.org/job/beam_PostCommit_Go/ws/src>
$ test -d sdks/go/test
$ command -v docker
/usr/bin/docker
$ docker -v
Docker version 20.10.23, build 7155243
$ command -v gcloud
/usr/bin/gcloud
$ gcloud --version
Google Cloud SDK 406.0.0
alpha 2022.10.17
beta 2022.10.17
bq 2.0.79
bundled-python3-unix 3.9.12
core 2022.10.17
gcloud-crc32c 1.0.0
gsutil 5.14
$ TMPDIR=/tmp/tmp.Zs2nWBf0g5
$ gcloud_ver=406.0.0
$ TAG=20230729-143459
$ CONTAINER=us.gcr.io/apache-beam-testing/jenkins/beam_go_sdk
Using container us.gcr.io/apache-beam-testing/jenkins/beam_go_sdk
$ ./gradlew :sdks:go:container:docker -Pdocker-repository-root=us.gcr.io/apache-beam-testing/jenkins -Pdocker-tag=20230729-143459 -Pcontainer-architecture-list=arm64,amd64 -Ppush-containers
To honour the JVM settings for this build a single-use Daemon process will be forked. See https://docs.gradle.org/7.6.2/userguide/gradle_daemon.html#sec:disabling_the_daemon.
Daemon will be stopped at the end of the build
Configuration on demand is an incubating feature.
Gradle Enterprise plugins resolution: https://plugins.gradle.org/m2
Enforcing Gradle Enterprise: https://ge.apache.org, allowUntrustedServer: false
> Task :buildSrc:compileJava NO-SOURCE
> Task :buildSrc:compileGroovy UP-TO-DATE
> Task :buildSrc:pluginDescriptors UP-TO-DATE
> Task :buildSrc:processResources UP-TO-DATE
> Task :buildSrc:classes UP-TO-DATE
> Task :buildSrc:jar UP-TO-DATE
> Task :buildSrc:assemble UP-TO-DATE
> Task :buildSrc:spotlessGroovy UP-TO-DATE
> Task :buildSrc:spotlessGroovyCheck UP-TO-DATE
> Task :buildSrc:spotlessGroovyGradle UP-TO-DATE
> Task :buildSrc:spotlessGroovyGradleCheck UP-TO-DATE
> Task :buildSrc:spotlessCheck UP-TO-DATE
> Task :buildSrc:compileTestJava NO-SOURCE
> Task :buildSrc:compileTestGroovy NO-SOURCE
> Task :buildSrc:pluginUnderTestMetadata UP-TO-DATE
> Task :buildSrc:processTestResources NO-SOURCE
> Task :buildSrc:testClasses UP-TO-DATE
> Task :buildSrc:test NO-SOURCE
> Task :buildSrc:validatePlugins UP-TO-DATE
> Task :buildSrc:check UP-TO-DATE
> Task :buildSrc:build UP-TO-DATE
> Configure project :sdks:go:container
docker-pull-licenses not set, skipping go-licenses
System Go installation: /snap/bin/go is go version go1.16.15 linux/amd64; Preparing to use /home/jenkins/go/bin/go1.20.6
GOCMD=/home/jenkins/go/bin/go1.20.6
go1.20.6: already downloaded in /home/jenkins/sdk/go1.20.6
> Task :sdks:go:container:copyLicenses
> Task :sdks:go:container:dockerClean UP-TO-DATE
> Task :sdks:go:container:goPrepare UP-TO-DATE
> Task :sdks:go:container:goBuild
/home/jenkins/go/bin/go1.20.6 build -o ./build/target/linux_arm64/boot boot.go boot_test.go
/home/jenkins/go/bin/go1.20.6 build -o ./build/target/linux_amd64/boot boot.go boot_test.go
> Task :sdks:go:container:skipPullLicenses
> Task :sdks:go:container:dockerPrepare
ERROR: multiple platforms feature is currently not supported for docker driver. Please switch to a different driver (eg. "docker buildx create --use")
> Task :sdks:go:container:docker FAILED
FAILURE: Build failed with an exception.
* What went wrong:
Execution failed for task ':sdks:go:container:docker'.
> Process 'command 'docker'' finished with non-zero exit value 1
16 actionable tasks: 5 executed, 11 up-to-date
* Try:
> Run with --stacktrace option to get the stack trace.
> Run with --info or --debug option to get more log output.
* Get more help at https://help.gradle.org
BUILD FAILED in 22s
Publishing build scan...
https://ge.apache.org/s/ovckfagf6wi6w
$ ./gradlew :sdks:go:container:docker -Pdocker-repository-root=us.gcr.io/apache-beam-testing/jenkins -Pdocker-tag=20230729-143459 -Pcontainer-architecture-list=arm64,amd64 -Ppush-containers
> Task :goIntegrationTests FAILED
FAILURE: Build failed with an exception.
* What went wrong:
Execution failed for task ':goIntegrationTests'.
> Process 'command 'sh'' finished with non-zero exit value 1
* Try:
> Run with --stacktrace option to get the stack trace.
> Run with --info or --debug option to get more log output.
* Get more help at https://help.gradle.org
Deprecated Gradle features were used in this build, making it incompatible with Gradle 8.0.
You can use '--warning-mode all' to show the individual deprecation warnings and determine if they come from your own scripts or plugins.
See https://docs.gradle.org/7.6.2/userguide/command_line_interface.html#sec:command_line_warnings
BUILD FAILED in 56s
92 actionable tasks: 55 executed, 35 from cache, 2 up-to-date
Publishing build scan...
https://ge.apache.org/s/pq55i5xq4bppg
Build step 'Invoke Gradle script' changed build result to FAILURE
Build step 'Invoke Gradle script' marked build as failure
---------------------------------------------------------------------
To unsubscribe, e-mail: builds-unsubscribe@beam.apache.org
For additional commands, e-mail: builds-help@beam.apache.org