You are viewing a plain text version of this content. The canonical link for it is here.
Posted to builds@lucene.apache.org by Policeman Jenkins Server <je...@thetaphi.de> on 2020/09/19 09:57:49 UTC

[JENKINS] Lucene-Solr-master-Linux (64bit/jdk-12.0.2) - Build # 28071 - Unstable!

Build: https://jenkins.thetaphi.de/job/Lucene-Solr-master-Linux/28071/
Java: 64bit/jdk-12.0.2 -XX:-UseCompressedOops -XX:+UseSerialGC

2 tests failed.
FAILED:  org.apache.solr.update.TestInPlaceUpdatesDistrib.test

Error Message:
java.lang.Exception: Test abandoned because suite timeout was reached.

Stack Trace:
java.lang.Exception: Test abandoned because suite timeout was reached.
	at __randomizedtesting.SeedInfo.seed([55EEF15AC1F2AE66]:0)


FAILED:  org.apache.solr.update.TestInPlaceUpdatesDistrib.classMethod

Error Message:
java.lang.Exception: Suite timeout exceeded (>= 7200000 msec).

Stack Trace:
java.lang.Exception: Suite timeout exceeded (>= 7200000 msec).
	at __randomizedtesting.SeedInfo.seed([55EEF15AC1F2AE66]:0)




Build Log:
[...truncated 41739 lines...]
ERROR: The following test(s) have failed:
  - org.apache.solr.update.TestInPlaceUpdatesDistrib.test (:solr:core)
    Test output: /home/jenkins/workspace/Lucene-Solr-master-Linux/solr/core/build/test-results/test/outputs/OUTPUT-org.apache.solr.update.TestInPlaceUpdatesDistrib.txt
    Reproduce with: gradlew :solr:core:test --tests "org.apache.solr.update.TestInPlaceUpdatesDistrib" -Ptests.jvms=6 -Ptests.haltonfailure=false -Ptests.jvmargs=-XX:-UseCompressedOops -XX:+UseSerialGC -Ptests.seed=55EEF15AC1F2AE66 -Ptests.multiplier=3 -Ptests.badapples=false -Ptests.file.encoding=ISO-8859-1

  - org.apache.solr.update.TestInPlaceUpdatesDistrib.classMethod (:solr:core)
    Test output: /home/jenkins/workspace/Lucene-Solr-master-Linux/solr/core/build/test-results/test/outputs/OUTPUT-org.apache.solr.update.TestInPlaceUpdatesDistrib.txt
    Reproduce with: gradlew :solr:core:test --tests "org.apache.solr.update.TestInPlaceUpdatesDistrib" -Ptests.jvms=6 -Ptests.haltonfailure=false -Ptests.jvmargs=-XX:-UseCompressedOops -XX:+UseSerialGC -Ptests.seed=55EEF15AC1F2AE66 -Ptests.multiplier=3 -Ptests.badapples=false -Ptests.file.encoding=ISO-8859-1


Deprecated Gradle features were used in this build, making it incompatible with Gradle 7.0.
Use '--warning-mode all' to show the individual deprecation warnings.
See https://docs.gradle.org/6.4.1/userguide/command_line_interface.html#sec:command_line_warnings

BUILD SUCCESSFUL in 2h 26m 36s
837 actionable tasks: 837 executed
Build step 'Invoke Gradle script' changed build result to SUCCESS
Archiving artifacts
java.lang.InterruptedException: no matches found within 10000
	at hudson.FilePath$ValidateAntFileMask.hasMatch(FilePath.java:2875)
	at hudson.FilePath$ValidateAntFileMask.invoke(FilePath.java:2754)
	at hudson.FilePath$ValidateAntFileMask.invoke(FilePath.java:2735)
	at hudson.FilePath.act(FilePath.java:1076)
	at hudson.FilePath.act(FilePath.java:1059)
	at hudson.FilePath.validateAntFileMask(FilePath.java:2733)
	at hudson.tasks.ArtifactArchiver.perform(ArtifactArchiver.java:270)
	at hudson.tasks.BuildStepCompatibilityLayer.perform(BuildStepCompatibilityLayer.java:78)
	at hudson.tasks.BuildStepMonitor$1.perform(BuildStepMonitor.java:20)
	at hudson.model.AbstractBuild$AbstractBuildExecution.perform(AbstractBuild.java:804)
	at hudson.model.AbstractBuild$AbstractBuildExecution.performAllBuildSteps(AbstractBuild.java:753)
	at hudson.model.Build$BuildExecution.post2(Build.java:177)
	at hudson.model.AbstractBuild$AbstractBuildExecution.post(AbstractBuild.java:698)
	at hudson.model.Run.execute(Run.java:1919)
	at hudson.model.FreeStyleBuild.run(FreeStyleBuild.java:43)
	at hudson.model.ResourceController.execute(ResourceController.java:97)
	at hudson.model.Executor.run(Executor.java:428)
No artifacts found that match the file pattern "**/*.events,heapdumps/**,**/*_pid*.log". Configuration error?
[Java] Sleeping for 5 seconds due to JENKINS-32191...
[Java] Parsing console log (workspace: '/home/jenkins/workspace/Lucene-Solr-master-Linux')
[Java] Successfully parsed console log
[Java] -> found 0 issues (skipped 0 duplicates)
[Java] Skipping post processing
[Java] No filter has been set, publishing all 0 issues
[Java] Using reference build 'Lucene-Solr-master-Linux #28070' to compute new, fixed, and outstanding issues
[Java] Issues delta (vs. reference build): outstanding: 0, new: 0, fixed: 0
[Java] No quality gates have been set - skipping
[Java] Health report is disabled - skipping
[Java] Created analysis result for 0 issues (found 0 new issues, fixed 0 issues)
[Java] Attaching ResultAction with ID 'java' to run 'Lucene-Solr-master-Linux #28071'.
[Checks API] No suitable checks publisher found.
Recording test results
Build step 'Publish JUnit test result report' changed build result to UNSTABLE
[Checks API] No suitable checks publisher found.
Email was triggered for: Unstable (Test Failures)
Sending email for trigger: Unstable (Test Failures)

[JENKINS-Experimental-GC] Lucene-Solr-master-Linux (64bit/jdk-11.0.6) - Build # 28075 - Failure!

Posted by Policeman Jenkins Server <je...@thetaphi.de>.
Build: https://jenkins.thetaphi.de/job/Lucene-Solr-master-Linux/28075/
Java: 64bit/jdk-11.0.6 -XX:-UseCompressedOops -XX:+UnlockExperimentalVMOptions -XX:+UseZGC

All tests passed

Build Log:
[...truncated 1286 lines...]
# A fatal error has been detected by the Java Runtime Environment:
#
#  SIGILL (0x4) at pc=0x00007feae9359db2, pid=2316561, tid=2346536
#
# JRE version: OpenJDK Runtime Environment (11.0.6+10) (build 11.0.6+10)
# Java VM: OpenJDK 64-Bit Server VM (11.0.6+10, mixed mode, tiered, z gc, linux-amd64)
# Problematic frame:
# J 28218 c2 org.apache.solr.schema.TrieField.storedToIndexed(Lorg/apache/lucene/index/IndexableField;Lorg/apache/lucene/util/BytesRefBuilder;)V (155 bytes) @ 0x00007feae9359db2 [0x00007feae9358fc0+0x0000000000000df2]
#
# No core dump will be written. Core dumps have been disabled. To enable core dumping, try "ulimit -c unlimited" before starting Java again
#
# An error report file with more information is saved as:
# /home/jenkins/workspace/Lucene-Solr-master-Linux/solr/core/build/tmp/tests-cwd/hs_err_pid2316561.log
Could not load hsdis-amd64.so; library not loadable; PrintAssembly is disabled
#
# If you would like to submit a bug report, please visit:
#   https://github.com/AdoptOpenJDK/openjdk-support/issues
#
WARNING: Test org.apache.solr.schema.TestCloudSchemaless wrote 10,939,114 bytes of output.
WARNING: Test org.apache.solr.update.TestInPlaceUpdatesDistrib wrote 22,098,902 bytes of output.
WARNING: Test org.apache.solr.cloud.CloudExitableDirectoryReaderTest wrote 13,898,183 bytes of output.
WARNING: Test org.apache.solr.search.TestRandomCollapseQParserPlugin wrote 30,337,387 bytes of output.
WARNING: Test org.apache.solr.search.facet.TestJsonFacets wrote 28,274,612 bytes of output.
WARNING: Test org.apache.solr.cloud.ChaosMonkeyNothingIsSafeTest wrote 14,052,140 bytes of output.
WARNING: Test org.apache.solr.search.TestRangeQuery wrote 26,487,157 bytes of output.
WARNING: Test org.apache.solr.search.facet.TestCloudJSONFacetJoinDomain wrote 20,572,859 bytes of output.
WARNING: Test org.apache.solr.search.facet.TestCloudJSONFacetSKG wrote 20,311,566 bytes of output.
WARNING: Test org.apache.solr.request.TestIntervalFaceting wrote 24,555,851 bytes of output.
:solr:core:test (SUCCESS): 4162 test(s), 196 skipped

> Task :solr:core:test FAILED
> Task :solr:server:test NO-SOURCE
> Task :solr:solr-ref-guide:test NO-SOURCE
> Task :solr:solrj:test
:solr:solrj:test (SUCCESS): 1664 test(s), 19 skipped

> Task :solr:test-framework:test
:solr:test-framework:test (SUCCESS): 9 test(s)

> Task :solr:webapp:test NO-SOURCE
> Task :lucene:analysis:common:test
:lucene:analysis:common:test (SUCCESS): 1639 test(s), 9 skipped

> Task :lucene:analysis:icu:test
:lucene:analysis:icu:test (SUCCESS): 149 test(s), 11 skipped

> Task :lucene:analysis:kuromoji:test
:lucene:analysis:kuromoji:test (SUCCESS): 159 test(s), 7 skipped

> Task :lucene:analysis:morfologik:test
:lucene:analysis:morfologik:test (SUCCESS): 18 test(s)

> Task :lucene:analysis:nori:test
:lucene:analysis:nori:test (SUCCESS): 69 test(s), 4 skipped

> Task :lucene:analysis:opennlp:test
:lucene:analysis:opennlp:test (SUCCESS): 26 test(s)

> Task :lucene:analysis:phonetic:test
:lucene:analysis:phonetic:test (SUCCESS): 41 test(s)

> Task :lucene:analysis:smartcn:test
:lucene:analysis:smartcn:test (SUCCESS): 21 test(s)

> Task :lucene:analysis:stempel:test
:lucene:analysis:stempel:test (SUCCESS): 15 test(s)

> Task :solr:contrib:analysis-extras:test
:solr:contrib:analysis-extras:test (SUCCESS): 30 test(s)

> Task :solr:contrib:analytics:test
:solr:contrib:analytics:test (SUCCESS): 472 test(s)

> Task :solr:contrib:clustering:test
:solr:contrib:clustering:test (SUCCESS): 30 test(s)

> Task :solr:contrib:extraction:test
:solr:contrib:extraction:test (SUCCESS): 20 test(s)

> Task :solr:contrib:jaegertracer-configurator:test
:solr:contrib:jaegertracer-configurator:test (SUCCESS): 3 test(s)

> Task :solr:contrib:langid:test
:solr:contrib:langid:test (SUCCESS): 43 test(s)

> Task :solr:contrib:ltr:test
:solr:contrib:ltr:test (SUCCESS): 127 test(s), 1 skipped

> Task :solr:contrib:prometheus-exporter:test
:solr:contrib:prometheus-exporter:test (SUCCESS): 17 test(s), 5 skipped

> Task :solr:contrib:prometheus-exporter:cleanTaskTmp
> Task :solr:contrib:ltr:cleanTaskTmp
> Task :solr:contrib:langid:cleanTaskTmp
> Task :solr:contrib:jaegertracer-configurator:cleanTaskTmp
> Task :solr:contrib:extraction:cleanTaskTmp
> Task :solr:contrib:clustering:cleanTaskTmp
> Task :solr:contrib:analytics:cleanTaskTmp
> Task :solr:contrib:analysis-extras:cleanTaskTmp
> Task :lucene:analysis:stempel:cleanTaskTmp
> Task :lucene:analysis:smartcn:cleanTaskTmp
> Task :lucene:analysis:phonetic:cleanTaskTmp
> Task :lucene:analysis:opennlp:cleanTaskTmp
> Task :lucene:analysis:nori:cleanTaskTmp
> Task :lucene:analysis:morfologik:cleanTaskTmp
> Task :lucene:analysis:kuromoji:cleanTaskTmp
> Task :lucene:analysis:icu:cleanTaskTmp
> Task :lucene:analysis:common:cleanTaskTmp
> Task :solr:webapp:cleanTaskTmp
> Task :solr:test-framework:cleanTaskTmp
> Task :solr:solrj:cleanTaskTmp
> Task :solr:solr-ref-guide:cleanTaskTmp
> Task :solr:server:cleanTaskTmp
> Task :solr:core:cleanTaskTmp
> Task :lucene:test-framework:cleanTaskTmp
> Task :lucene:suggest:cleanTaskTmp
> Task :lucene:spatial3d:cleanTaskTmp
> Task :lucene:spatial-extras:cleanTaskTmp
> Task :lucene:sandbox:cleanTaskTmp
> Task :lucene:replicator:cleanTaskTmp
> Task :lucene:queryparser:cleanTaskTmp
> Task :lucene:queries:cleanTaskTmp
> Task :lucene:monitor:cleanTaskTmp
> Task :lucene:misc:cleanTaskTmp
> Task :lucene:memory:cleanTaskTmp
> Task :lucene:luke:cleanTaskTmp
> Task :lucene:join:cleanTaskTmp
> Task :lucene:highlighter:cleanTaskTmp
> Task :lucene:grouping:cleanTaskTmp
> Task :lucene:facet:cleanTaskTmp
> Task :lucene:expressions:cleanTaskTmp
> Task :lucene:demo:cleanTaskTmp
> Task :lucene:core:cleanTaskTmp
> Task :lucene:codecs:cleanTaskTmp
> Task :lucene:classification:cleanTaskTmp
> Task :lucene:benchmark:cleanTaskTmp
> Task :cleanGradleTmp
> Task :lucene:backward-codecs:check
> Task :lucene:benchmark:check
> Task :lucene:classification:check
> Task :lucene:codecs:check
> Task :lucene:core:check
> Task :lucene:demo:check
> Task :lucene:expressions:check
> Task :lucene:facet:check
> Task :lucene:grouping:check
> Task :lucene:highlighter:check
> Task :lucene:join:check
> Task :lucene:luke:check
> Task :lucene:memory:check
> Task :lucene:misc:check
> Task :lucene:monitor:check
> Task :lucene:queries:check
> Task :lucene:queryparser:check
> Task :lucene:replicator:check
> Task :lucene:sandbox:check
> Task :lucene:spatial-extras:check
> Task :lucene:spatial3d:check
> Task :lucene:suggest:check
> Task :lucene:test-framework:check
> Task :solr:contrib:check
> Task :solr:docker:check
> Task :solr:example:check
> Task :solr:packaging:check
> Task :solr:server:check

> Task :solr:solr-ref-guide:setupLazyProps
Building ref guide with:
  javadocLink -> https://docs.oracle.com/en/java/javase/11/docs/api/
  solrGuideDraftStatus -> DRAFT
  solrRootPath -> /home/jenkins/workspace/Lucene-Solr-master-Linux/solr/
  solrDocsVersion -> 9.0
  solrGuideVersionPath -> 9_0
  htmlSolrJavadocs -> https://lucene.apache.org/solr/9_0_0/
  htmlLuceneJavadocs -> https://lucene.apache.org/core/9_0_0/
  buildDate -> 2020-09-19
  buildYear -> 2020
  ivyCommonsCodec -> 1.13
  ivyDropwizardMetrics -> 4.1.5
  ivyLog4j -> 2.13.2
  ivyOpennlpTools -> 1.9.1
  ivyTika -> 1.24
  ivyZookeeper -> 3.6.2

> Task :solr:solr-ref-guide:prepareSources

> Task :solr:solr-ref-guide:buildNavDataFiles
Building up tree of all known pages
WARNING: An illegal reflective access operation has occurred
WARNING: Illegal reflective access by org.jruby.util.SecurityHelper (file:/home/jenkins/.gradle/caches/modules-2/files-2.1/org.jruby/jruby-core/9.2.6.0/653601d48b38528e76840c6eac1ae46e2dae1a74/jruby-core-9.2.6.0.jar) to field java.lang.reflect.Field.modifiers
WARNING: Please consider reporting this to the maintainers of org.jruby.util.SecurityHelper
WARNING: Use --illegal-access=warn to enable warnings of further illegal reflective access operations
WARNING: All illegal access operations will be denied in a future release
Looping over pages to build nav data
Creating /home/jenkins/workspace/Lucene-Solr-master-Linux/solr/solr-ref-guide/build/content/_data/scrollnav.json
Creating /home/jenkins/workspace/Lucene-Solr-master-Linux/solr/solr-ref-guide/build/content/_data/sidebar.json

> Task :solr:solr-ref-guide:jrubyPrepare
WARNING: An illegal reflective access operation has occurred
WARNING: Illegal reflective access by com.headius.backport9.modules.Modules (file:/home/jenkins/.gradle/caches/modules-2/files-2.1/org.jruby/jruby-complete/9.2.9.0/8e44ce7a1417966d89957bd766a148601e28828b/jruby-complete-9.2.9.0.jar) to method sun.nio.ch.NativeThread.signal(long)
WARNING: Please consider reporting this to the maintainers of com.headius.backport9.modules.Modules
WARNING: Use --illegal-access=warn to enable warnings of further illegal reflective access operations
WARNING: All illegal access operations will be denied in a future release
Successfully installed ffi-1.13.1-java
Successfully installed rb-inotify-0.10.1
Successfully installed rb-fsevent-0.10.4
Successfully installed sass-listen-4.0.0
Successfully installed forwardable-extended-2.6.0
Successfully installed listen-3.2.1

Ruby Sass has reached end-of-life and should no longer be used.

* If you use Sass as a command-line tool, we recommend using Dart Sass, the new
  primary implementation: https://sass-lang.com/install

* If you use Sass as a plug-in for a Ruby web framework, we recommend using the
  sassc gem: https://github.com/sass/sassc-ruby#readme

* For more details, please refer to the Sass blog:
  https://sass-lang.com/blog/posts/7828841

Successfully installed sass-3.7.4
Successfully installed public_suffix-4.0.6
Successfully installed temple-0.8.2
Successfully installed asciidoctor-2.0.10
Successfully installed safe_yaml-1.0.5
Successfully installed rouge-1.11.1
Successfully installed pathutil-0.16.2
Successfully installed mercenary-0.3.6
Successfully installed liquid-4.0.3
Successfully installed kramdown-1.17.0
Successfully installed jekyll-watch-1.5.1
Successfully installed jekyll-sass-converter-1.5.2
Successfully installed colorator-1.1.0
Successfully installed addressable-2.7.0
Successfully installed concurrent-ruby-1.0.5-java
Successfully installed tilt-2.0.10
Successfully installed slim-4.0.1
Successfully installed jekyll-3.5.2
Successfully installed jekyll-asciidoc-3.0.0
25 gems installed

> Task :solr:solr-ref-guide:buildSiteJekyll
WARNING: An illegal reflective access operation has occurred
WARNING: Illegal reflective access by com.headius.backport9.modules.Modules (file:/home/jenkins/.gradle/caches/modules-2/files-2.1/org.jruby/jruby-complete/9.2.9.0/8e44ce7a1417966d89957bd766a148601e28828b/jruby-complete-9.2.9.0.jar) to method sun.nio.ch.NativeThread.signal(long)
WARNING: Please consider reporting this to the maintainers of com.headius.backport9.modules.Modules
WARNING: Use --illegal-access=warn to enable warnings of further illegal reflective access operations
WARNING: All illegal access operations will be denied in a future release
Configuration file: /home/jenkins/workspace/Lucene-Solr-master-Linux/solr/solr-ref-guide/build/content/_config.yml
       Deprecation: The 'gems' configuration option has been renamed to 'plugins'. Please update your config file accordingly.
            Source: /home/jenkins/workspace/Lucene-Solr-master-Linux/solr/solr-ref-guide/build/content
       Destination: ../html-site
 Incremental build: disabled. Enable with --incremental
      Generating... 
                    done in 17.787 seconds.
 Auto-regeneration: disabled. Use --watch to enable.

> Task :solr:solr-ref-guide:buildSite
Processed 2432 links (1749 relative) to 3530 anchors in 245 files

> Task :solr:solr-ref-guide:check
> Task :solr:solrj:check
> Task :solr:test-framework:check
> Task :solr:webapp:check
> Task :lucene:analysis:common:check
> Task :lucene:analysis:icu:check
> Task :lucene:analysis:kuromoji:check
> Task :lucene:analysis:morfologik:check
> Task :lucene:analysis:nori:check
> Task :lucene:analysis:opennlp:check
> Task :lucene:analysis:phonetic:check
> Task :lucene:analysis:smartcn:check
> Task :lucene:analysis:stempel:check
> Task :solr:contrib:analysis-extras:check
> Task :solr:contrib:analytics:check
> Task :solr:contrib:clustering:check
> Task :solr:contrib:extraction:check
> Task :solr:contrib:jaegertracer-configurator:check
> Task :solr:contrib:langid:check
> Task :solr:contrib:ltr:check
> Task :solr:contrib:prometheus-exporter:check
> Task :solr:docker:package:check

FAILURE: Build failed with an exception.

* What went wrong:
Execution failed for task ':solr:core:test'.
> Process 'Gradle Test Executor 138' finished with non-zero exit value 134
  This problem might be caused by incorrect test process configuration.
  Please refer to the test execution section in the User Manual at https://docs.gradle.org/6.4.1/userguide/java_testing.html#sec:test_execution

* Try:
Run with --stacktrace option to get the stack trace. Run with --info or --debug option to get more log output. Run with --scan to get full insights.

* Get more help at https://help.gradle.org

Deprecated Gradle features were used in this build, making it incompatible with Gradle 7.0.
Use '--warning-mode all' to show the individual deprecation warnings.
See https://docs.gradle.org/6.4.1/userguide/command_line_interface.html#sec:command_line_warnings

BUILD FAILED in 47m 28s
836 actionable tasks: 836 executed
Build step 'Invoke Gradle script' changed build result to FAILURE
Build step 'Invoke Gradle script' marked build as failure
Archiving artifacts
[Java] Skipping execution of recorder since overall result is 'FAILURE'
Recording test results
[Checks API] No suitable checks publisher found.
Email was triggered for: Failure - Any
Sending email for trigger: Failure - Any

[JENKINS] Lucene-Solr-master-Linux (64bit/jdk-13.0.2) - Build # 28074 - Still Unstable!

Posted by Policeman Jenkins Server <je...@thetaphi.de>.
Build: https://jenkins.thetaphi.de/job/Lucene-Solr-master-Linux/28074/
Java: 64bit/jdk-13.0.2 -XX:+UseCompressedOops -XX:+UseConcMarkSweepGC

2 tests failed.
FAILED:  org.apache.solr.cloud.api.collections.TestHdfsCloudBackupRestore.test

Error Message:
java.lang.AssertionError: Node 127.0.0.1:38071_solr has 4 replicas. Expected num replicas : 2. state: 
DocCollection(hdfsbackuprestore_testok_restored/12)={
  "pullReplicas":0,
  "replicationFactor":2,
  "shards":{
    "shard2":{
      "range":null,
      "state":"active",
      "replicas":{
        "core_node2":{
          "core":"hdfsbackuprestore_testok_restored_shard2_replica_n1",
          "leader":"true",
          "core_node_name":"core_node2",
          "base_url":"https://127.0.0.1:38071/solr",
          "node_name":"127.0.0.1:38071_solr",
          "state":"active",
          "collection":"hdfsbackuprestore_testok_restored",
          "shard":"shard2",
          "type":"NRT",
          "force_set_state":"false"},
        "core_node6":{
          "core":"hdfsbackuprestore_testok_restored_shard2_replica_n5",
          "core_node_name":"core_node6",
          "base_url":"https://127.0.0.1:38071/solr",
          "node_name":"127.0.0.1:38071_solr",
          "state":"active",
          "collection":"hdfsbackuprestore_testok_restored",
          "shard":"shard2",
          "type":"NRT",
          "force_set_state":"false"}},
      "stateTimestamp":"1600530783897125525"},
    "shard1":{
      "range":null,
      "state":"active",
      "replicas":{
        "core_node4":{
          "core":"hdfsbackuprestore_testok_restored_shard1_replica_n3",
          "leader":"true",
          "core_node_name":"core_node4",
          "base_url":"https://127.0.0.1:38071/solr",
          "node_name":"127.0.0.1:38071_solr",
          "state":"active",
          "collection":"hdfsbackuprestore_testok_restored",
          "shard":"shard1",
          "type":"NRT",
          "force_set_state":"false"},
        "core_node8":{
          "core":"hdfsbackuprestore_testok_restored_shard1_replica_n7",
          "core_node_name":"core_node8",
          "base_url":"https://127.0.0.1:38071/solr",
          "node_name":"127.0.0.1:38071_solr",
          "state":"active",
          "collection":"hdfsbackuprestore_testok_restored",
          "shard":"shard1",
          "type":"NRT",
          "force_set_state":"false"}},
      "stateTimestamp":"1600530783897138540"}},
  "router":{
    "name":"implicit",
    "field":"shard_s"},
  "nrtReplicas":2,
  "tlogReplicas":0}

Stack Trace:
java.lang.AssertionError: Node 127.0.0.1:38071_solr has 4 replicas. Expected num replicas : 2. state: 
DocCollection(hdfsbackuprestore_testok_restored/12)={
  "pullReplicas":0,
  "replicationFactor":2,
  "shards":{
    "shard2":{
      "range":null,
      "state":"active",
      "replicas":{
        "core_node2":{
          "core":"hdfsbackuprestore_testok_restored_shard2_replica_n1",
          "leader":"true",
          "core_node_name":"core_node2",
          "base_url":"https://127.0.0.1:38071/solr",
          "node_name":"127.0.0.1:38071_solr",
          "state":"active",
          "collection":"hdfsbackuprestore_testok_restored",
          "shard":"shard2",
          "type":"NRT",
          "force_set_state":"false"},
        "core_node6":{
          "core":"hdfsbackuprestore_testok_restored_shard2_replica_n5",
          "core_node_name":"core_node6",
          "base_url":"https://127.0.0.1:38071/solr",
          "node_name":"127.0.0.1:38071_solr",
          "state":"active",
          "collection":"hdfsbackuprestore_testok_restored",
          "shard":"shard2",
          "type":"NRT",
          "force_set_state":"false"}},
      "stateTimestamp":"1600530783897125525"},
    "shard1":{
      "range":null,
      "state":"active",
      "replicas":{
        "core_node4":{
          "core":"hdfsbackuprestore_testok_restored_shard1_replica_n3",
          "leader":"true",
          "core_node_name":"core_node4",
          "base_url":"https://127.0.0.1:38071/solr",
          "node_name":"127.0.0.1:38071_solr",
          "state":"active",
          "collection":"hdfsbackuprestore_testok_restored",
          "shard":"shard1",
          "type":"NRT",
          "force_set_state":"false"},
        "core_node8":{
          "core":"hdfsbackuprestore_testok_restored_shard1_replica_n7",
          "core_node_name":"core_node8",
          "base_url":"https://127.0.0.1:38071/solr",
          "node_name":"127.0.0.1:38071_solr",
          "state":"active",
          "collection":"hdfsbackuprestore_testok_restored",
          "shard":"shard1",
          "type":"NRT",
          "force_set_state":"false"}},
      "stateTimestamp":"1600530783897138540"}},
  "router":{
    "name":"implicit",
    "field":"shard_s"},
  "nrtReplicas":2,
  "tlogReplicas":0}
	at __randomizedtesting.SeedInfo.seed([F34D98661660A49C:7B19A7BCB89CC964]:0)
	at org.junit.Assert.fail(Assert.java:88)
	at org.junit.Assert.assertTrue(Assert.java:41)
	at org.apache.solr.cloud.api.collections.AbstractCloudBackupRestoreTestCase.lambda$testBackupAndRestore$1(AbstractCloudBackupRestoreTestCase.java:374)
	at java.base/java.util.HashMap.forEach(HashMap.java:1338)
	at org.apache.solr.cloud.api.collections.AbstractCloudBackupRestoreTestCase.testBackupAndRestore(AbstractCloudBackupRestoreTestCase.java:373)
	at org.apache.solr.cloud.api.collections.AbstractCloudBackupRestoreTestCase.test(AbstractCloudBackupRestoreTestCase.java:155)
	at org.apache.solr.cloud.api.collections.TestHdfsCloudBackupRestore.test(TestHdfsCloudBackupRestore.java:225)
	at java.base/jdk.internal.reflect.NativeMethodAccessorImpl.invoke0(Native Method)
	at java.base/jdk.internal.reflect.NativeMethodAccessorImpl.invoke(NativeMethodAccessorImpl.java:62)
	at java.base/jdk.internal.reflect.DelegatingMethodAccessorImpl.invoke(DelegatingMethodAccessorImpl.java:43)
	at java.base/java.lang.reflect.Method.invoke(Method.java:567)
	at com.carrotsearch.randomizedtesting.RandomizedRunner.invoke(RandomizedRunner.java:1754)
	at com.carrotsearch.randomizedtesting.RandomizedRunner$8.evaluate(RandomizedRunner.java:942)
	at com.carrotsearch.randomizedtesting.RandomizedRunner$9.evaluate(RandomizedRunner.java:978)
	at com.carrotsearch.randomizedtesting.RandomizedRunner$10.evaluate(RandomizedRunner.java:992)
	at com.carrotsearch.randomizedtesting.rules.SystemPropertiesRestoreRule$1.evaluate(SystemPropertiesRestoreRule.java:57)
	at org.apache.lucene.util.TestRuleSetupTeardownChained$1.evaluate(TestRuleSetupTeardownChained.java:49)
	at org.apache.lucene.util.AbstractBeforeAfterRule$1.evaluate(AbstractBeforeAfterRule.java:45)
	at org.apache.lucene.util.TestRuleThreadAndTestName$1.evaluate(TestRuleThreadAndTestName.java:48)
	at org.apache.lucene.util.TestRuleIgnoreAfterMaxFailures$1.evaluate(TestRuleIgnoreAfterMaxFailures.java:64)
	at org.apache.lucene.util.TestRuleMarkFailure$1.evaluate(TestRuleMarkFailure.java:47)
	at com.carrotsearch.randomizedtesting.rules.StatementAdapter.evaluate(StatementAdapter.java:36)
	at com.carrotsearch.randomizedtesting.ThreadLeakControl$StatementRunner.run(ThreadLeakControl.java:370)
	at com.carrotsearch.randomizedtesting.ThreadLeakControl.forkTimeoutingTask(ThreadLeakControl.java:819)
	at com.carrotsearch.randomizedtesting.ThreadLeakControl$3.evaluate(ThreadLeakControl.java:470)
	at com.carrotsearch.randomizedtesting.RandomizedRunner.runSingleTest(RandomizedRunner.java:951)
	at com.carrotsearch.randomizedtesting.RandomizedRunner$5.evaluate(RandomizedRunner.java:836)
	at com.carrotsearch.randomizedtesting.RandomizedRunner$6.evaluate(RandomizedRunner.java:887)
	at com.carrotsearch.randomizedtesting.RandomizedRunner$7.evaluate(RandomizedRunner.java:898)
	at com.carrotsearch.randomizedtesting.rules.StatementAdapter.evaluate(StatementAdapter.java:36)
	at com.carrotsearch.randomizedtesting.rules.SystemPropertiesRestoreRule$1.evaluate(SystemPropertiesRestoreRule.java:57)
	at org.apache.lucene.util.AbstractBeforeAfterRule$1.evaluate(AbstractBeforeAfterRule.java:45)
	at com.carrotsearch.randomizedtesting.rules.StatementAdapter.evaluate(StatementAdapter.java:36)
	at org.apache.lucene.util.TestRuleStoreClassName$1.evaluate(TestRuleStoreClassName.java:41)
	at com.carrotsearch.randomizedtesting.rules.NoShadowingOrOverridesOnMethodsRule$1.evaluate(NoShadowingOrOverridesOnMethodsRule.java:40)
	at com.carrotsearch.randomizedtesting.rules.NoShadowingOrOverridesOnMethodsRule$1.evaluate(NoShadowingOrOverridesOnMethodsRule.java:40)
	at com.carrotsearch.randomizedtesting.rules.StatementAdapter.evaluate(StatementAdapter.java:36)
	at com.carrotsearch.randomizedtesting.rules.StatementAdapter.evaluate(StatementAdapter.java:36)
	at org.apache.lucene.util.TestRuleAssertionsRequired$1.evaluate(TestRuleAssertionsRequired.java:53)
	at org.apache.lucene.util.TestRuleMarkFailure$1.evaluate(TestRuleMarkFailure.java:47)
	at org.apache.lucene.util.TestRuleIgnoreAfterMaxFailures$1.evaluate(TestRuleIgnoreAfterMaxFailures.java:64)
	at org.apache.lucene.util.TestRuleIgnoreTestSuites$1.evaluate(TestRuleIgnoreTestSuites.java:54)
	at com.carrotsearch.randomizedtesting.rules.StatementAdapter.evaluate(StatementAdapter.java:36)
	at com.carrotsearch.randomizedtesting.ThreadLeakControl$StatementRunner.run(ThreadLeakControl.java:370)
	at com.carrotsearch.randomizedtesting.ThreadLeakControl.lambda$forkTimeoutingTask$0(ThreadLeakControl.java:826)
	at java.base/java.lang.Thread.run(Thread.java:830)


FAILED:  org.apache.solr.cloud.api.collections.TestLocalFSCloudBackupRestore.test

Error Message:
java.lang.AssertionError: Node 127.0.0.1:38227_solr has 4 replicas. Expected num replicas : 2. state: 
DocCollection(backuprestore_testok_restored/13)={
  "pullReplicas":0,
  "replicationFactor":2,
  "shards":{
    "shard2":{
      "range":null,
      "state":"active",
      "replicas":{
        "core_node2":{
          "core":"backuprestore_testok_restored_shard2_replica_n1",
          "leader":"true",
          "core_node_name":"core_node2",
          "base_url":"https://127.0.0.1:38227/solr",
          "node_name":"127.0.0.1:38227_solr",
          "state":"active",
          "collection":"backuprestore_testok_restored",
          "shard":"shard2",
          "type":"NRT",
          "force_set_state":"false"},
        "core_node6":{
          "core":"backuprestore_testok_restored_shard2_replica_n5",
          "core_node_name":"core_node6",
          "base_url":"https://127.0.0.1:38227/solr",
          "node_name":"127.0.0.1:38227_solr",
          "state":"active",
          "collection":"backuprestore_testok_restored",
          "shard":"shard2",
          "type":"NRT",
          "force_set_state":"false"}},
      "stateTimestamp":"1600530668280120762"},
    "shard1":{
      "range":null,
      "state":"active",
      "replicas":{
        "core_node4":{
          "core":"backuprestore_testok_restored_shard1_replica_n3",
          "leader":"true",
          "core_node_name":"core_node4",
          "base_url":"https://127.0.0.1:38227/solr",
          "node_name":"127.0.0.1:38227_solr",
          "state":"active",
          "collection":"backuprestore_testok_restored",
          "shard":"shard1",
          "type":"NRT",
          "force_set_state":"false"},
        "core_node8":{
          "core":"backuprestore_testok_restored_shard1_replica_n7",
          "core_node_name":"core_node8",
          "base_url":"https://127.0.0.1:38227/solr",
          "node_name":"127.0.0.1:38227_solr",
          "state":"active",
          "collection":"backuprestore_testok_restored",
          "shard":"shard1",
          "type":"NRT",
          "force_set_state":"false"}},
      "stateTimestamp":"1600530668280133867"}},
  "router":{
    "name":"implicit",
    "field":"shard_s"},
  "nrtReplicas":2,
  "tlogReplicas":0}

Stack Trace:
java.lang.AssertionError: Node 127.0.0.1:38227_solr has 4 replicas. Expected num replicas : 2. state: 
DocCollection(backuprestore_testok_restored/13)={
  "pullReplicas":0,
  "replicationFactor":2,
  "shards":{
    "shard2":{
      "range":null,
      "state":"active",
      "replicas":{
        "core_node2":{
          "core":"backuprestore_testok_restored_shard2_replica_n1",
          "leader":"true",
          "core_node_name":"core_node2",
          "base_url":"https://127.0.0.1:38227/solr",
          "node_name":"127.0.0.1:38227_solr",
          "state":"active",
          "collection":"backuprestore_testok_restored",
          "shard":"shard2",
          "type":"NRT",
          "force_set_state":"false"},
        "core_node6":{
          "core":"backuprestore_testok_restored_shard2_replica_n5",
          "core_node_name":"core_node6",
          "base_url":"https://127.0.0.1:38227/solr",
          "node_name":"127.0.0.1:38227_solr",
          "state":"active",
          "collection":"backuprestore_testok_restored",
          "shard":"shard2",
          "type":"NRT",
          "force_set_state":"false"}},
      "stateTimestamp":"1600530668280120762"},
    "shard1":{
      "range":null,
      "state":"active",
      "replicas":{
        "core_node4":{
          "core":"backuprestore_testok_restored_shard1_replica_n3",
          "leader":"true",
          "core_node_name":"core_node4",
          "base_url":"https://127.0.0.1:38227/solr",
          "node_name":"127.0.0.1:38227_solr",
          "state":"active",
          "collection":"backuprestore_testok_restored",
          "shard":"shard1",
          "type":"NRT",
          "force_set_state":"false"},
        "core_node8":{
          "core":"backuprestore_testok_restored_shard1_replica_n7",
          "core_node_name":"core_node8",
          "base_url":"https://127.0.0.1:38227/solr",
          "node_name":"127.0.0.1:38227_solr",
          "state":"active",
          "collection":"backuprestore_testok_restored",
          "shard":"shard1",
          "type":"NRT",
          "force_set_state":"false"}},
      "stateTimestamp":"1600530668280133867"}},
  "router":{
    "name":"implicit",
    "field":"shard_s"},
  "nrtReplicas":2,
  "tlogReplicas":0}
	at __randomizedtesting.SeedInfo.seed([F34D98661660A49C:7B19A7BCB89CC964]:0)
	at org.junit.Assert.fail(Assert.java:88)
	at org.junit.Assert.assertTrue(Assert.java:41)
	at org.apache.solr.cloud.api.collections.AbstractCloudBackupRestoreTestCase.lambda$testBackupAndRestore$1(AbstractCloudBackupRestoreTestCase.java:374)
	at java.base/java.util.HashMap.forEach(HashMap.java:1338)
	at org.apache.solr.cloud.api.collections.AbstractCloudBackupRestoreTestCase.testBackupAndRestore(AbstractCloudBackupRestoreTestCase.java:373)
	at org.apache.solr.cloud.api.collections.AbstractCloudBackupRestoreTestCase.test(AbstractCloudBackupRestoreTestCase.java:155)
	at org.apache.solr.cloud.api.collections.TestLocalFSCloudBackupRestore.test(TestLocalFSCloudBackupRestore.java:93)
	at java.base/jdk.internal.reflect.NativeMethodAccessorImpl.invoke0(Native Method)
	at java.base/jdk.internal.reflect.NativeMethodAccessorImpl.invoke(NativeMethodAccessorImpl.java:62)
	at java.base/jdk.internal.reflect.DelegatingMethodAccessorImpl.invoke(DelegatingMethodAccessorImpl.java:43)
	at java.base/java.lang.reflect.Method.invoke(Method.java:567)
	at com.carrotsearch.randomizedtesting.RandomizedRunner.invoke(RandomizedRunner.java:1754)
	at com.carrotsearch.randomizedtesting.RandomizedRunner$8.evaluate(RandomizedRunner.java:942)
	at com.carrotsearch.randomizedtesting.RandomizedRunner$9.evaluate(RandomizedRunner.java:978)
	at com.carrotsearch.randomizedtesting.RandomizedRunner$10.evaluate(RandomizedRunner.java:992)
	at com.carrotsearch.randomizedtesting.rules.SystemPropertiesRestoreRule$1.evaluate(SystemPropertiesRestoreRule.java:57)
	at org.apache.lucene.util.TestRuleSetupTeardownChained$1.evaluate(TestRuleSetupTeardownChained.java:49)
	at org.apache.lucene.util.AbstractBeforeAfterRule$1.evaluate(AbstractBeforeAfterRule.java:45)
	at org.apache.lucene.util.TestRuleThreadAndTestName$1.evaluate(TestRuleThreadAndTestName.java:48)
	at org.apache.lucene.util.TestRuleIgnoreAfterMaxFailures$1.evaluate(TestRuleIgnoreAfterMaxFailures.java:64)
	at org.apache.lucene.util.TestRuleMarkFailure$1.evaluate(TestRuleMarkFailure.java:47)
	at com.carrotsearch.randomizedtesting.rules.StatementAdapter.evaluate(StatementAdapter.java:36)
	at com.carrotsearch.randomizedtesting.ThreadLeakControl$StatementRunner.run(ThreadLeakControl.java:370)
	at com.carrotsearch.randomizedtesting.ThreadLeakControl.forkTimeoutingTask(ThreadLeakControl.java:819)
	at com.carrotsearch.randomizedtesting.ThreadLeakControl$3.evaluate(ThreadLeakControl.java:470)
	at com.carrotsearch.randomizedtesting.RandomizedRunner.runSingleTest(RandomizedRunner.java:951)
	at com.carrotsearch.randomizedtesting.RandomizedRunner$5.evaluate(RandomizedRunner.java:836)
	at com.carrotsearch.randomizedtesting.RandomizedRunner$6.evaluate(RandomizedRunner.java:887)
	at com.carrotsearch.randomizedtesting.RandomizedRunner$7.evaluate(RandomizedRunner.java:898)
	at com.carrotsearch.randomizedtesting.rules.StatementAdapter.evaluate(StatementAdapter.java:36)
	at com.carrotsearch.randomizedtesting.rules.SystemPropertiesRestoreRule$1.evaluate(SystemPropertiesRestoreRule.java:57)
	at org.apache.lucene.util.AbstractBeforeAfterRule$1.evaluate(AbstractBeforeAfterRule.java:45)
	at com.carrotsearch.randomizedtesting.rules.StatementAdapter.evaluate(StatementAdapter.java:36)
	at org.apache.lucene.util.TestRuleStoreClassName$1.evaluate(TestRuleStoreClassName.java:41)
	at com.carrotsearch.randomizedtesting.rules.NoShadowingOrOverridesOnMethodsRule$1.evaluate(NoShadowingOrOverridesOnMethodsRule.java:40)
	at com.carrotsearch.randomizedtesting.rules.NoShadowingOrOverridesOnMethodsRule$1.evaluate(NoShadowingOrOverridesOnMethodsRule.java:40)
	at com.carrotsearch.randomizedtesting.rules.StatementAdapter.evaluate(StatementAdapter.java:36)
	at com.carrotsearch.randomizedtesting.rules.StatementAdapter.evaluate(StatementAdapter.java:36)
	at org.apache.lucene.util.TestRuleAssertionsRequired$1.evaluate(TestRuleAssertionsRequired.java:53)
	at org.apache.lucene.util.TestRuleMarkFailure$1.evaluate(TestRuleMarkFailure.java:47)
	at org.apache.lucene.util.TestRuleIgnoreAfterMaxFailures$1.evaluate(TestRuleIgnoreAfterMaxFailures.java:64)
	at org.apache.lucene.util.TestRuleIgnoreTestSuites$1.evaluate(TestRuleIgnoreTestSuites.java:54)
	at com.carrotsearch.randomizedtesting.rules.StatementAdapter.evaluate(StatementAdapter.java:36)
	at com.carrotsearch.randomizedtesting.ThreadLeakControl$StatementRunner.run(ThreadLeakControl.java:370)
	at com.carrotsearch.randomizedtesting.ThreadLeakControl.lambda$forkTimeoutingTask$0(ThreadLeakControl.java:826)
	at java.base/java.lang.Thread.run(Thread.java:830)




Build Log:
[...truncated 5681 lines...]
ERROR: The following test(s) have failed:
  - org.apache.solr.cloud.api.collections.TestLocalFSCloudBackupRestore.test (:solr:core)
    Test output: /home/jenkins/workspace/Lucene-Solr-master-Linux/solr/core/build/test-results/test/outputs/OUTPUT-org.apache.solr.cloud.api.collections.TestLocalFSCloudBackupRestore.txt
    Reproduce with: gradlew :solr:core:test --tests "org.apache.solr.cloud.api.collections.TestLocalFSCloudBackupRestore" -Ptests.jvms=6 -Ptests.haltonfailure=false -Ptests.jvmargs=-XX:+UseCompressedOops -XX:+UseConcMarkSweepGC -Ptests.seed=F34D98661660A49C -Ptests.multiplier=3 -Ptests.badapples=false -Ptests.file.encoding=US-ASCII

  - org.apache.solr.cloud.api.collections.TestHdfsCloudBackupRestore.test (:solr:core)
    Test output: /home/jenkins/workspace/Lucene-Solr-master-Linux/solr/core/build/test-results/test/outputs/OUTPUT-org.apache.solr.cloud.api.collections.TestHdfsCloudBackupRestore.txt
    Reproduce with: gradlew :solr:core:test --tests "org.apache.solr.cloud.api.collections.TestHdfsCloudBackupRestore" -Ptests.jvms=6 -Ptests.haltonfailure=false -Ptests.jvmargs=-XX:+UseCompressedOops -XX:+UseConcMarkSweepGC -Ptests.seed=F34D98661660A49C -Ptests.multiplier=3 -Ptests.badapples=false -Ptests.file.encoding=US-ASCII


Deprecated Gradle features were used in this build, making it incompatible with Gradle 7.0.
Use '--warning-mode all' to show the individual deprecation warnings.
See https://docs.gradle.org/6.4.1/userguide/command_line_interface.html#sec:command_line_warnings

BUILD SUCCESSFUL in 38m 24s
837 actionable tasks: 837 executed
Build step 'Invoke Gradle script' changed build result to SUCCESS
Archiving artifacts
java.lang.InterruptedException: no matches found within 10000
	at hudson.FilePath$ValidateAntFileMask.hasMatch(FilePath.java:2875)
	at hudson.FilePath$ValidateAntFileMask.invoke(FilePath.java:2754)
	at hudson.FilePath$ValidateAntFileMask.invoke(FilePath.java:2735)
	at hudson.FilePath.act(FilePath.java:1076)
	at hudson.FilePath.act(FilePath.java:1059)
	at hudson.FilePath.validateAntFileMask(FilePath.java:2733)
	at hudson.tasks.ArtifactArchiver.perform(ArtifactArchiver.java:270)
	at hudson.tasks.BuildStepCompatibilityLayer.perform(BuildStepCompatibilityLayer.java:78)
	at hudson.tasks.BuildStepMonitor$1.perform(BuildStepMonitor.java:20)
	at hudson.model.AbstractBuild$AbstractBuildExecution.perform(AbstractBuild.java:804)
	at hudson.model.AbstractBuild$AbstractBuildExecution.performAllBuildSteps(AbstractBuild.java:753)
	at hudson.model.Build$BuildExecution.post2(Build.java:177)
	at hudson.model.AbstractBuild$AbstractBuildExecution.post(AbstractBuild.java:698)
	at hudson.model.Run.execute(Run.java:1919)
	at hudson.model.FreeStyleBuild.run(FreeStyleBuild.java:43)
	at hudson.model.ResourceController.execute(ResourceController.java:97)
	at hudson.model.Executor.run(Executor.java:428)
No artifacts found that match the file pattern "**/*.events,heapdumps/**,**/*_pid*.log". Configuration error?
[Java] Sleeping for 5 seconds due to JENKINS-32191...
[Java] Parsing console log (workspace: '/home/jenkins/workspace/Lucene-Solr-master-Linux')
[Java] Successfully parsed console log
[Java] -> found 0 issues (skipped 0 duplicates)
[Java] Skipping post processing
[Java] No filter has been set, publishing all 0 issues
[Java] Using reference build 'Lucene-Solr-master-Linux #28073' to compute new, fixed, and outstanding issues
[Java] Issues delta (vs. reference build): outstanding: 0, new: 0, fixed: 0
[Java] No quality gates have been set - skipping
[Java] Health report is disabled - skipping
[Java] Created analysis result for 0 issues (found 0 new issues, fixed 0 issues)
[Java] Attaching ResultAction with ID 'java' to run 'Lucene-Solr-master-Linux #28074'.
[Checks API] No suitable checks publisher found.
Recording test results
Build step 'Publish JUnit test result report' changed build result to UNSTABLE
[Checks API] No suitable checks publisher found.
Email was triggered for: Unstable (Test Failures)
Sending email for trigger: Unstable (Test Failures)

[JENKINS] Lucene-Solr-master-Linux (64bit/jdk-12.0.2) - Build # 28073 - Still Unstable!

Posted by Policeman Jenkins Server <je...@thetaphi.de>.
Build: https://jenkins.thetaphi.de/job/Lucene-Solr-master-Linux/28073/
Java: 64bit/jdk-12.0.2 -XX:+UseCompressedOops -XX:+UseConcMarkSweepGC

1 tests failed.
FAILED:  org.apache.solr.schema.ManagedSchemaRoundRobinCloudTest.testAddFieldsRoundRobin

Error Message:
org.apache.solr.client.solrj.impl.BaseHttpSolrClient$RemoteSolrException: Error from server at https://127.0.0.1:45741/solr: No such core: managed_coll_shard2_replica_n2

Stack Trace:
org.apache.solr.client.solrj.impl.BaseHttpSolrClient$RemoteSolrException: Error from server at https://127.0.0.1:45741/solr: No such core: managed_coll_shard2_replica_n2
	at __randomizedtesting.SeedInfo.seed([96F846DB1B98251D:CDE7E9F9B5366445]:0)
	at org.apache.solr.client.solrj.impl.HttpSolrClient.executeMethod(HttpSolrClient.java:698)
	at org.apache.solr.client.solrj.impl.HttpSolrClient.request(HttpSolrClient.java:269)
	at org.apache.solr.client.solrj.impl.HttpSolrClient.request(HttpSolrClient.java:251)
	at org.apache.solr.client.solrj.SolrRequest.process(SolrRequest.java:229)
	at org.apache.solr.schema.ManagedSchemaRoundRobinCloudTest.addField(ManagedSchemaRoundRobinCloudTest.java:81)
	at org.apache.solr.schema.ManagedSchemaRoundRobinCloudTest.testAddFieldsRoundRobin(ManagedSchemaRoundRobinCloudTest.java:68)
	at java.base/jdk.internal.reflect.NativeMethodAccessorImpl.invoke0(Native Method)
	at java.base/jdk.internal.reflect.NativeMethodAccessorImpl.invoke(NativeMethodAccessorImpl.java:62)
	at java.base/jdk.internal.reflect.DelegatingMethodAccessorImpl.invoke(DelegatingMethodAccessorImpl.java:43)
	at java.base/java.lang.reflect.Method.invoke(Method.java:567)
	at com.carrotsearch.randomizedtesting.RandomizedRunner.invoke(RandomizedRunner.java:1754)
	at com.carrotsearch.randomizedtesting.RandomizedRunner$8.evaluate(RandomizedRunner.java:942)
	at com.carrotsearch.randomizedtesting.RandomizedRunner$9.evaluate(RandomizedRunner.java:978)
	at com.carrotsearch.randomizedtesting.RandomizedRunner$10.evaluate(RandomizedRunner.java:992)
	at com.carrotsearch.randomizedtesting.rules.SystemPropertiesRestoreRule$1.evaluate(SystemPropertiesRestoreRule.java:57)
	at org.apache.lucene.util.TestRuleSetupTeardownChained$1.evaluate(TestRuleSetupTeardownChained.java:49)
	at org.apache.lucene.util.AbstractBeforeAfterRule$1.evaluate(AbstractBeforeAfterRule.java:45)
	at org.apache.lucene.util.TestRuleThreadAndTestName$1.evaluate(TestRuleThreadAndTestName.java:48)
	at org.apache.lucene.util.TestRuleIgnoreAfterMaxFailures$1.evaluate(TestRuleIgnoreAfterMaxFailures.java:64)
	at org.apache.lucene.util.TestRuleMarkFailure$1.evaluate(TestRuleMarkFailure.java:47)
	at com.carrotsearch.randomizedtesting.rules.StatementAdapter.evaluate(StatementAdapter.java:36)
	at com.carrotsearch.randomizedtesting.ThreadLeakControl$StatementRunner.run(ThreadLeakControl.java:370)
	at com.carrotsearch.randomizedtesting.ThreadLeakControl.forkTimeoutingTask(ThreadLeakControl.java:819)
	at com.carrotsearch.randomizedtesting.ThreadLeakControl$3.evaluate(ThreadLeakControl.java:470)
	at com.carrotsearch.randomizedtesting.RandomizedRunner.runSingleTest(RandomizedRunner.java:951)
	at com.carrotsearch.randomizedtesting.RandomizedRunner$5.evaluate(RandomizedRunner.java:836)
	at com.carrotsearch.randomizedtesting.RandomizedRunner$6.evaluate(RandomizedRunner.java:887)
	at com.carrotsearch.randomizedtesting.RandomizedRunner$7.evaluate(RandomizedRunner.java:898)
	at com.carrotsearch.randomizedtesting.rules.StatementAdapter.evaluate(StatementAdapter.java:36)
	at com.carrotsearch.randomizedtesting.rules.SystemPropertiesRestoreRule$1.evaluate(SystemPropertiesRestoreRule.java:57)
	at org.apache.lucene.util.AbstractBeforeAfterRule$1.evaluate(AbstractBeforeAfterRule.java:45)
	at com.carrotsearch.randomizedtesting.rules.StatementAdapter.evaluate(StatementAdapter.java:36)
	at org.apache.lucene.util.TestRuleStoreClassName$1.evaluate(TestRuleStoreClassName.java:41)
	at com.carrotsearch.randomizedtesting.rules.NoShadowingOrOverridesOnMethodsRule$1.evaluate(NoShadowingOrOverridesOnMethodsRule.java:40)
	at com.carrotsearch.randomizedtesting.rules.NoShadowingOrOverridesOnMethodsRule$1.evaluate(NoShadowingOrOverridesOnMethodsRule.java:40)
	at com.carrotsearch.randomizedtesting.rules.StatementAdapter.evaluate(StatementAdapter.java:36)
	at com.carrotsearch.randomizedtesting.rules.StatementAdapter.evaluate(StatementAdapter.java:36)
	at org.apache.lucene.util.TestRuleAssertionsRequired$1.evaluate(TestRuleAssertionsRequired.java:53)
	at org.apache.lucene.util.TestRuleMarkFailure$1.evaluate(TestRuleMarkFailure.java:47)
	at org.apache.lucene.util.TestRuleIgnoreAfterMaxFailures$1.evaluate(TestRuleIgnoreAfterMaxFailures.java:64)
	at org.apache.lucene.util.TestRuleIgnoreTestSuites$1.evaluate(TestRuleIgnoreTestSuites.java:54)
	at com.carrotsearch.randomizedtesting.rules.StatementAdapter.evaluate(StatementAdapter.java:36)
	at com.carrotsearch.randomizedtesting.ThreadLeakControl$StatementRunner.run(ThreadLeakControl.java:370)
	at com.carrotsearch.randomizedtesting.ThreadLeakControl.lambda$forkTimeoutingTask$0(ThreadLeakControl.java:826)
	at java.base/java.lang.Thread.run(Thread.java:835)




Build Log:
[...truncated 2543 lines...]
ERROR: The following test(s) have failed:
  - org.apache.solr.schema.ManagedSchemaRoundRobinCloudTest.testAddFieldsRoundRobin (:solr:core)
    Test output: /home/jenkins/workspace/Lucene-Solr-master-Linux/solr/core/build/test-results/test/outputs/OUTPUT-org.apache.solr.schema.ManagedSchemaRoundRobinCloudTest.txt
    Reproduce with: gradlew :solr:core:test --tests "org.apache.solr.schema.ManagedSchemaRoundRobinCloudTest" -Ptests.jvms=6 -Ptests.haltonfailure=false -Ptests.jvmargs=-XX:+UseCompressedOops -XX:+UseConcMarkSweepGC -Ptests.seed=96F846DB1B98251D -Ptests.multiplier=3 -Ptests.badapples=false -Ptests.file.encoding=ISO-8859-1


Deprecated Gradle features were used in this build, making it incompatible with Gradle 7.0.
Use '--warning-mode all' to show the individual deprecation warnings.
See https://docs.gradle.org/6.4.1/userguide/command_line_interface.html#sec:command_line_warnings

BUILD SUCCESSFUL in 46m 16s
837 actionable tasks: 837 executed
Build step 'Invoke Gradle script' changed build result to SUCCESS
Archiving artifacts
java.lang.InterruptedException: no matches found within 10000
	at hudson.FilePath$ValidateAntFileMask.hasMatch(FilePath.java:2875)
	at hudson.FilePath$ValidateAntFileMask.invoke(FilePath.java:2754)
	at hudson.FilePath$ValidateAntFileMask.invoke(FilePath.java:2735)
	at hudson.FilePath.act(FilePath.java:1076)
	at hudson.FilePath.act(FilePath.java:1059)
	at hudson.FilePath.validateAntFileMask(FilePath.java:2733)
	at hudson.tasks.ArtifactArchiver.perform(ArtifactArchiver.java:270)
	at hudson.tasks.BuildStepCompatibilityLayer.perform(BuildStepCompatibilityLayer.java:78)
	at hudson.tasks.BuildStepMonitor$1.perform(BuildStepMonitor.java:20)
	at hudson.model.AbstractBuild$AbstractBuildExecution.perform(AbstractBuild.java:804)
	at hudson.model.AbstractBuild$AbstractBuildExecution.performAllBuildSteps(AbstractBuild.java:753)
	at hudson.model.Build$BuildExecution.post2(Build.java:177)
	at hudson.model.AbstractBuild$AbstractBuildExecution.post(AbstractBuild.java:698)
	at hudson.model.Run.execute(Run.java:1919)
	at hudson.model.FreeStyleBuild.run(FreeStyleBuild.java:43)
	at hudson.model.ResourceController.execute(ResourceController.java:97)
	at hudson.model.Executor.run(Executor.java:428)
No artifacts found that match the file pattern "**/*.events,heapdumps/**,**/*_pid*.log". Configuration error?
[Java] Sleeping for 5 seconds due to JENKINS-32191...
[Java] Parsing console log (workspace: '/home/jenkins/workspace/Lucene-Solr-master-Linux')
[Java] Successfully parsed console log
[Java] -> found 0 issues (skipped 0 duplicates)
[Java] Skipping post processing
[Java] No filter has been set, publishing all 0 issues
[Java] Using reference build 'Lucene-Solr-master-Linux #28072' to compute new, fixed, and outstanding issues
[Java] Issues delta (vs. reference build): outstanding: 0, new: 0, fixed: 0
[Java] No quality gates have been set - skipping
[Java] Health report is disabled - skipping
[Java] Created analysis result for 0 issues (found 0 new issues, fixed 0 issues)
[Java] Attaching ResultAction with ID 'java' to run 'Lucene-Solr-master-Linux #28073'.
[Checks API] No suitable checks publisher found.
Recording test results
Build step 'Publish JUnit test result report' changed build result to UNSTABLE
[Checks API] No suitable checks publisher found.
Email was triggered for: Unstable (Test Failures)
Sending email for trigger: Unstable (Test Failures)

[JENKINS] Lucene-Solr-master-Linux (64bit/jdk-11.0.6) - Build # 28072 - Still Unstable!

Posted by Policeman Jenkins Server <je...@thetaphi.de>.
Build: https://jenkins.thetaphi.de/job/Lucene-Solr-master-Linux/28072/
Java: 64bit/jdk-11.0.6 -XX:-UseCompressedOops -XX:+UseConcMarkSweepGC

3 tests failed.
FAILED:  org.apache.solr.pkg.TestPackages.testSchemaPlugins

Error Message:
java.lang.AssertionError: req: org.apache.solr.filestore.TestDistribPackageStore$$Lambda$1131/0x00007f7db6e448b0@19cea022 . attempt: 9 Mismatch for value : '[fieldType, analyzer, charFilters[0], _packageinfo_, version]' in response , {
  "responseHeader":{
    "status":0,
    "QTime":0},
  "fieldType":{
    "name":"myNewTextFieldWithAnalyzerClass",
    "class":"schemapkg:my.pkg.MyTextField",
    "analyzer":{
      "charFilters":[{
          "class":"schemapkg:my.pkg.MyPatternReplaceCharFilterFactory",
          "replacement":"$1$1",
          "pattern":"([a-zA-Z])\\\\1+",
          "_packageinfo_":{
            "version":"1.0",
            "files":[
              "/schemapkg/schema-plugins.jar",
              "/schemapkg/payload-component.jar"]}}],
      "tokenizer":{
        "class":"schemapkg:my.pkg.MyWhitespaceTokenizerFactory",
        "_packageinfo_":{
          "version":"1.0",
          "files":[
            "/schemapkg/schema-plugins.jar",
            "/schemapkg/payload-component.jar"]}},
      "filters":[{
          "class":"solr.DelimitedPayloadTokenFilterFactory",
          "encoder":"schemapkg:com.o19s.payloads.Base64Encoder"}]},
    "_packageinfo_":{
      "version":"1.0",
      "files":[
        "/schemapkg/schema-plugins.jar",
        "/schemapkg/payload-component.jar"]}}}

Stack Trace:
java.lang.AssertionError: req: org.apache.solr.filestore.TestDistribPackageStore$$Lambda$1131/0x00007f7db6e448b0@19cea022 . attempt: 9 Mismatch for value : '[fieldType, analyzer, charFilters[0], _packageinfo_, version]' in response , {
  "responseHeader":{
    "status":0,
    "QTime":0},
  "fieldType":{
    "name":"myNewTextFieldWithAnalyzerClass",
    "class":"schemapkg:my.pkg.MyTextField",
    "analyzer":{
      "charFilters":[{
          "class":"schemapkg:my.pkg.MyPatternReplaceCharFilterFactory",
          "replacement":"$1$1",
          "pattern":"([a-zA-Z])\\\\1+",
          "_packageinfo_":{
            "version":"1.0",
            "files":[
              "/schemapkg/schema-plugins.jar",
              "/schemapkg/payload-component.jar"]}}],
      "tokenizer":{
        "class":"schemapkg:my.pkg.MyWhitespaceTokenizerFactory",
        "_packageinfo_":{
          "version":"1.0",
          "files":[
            "/schemapkg/schema-plugins.jar",
            "/schemapkg/payload-component.jar"]}},
      "filters":[{
          "class":"solr.DelimitedPayloadTokenFilterFactory",
          "encoder":"schemapkg:com.o19s.payloads.Base64Encoder"}]},
    "_packageinfo_":{
      "version":"1.0",
      "files":[
        "/schemapkg/schema-plugins.jar",
        "/schemapkg/payload-component.jar"]}}}
	at __randomizedtesting.SeedInfo.seed([14698FAD34031C5F:1146CCC5E861C47]:0)
	at org.junit.Assert.fail(Assert.java:88)
	at org.apache.solr.filestore.TestDistribPackageStore.assertResponseValues(TestDistribPackageStore.java:256)
	at org.apache.solr.filestore.TestDistribPackageStore.assertResponseValues(TestDistribPackageStore.java:223)
	at org.apache.solr.pkg.TestPackages.verifySchemaComponent(TestPackages.java:785)
	at org.apache.solr.pkg.TestPackages.testSchemaPlugins(TestPackages.java:766)
	at java.base/jdk.internal.reflect.NativeMethodAccessorImpl.invoke0(Native Method)
	at java.base/jdk.internal.reflect.NativeMethodAccessorImpl.invoke(NativeMethodAccessorImpl.java:62)
	at java.base/jdk.internal.reflect.DelegatingMethodAccessorImpl.invoke(DelegatingMethodAccessorImpl.java:43)
	at java.base/java.lang.reflect.Method.invoke(Method.java:566)
	at com.carrotsearch.randomizedtesting.RandomizedRunner.invoke(RandomizedRunner.java:1754)
	at com.carrotsearch.randomizedtesting.RandomizedRunner$8.evaluate(RandomizedRunner.java:942)
	at com.carrotsearch.randomizedtesting.RandomizedRunner$9.evaluate(RandomizedRunner.java:978)
	at com.carrotsearch.randomizedtesting.RandomizedRunner$10.evaluate(RandomizedRunner.java:992)
	at com.carrotsearch.randomizedtesting.rules.SystemPropertiesRestoreRule$1.evaluate(SystemPropertiesRestoreRule.java:57)
	at org.apache.lucene.util.TestRuleSetupTeardownChained$1.evaluate(TestRuleSetupTeardownChained.java:49)
	at org.apache.lucene.util.AbstractBeforeAfterRule$1.evaluate(AbstractBeforeAfterRule.java:45)
	at org.apache.lucene.util.TestRuleThreadAndTestName$1.evaluate(TestRuleThreadAndTestName.java:48)
	at org.apache.lucene.util.TestRuleIgnoreAfterMaxFailures$1.evaluate(TestRuleIgnoreAfterMaxFailures.java:64)
	at org.apache.lucene.util.TestRuleMarkFailure$1.evaluate(TestRuleMarkFailure.java:47)
	at com.carrotsearch.randomizedtesting.rules.StatementAdapter.evaluate(StatementAdapter.java:36)
	at com.carrotsearch.randomizedtesting.ThreadLeakControl$StatementRunner.run(ThreadLeakControl.java:370)
	at com.carrotsearch.randomizedtesting.ThreadLeakControl.forkTimeoutingTask(ThreadLeakControl.java:819)
	at com.carrotsearch.randomizedtesting.ThreadLeakControl$3.evaluate(ThreadLeakControl.java:470)
	at com.carrotsearch.randomizedtesting.RandomizedRunner.runSingleTest(RandomizedRunner.java:951)
	at com.carrotsearch.randomizedtesting.RandomizedRunner$5.evaluate(RandomizedRunner.java:836)
	at com.carrotsearch.randomizedtesting.RandomizedRunner$6.evaluate(RandomizedRunner.java:887)
	at com.carrotsearch.randomizedtesting.RandomizedRunner$7.evaluate(RandomizedRunner.java:898)
	at com.carrotsearch.randomizedtesting.rules.StatementAdapter.evaluate(StatementAdapter.java:36)
	at com.carrotsearch.randomizedtesting.rules.SystemPropertiesRestoreRule$1.evaluate(SystemPropertiesRestoreRule.java:57)
	at org.apache.lucene.util.AbstractBeforeAfterRule$1.evaluate(AbstractBeforeAfterRule.java:45)
	at com.carrotsearch.randomizedtesting.rules.StatementAdapter.evaluate(StatementAdapter.java:36)
	at org.apache.lucene.util.TestRuleStoreClassName$1.evaluate(TestRuleStoreClassName.java:41)
	at com.carrotsearch.randomizedtesting.rules.NoShadowingOrOverridesOnMethodsRule$1.evaluate(NoShadowingOrOverridesOnMethodsRule.java:40)
	at com.carrotsearch.randomizedtesting.rules.NoShadowingOrOverridesOnMethodsRule$1.evaluate(NoShadowingOrOverridesOnMethodsRule.java:40)
	at com.carrotsearch.randomizedtesting.rules.StatementAdapter.evaluate(StatementAdapter.java:36)
	at com.carrotsearch.randomizedtesting.rules.StatementAdapter.evaluate(StatementAdapter.java:36)
	at org.apache.lucene.util.TestRuleAssertionsRequired$1.evaluate(TestRuleAssertionsRequired.java:53)
	at org.apache.lucene.util.TestRuleMarkFailure$1.evaluate(TestRuleMarkFailure.java:47)
	at org.apache.lucene.util.TestRuleIgnoreAfterMaxFailures$1.evaluate(TestRuleIgnoreAfterMaxFailures.java:64)
	at org.apache.lucene.util.TestRuleIgnoreTestSuites$1.evaluate(TestRuleIgnoreTestSuites.java:54)
	at com.carrotsearch.randomizedtesting.rules.StatementAdapter.evaluate(StatementAdapter.java:36)
	at com.carrotsearch.randomizedtesting.ThreadLeakControl$StatementRunner.run(ThreadLeakControl.java:370)
	at com.carrotsearch.randomizedtesting.ThreadLeakControl.lambda$forkTimeoutingTask$0(ThreadLeakControl.java:826)
	at java.base/java.lang.Thread.run(Thread.java:834)


FAILED:  org.apache.solr.pkg.TestPackages.classMethod

Error Message:
com.carrotsearch.randomizedtesting.ThreadLeakError: 2 threads leaked from SUITE scope at org.apache.solr.pkg.TestPackages: 
   1) Thread[id=5386, name=Core Async Task-3132-thread-1-processing-n:127.0.0.1:39891_solr x:testSchemaLoadingColl_shard1_replica_n1 c:testSchemaLoadingColl s:shard1 r:core_node2, state=TIMED_WAITING, group=TGRP-TestPackages]
        at java.base@11.0.6/jdk.internal.misc.Unsafe.park(Native Method)
        at java.base@11.0.6/java.util.concurrent.locks.LockSupport.parkNanos(LockSupport.java:234)
        at java.base@11.0.6/java.util.concurrent.locks.AbstractQueuedSynchronizer$ConditionObject.awaitNanos(AbstractQueuedSynchronizer.java:2123)
        at java.base@11.0.6/java.util.concurrent.ThreadPoolExecutor.awaitTermination(ThreadPoolExecutor.java:1454)
        at app//org.apache.solr.common.util.ExecutorUtil.awaitTermination(ExecutorUtil.java:91)
        at app//org.apache.solr.common.util.ExecutorUtil.shutdownAndAwaitTermination(ExecutorUtil.java:77)
        at app//org.apache.solr.core.SolrCore.close(SolrCore.java:1576)
        at app//org.apache.solr.core.SolrResourceLoader.lambda$createSchemaLoader$2(SolrResourceLoader.java:845)
        at app//org.apache.solr.core.SolrResourceLoader$$Lambda$486/0x00007f7f409df440.run(Unknown Source)
        at app//org.apache.solr.pkg.PackageListeningClassLoader.lambda$new$0(PackageListeningClassLoader.java:56)
        at app//org.apache.solr.pkg.PackageListeningClassLoader$$Lambda$487/0x00007f7f409decb0.run(Unknown Source)
        at java.base@11.0.6/java.util.concurrent.Executors$RunnableAdapter.call(Executors.java:515)
        at java.base@11.0.6/java.util.concurrent.FutureTask.run(FutureTask.java:264)
        at app//org.apache.solr.common.util.ExecutorUtil$MDCAwareThreadPoolExecutor.lambda$execute$0(ExecutorUtil.java:218)
        at app//org.apache.solr.common.util.ExecutorUtil$MDCAwareThreadPoolExecutor$$Lambda$329/0x00007f7f413fc5b8.run(Unknown Source)
        at java.base@11.0.6/java.util.concurrent.ThreadPoolExecutor.runWorker(ThreadPoolExecutor.java:1128)
        at java.base@11.0.6/java.util.concurrent.ThreadPoolExecutor$Worker.run(ThreadPoolExecutor.java:628)
        at java.base@11.0.6/java.lang.Thread.run(Thread.java:834)
   2) Thread[id=5389, name=Core Async Task-3128-thread-1-processing-n:127.0.0.1:43095_solr x:testSchemaLoadingColl_shard1_replica_n3 c:testSchemaLoadingColl s:shard1 r:core_node5, state=TIMED_WAITING, group=TGRP-TestPackages]
        at java.base@11.0.6/jdk.internal.misc.Unsafe.park(Native Method)
        at java.base@11.0.6/java.util.concurrent.locks.LockSupport.parkNanos(LockSupport.java:234)
        at java.base@11.0.6/java.util.concurrent.locks.AbstractQueuedSynchronizer$ConditionObject.awaitNanos(AbstractQueuedSynchronizer.java:2123)
        at java.base@11.0.6/java.util.concurrent.ThreadPoolExecutor.awaitTermination(ThreadPoolExecutor.java:1454)
        at app//org.apache.solr.common.util.ExecutorUtil.awaitTermination(ExecutorUtil.java:91)
        at app//org.apache.solr.common.util.ExecutorUtil.shutdownAndAwaitTermination(ExecutorUtil.java:77)
        at app//org.apache.solr.core.SolrCore.close(SolrCore.java:1576)
        at app//org.apache.solr.core.SolrResourceLoader.lambda$createSchemaLoader$2(SolrResourceLoader.java:845)
        at app//org.apache.solr.core.SolrResourceLoader$$Lambda$486/0x00007f7f409df440.run(Unknown Source)
        at app//org.apache.solr.pkg.PackageListeningClassLoader.lambda$new$0(PackageListeningClassLoader.java:56)
        at app//org.apache.solr.pkg.PackageListeningClassLoader$$Lambda$487/0x00007f7f409decb0.run(Unknown Source)
        at java.base@11.0.6/java.util.concurrent.Executors$RunnableAdapter.call(Executors.java:515)
        at java.base@11.0.6/java.util.concurrent.FutureTask.run(FutureTask.java:264)
        at app//org.apache.solr.common.util.ExecutorUtil$MDCAwareThreadPoolExecutor.lambda$execute$0(ExecutorUtil.java:218)
        at app//org.apache.solr.common.util.ExecutorUtil$MDCAwareThreadPoolExecutor$$Lambda$329/0x00007f7f413fc5b8.run(Unknown Source)
        at java.base@11.0.6/java.util.concurrent.ThreadPoolExecutor.runWorker(ThreadPoolExecutor.java:1128)
        at java.base@11.0.6/java.util.concurrent.ThreadPoolExecutor$Worker.run(ThreadPoolExecutor.java:628)
        at java.base@11.0.6/java.lang.Thread.run(Thread.java:834)

Stack Trace:
com.carrotsearch.randomizedtesting.ThreadLeakError: 2 threads leaked from SUITE scope at org.apache.solr.pkg.TestPackages: 
   1) Thread[id=5386, name=Core Async Task-3132-thread-1-processing-n:127.0.0.1:39891_solr x:testSchemaLoadingColl_shard1_replica_n1 c:testSchemaLoadingColl s:shard1 r:core_node2, state=TIMED_WAITING, group=TGRP-TestPackages]
        at java.base@11.0.6/jdk.internal.misc.Unsafe.park(Native Method)
        at java.base@11.0.6/java.util.concurrent.locks.LockSupport.parkNanos(LockSupport.java:234)
        at java.base@11.0.6/java.util.concurrent.locks.AbstractQueuedSynchronizer$ConditionObject.awaitNanos(AbstractQueuedSynchronizer.java:2123)
        at java.base@11.0.6/java.util.concurrent.ThreadPoolExecutor.awaitTermination(ThreadPoolExecutor.java:1454)
        at app//org.apache.solr.common.util.ExecutorUtil.awaitTermination(ExecutorUtil.java:91)
        at app//org.apache.solr.common.util.ExecutorUtil.shutdownAndAwaitTermination(ExecutorUtil.java:77)
        at app//org.apache.solr.core.SolrCore.close(SolrCore.java:1576)
        at app//org.apache.solr.core.SolrResourceLoader.lambda$createSchemaLoader$2(SolrResourceLoader.java:845)
        at app//org.apache.solr.core.SolrResourceLoader$$Lambda$486/0x00007f7f409df440.run(Unknown Source)
        at app//org.apache.solr.pkg.PackageListeningClassLoader.lambda$new$0(PackageListeningClassLoader.java:56)
        at app//org.apache.solr.pkg.PackageListeningClassLoader$$Lambda$487/0x00007f7f409decb0.run(Unknown Source)
        at java.base@11.0.6/java.util.concurrent.Executors$RunnableAdapter.call(Executors.java:515)
        at java.base@11.0.6/java.util.concurrent.FutureTask.run(FutureTask.java:264)
        at app//org.apache.solr.common.util.ExecutorUtil$MDCAwareThreadPoolExecutor.lambda$execute$0(ExecutorUtil.java:218)
        at app//org.apache.solr.common.util.ExecutorUtil$MDCAwareThreadPoolExecutor$$Lambda$329/0x00007f7f413fc5b8.run(Unknown Source)
        at java.base@11.0.6/java.util.concurrent.ThreadPoolExecutor.runWorker(ThreadPoolExecutor.java:1128)
        at java.base@11.0.6/java.util.concurrent.ThreadPoolExecutor$Worker.run(ThreadPoolExecutor.java:628)
        at java.base@11.0.6/java.lang.Thread.run(Thread.java:834)
   2) Thread[id=5389, name=Core Async Task-3128-thread-1-processing-n:127.0.0.1:43095_solr x:testSchemaLoadingColl_shard1_replica_n3 c:testSchemaLoadingColl s:shard1 r:core_node5, state=TIMED_WAITING, group=TGRP-TestPackages]
        at java.base@11.0.6/jdk.internal.misc.Unsafe.park(Native Method)
        at java.base@11.0.6/java.util.concurrent.locks.LockSupport.parkNanos(LockSupport.java:234)
        at java.base@11.0.6/java.util.concurrent.locks.AbstractQueuedSynchronizer$ConditionObject.awaitNanos(AbstractQueuedSynchronizer.java:2123)
        at java.base@11.0.6/java.util.concurrent.ThreadPoolExecutor.awaitTermination(ThreadPoolExecutor.java:1454)
        at app//org.apache.solr.common.util.ExecutorUtil.awaitTermination(ExecutorUtil.java:91)
        at app//org.apache.solr.common.util.ExecutorUtil.shutdownAndAwaitTermination(ExecutorUtil.java:77)
        at app//org.apache.solr.core.SolrCore.close(SolrCore.java:1576)
        at app//org.apache.solr.core.SolrResourceLoader.lambda$createSchemaLoader$2(SolrResourceLoader.java:845)
        at app//org.apache.solr.core.SolrResourceLoader$$Lambda$486/0x00007f7f409df440.run(Unknown Source)
        at app//org.apache.solr.pkg.PackageListeningClassLoader.lambda$new$0(PackageListeningClassLoader.java:56)
        at app//org.apache.solr.pkg.PackageListeningClassLoader$$Lambda$487/0x00007f7f409decb0.run(Unknown Source)
        at java.base@11.0.6/java.util.concurrent.Executors$RunnableAdapter.call(Executors.java:515)
        at java.base@11.0.6/java.util.concurrent.FutureTask.run(FutureTask.java:264)
        at app//org.apache.solr.common.util.ExecutorUtil$MDCAwareThreadPoolExecutor.lambda$execute$0(ExecutorUtil.java:218)
        at app//org.apache.solr.common.util.ExecutorUtil$MDCAwareThreadPoolExecutor$$Lambda$329/0x00007f7f413fc5b8.run(Unknown Source)
        at java.base@11.0.6/java.util.concurrent.ThreadPoolExecutor.runWorker(ThreadPoolExecutor.java:1128)
        at java.base@11.0.6/java.util.concurrent.ThreadPoolExecutor$Worker.run(ThreadPoolExecutor.java:628)
        at java.base@11.0.6/java.lang.Thread.run(Thread.java:834)
	at __randomizedtesting.SeedInfo.seed([14698FAD34031C5F]:0)


FAILED:  org.apache.solr.pkg.TestPackages.classMethod

Error Message:
com.carrotsearch.randomizedtesting.ThreadLeakError: There are still zombie threads that couldn't be terminated:
   1) Thread[id=5386, name=Core Async Task-3132-thread-1-processing-n:127.0.0.1:39891_solr x:testSchemaLoadingColl_shard1_replica_n1 c:testSchemaLoadingColl s:shard1 r:core_node2, state=RUNNABLE, group=TGRP-TestPackages]
        at java.base@11.0.6/java.lang.Throwable.fillInStackTrace(Native Method)
        at java.base@11.0.6/java.lang.Throwable.fillInStackTrace(Throwable.java:787)
        at java.base@11.0.6/java.lang.Throwable.<init>(Throwable.java:255)
        at java.base@11.0.6/java.lang.Exception.<init>(Exception.java:54)
        at java.base@11.0.6/java.lang.InterruptedException.<init>(InterruptedException.java:57)
        at java.base@11.0.6/java.util.concurrent.locks.AbstractQueuedSynchronizer$ConditionObject.awaitNanos(AbstractQueuedSynchronizer.java:2109)
        at java.base@11.0.6/java.util.concurrent.ThreadPoolExecutor.awaitTermination(ThreadPoolExecutor.java:1454)
        at app//org.apache.solr.common.util.ExecutorUtil.awaitTermination(ExecutorUtil.java:91)
        at app//org.apache.solr.common.util.ExecutorUtil.shutdownAndAwaitTermination(ExecutorUtil.java:77)
        at app//org.apache.solr.core.SolrCore.close(SolrCore.java:1576)
        at app//org.apache.solr.core.SolrResourceLoader.lambda$createSchemaLoader$2(SolrResourceLoader.java:845)
        at app//org.apache.solr.core.SolrResourceLoader$$Lambda$486/0x00007f7f409df440.run(Unknown Source)
        at app//org.apache.solr.pkg.PackageListeningClassLoader.lambda$new$0(PackageListeningClassLoader.java:56)
        at app//org.apache.solr.pkg.PackageListeningClassLoader$$Lambda$487/0x00007f7f409decb0.run(Unknown Source)
        at java.base@11.0.6/java.util.concurrent.Executors$RunnableAdapter.call(Executors.java:515)
        at java.base@11.0.6/java.util.concurrent.FutureTask.run(FutureTask.java:264)
        at app//org.apache.solr.common.util.ExecutorUtil$MDCAwareThreadPoolExecutor.lambda$execute$0(ExecutorUtil.java:218)
        at app//org.apache.solr.common.util.ExecutorUtil$MDCAwareThreadPoolExecutor$$Lambda$329/0x00007f7f413fc5b8.run(Unknown Source)
        at java.base@11.0.6/java.util.concurrent.ThreadPoolExecutor.runWorker(ThreadPoolExecutor.java:1128)
        at java.base@11.0.6/java.util.concurrent.ThreadPoolExecutor$Worker.run(ThreadPoolExecutor.java:628)
        at java.base@11.0.6/java.lang.Thread.run(Thread.java:834)
   2) Thread[id=5389, name=Core Async Task-3128-thread-1-processing-n:127.0.0.1:43095_solr x:testSchemaLoadingColl_shard1_replica_n3 c:testSchemaLoadingColl s:shard1 r:core_node5, state=RUNNABLE, group=TGRP-TestPackages]
        at java.base@11.0.6/java.lang.Throwable.fillInStackTrace(Native Method)
        at java.base@11.0.6/java.lang.Throwable.fillInStackTrace(Throwable.java:787)
        at java.base@11.0.6/java.lang.Throwable.<init>(Throwable.java:255)
        at java.base@11.0.6/java.lang.Exception.<init>(Exception.java:54)
        at java.base@11.0.6/java.lang.InterruptedException.<init>(InterruptedException.java:57)
        at java.base@11.0.6/java.util.concurrent.locks.AbstractQueuedSynchronizer$ConditionObject.awaitNanos(AbstractQueuedSynchronizer.java:2109)
        at java.base@11.0.6/java.util.concurrent.ThreadPoolExecutor.awaitTermination(ThreadPoolExecutor.java:1454)
        at app//org.apache.solr.common.util.ExecutorUtil.awaitTermination(ExecutorUtil.java:91)
        at app//org.apache.solr.common.util.ExecutorUtil.shutdownAndAwaitTermination(ExecutorUtil.java:77)
        at app//org.apache.solr.core.SolrCore.close(SolrCore.java:1576)
        at app//org.apache.solr.core.SolrResourceLoader.lambda$createSchemaLoader$2(SolrResourceLoader.java:845)
        at app//org.apache.solr.core.SolrResourceLoader$$Lambda$486/0x00007f7f409df440.run(Unknown Source)
        at app//org.apache.solr.pkg.PackageListeningClassLoader.lambda$new$0(PackageListeningClassLoader.java:56)
        at app//org.apache.solr.pkg.PackageListeningClassLoader$$Lambda$487/0x00007f7f409decb0.run(Unknown Source)
        at java.base@11.0.6/java.util.concurrent.Executors$RunnableAdapter.call(Executors.java:515)
        at java.base@11.0.6/java.util.concurrent.FutureTask.run(FutureTask.java:264)
        at app//org.apache.solr.common.util.ExecutorUtil$MDCAwareThreadPoolExecutor.lambda$execute$0(ExecutorUtil.java:218)
        at app//org.apache.solr.common.util.ExecutorUtil$MDCAwareThreadPoolExecutor$$Lambda$329/0x00007f7f413fc5b8.run(Unknown Source)
        at java.base@11.0.6/java.util.concurrent.ThreadPoolExecutor.runWorker(ThreadPoolExecutor.java:1128)
        at java.base@11.0.6/java.util.concurrent.ThreadPoolExecutor$Worker.run(ThreadPoolExecutor.java:628)
        at java.base@11.0.6/java.lang.Thread.run(Thread.java:834)

Stack Trace:
com.carrotsearch.randomizedtesting.ThreadLeakError: There are still zombie threads that couldn't be terminated:
   1) Thread[id=5386, name=Core Async Task-3132-thread-1-processing-n:127.0.0.1:39891_solr x:testSchemaLoadingColl_shard1_replica_n1 c:testSchemaLoadingColl s:shard1 r:core_node2, state=RUNNABLE, group=TGRP-TestPackages]
        at java.base@11.0.6/java.lang.Throwable.fillInStackTrace(Native Method)
        at java.base@11.0.6/java.lang.Throwable.fillInStackTrace(Throwable.java:787)
        at java.base@11.0.6/java.lang.Throwable.<init>(Throwable.java:255)
        at java.base@11.0.6/java.lang.Exception.<init>(Exception.java:54)
        at java.base@11.0.6/java.lang.InterruptedException.<init>(InterruptedException.java:57)
        at java.base@11.0.6/java.util.concurrent.locks.AbstractQueuedSynchronizer$ConditionObject.awaitNanos(AbstractQueuedSynchronizer.java:2109)
        at java.base@11.0.6/java.util.concurrent.ThreadPoolExecutor.awaitTermination(ThreadPoolExecutor.java:1454)
        at app//org.apache.solr.common.util.ExecutorUtil.awaitTermination(ExecutorUtil.java:91)
        at app//org.apache.solr.common.util.ExecutorUtil.shutdownAndAwaitTermination(ExecutorUtil.java:77)
        at app//org.apache.solr.core.SolrCore.close(SolrCore.java:1576)
        at app//org.apache.solr.core.SolrResourceLoader.lambda$createSchemaLoader$2(SolrResourceLoader.java:845)
        at app//org.apache.solr.core.SolrResourceLoader$$Lambda$486/0x00007f7f409df440.run(Unknown Source)
        at app//org.apache.solr.pkg.PackageListeningClassLoader.lambda$new$0(PackageListeningClassLoader.java:56)
        at app//org.apache.solr.pkg.PackageListeningClassLoader$$Lambda$487/0x00007f7f409decb0.run(Unknown Source)
        at java.base@11.0.6/java.util.concurrent.Executors$RunnableAdapter.call(Executors.java:515)
        at java.base@11.0.6/java.util.concurrent.FutureTask.run(FutureTask.java:264)
        at app//org.apache.solr.common.util.ExecutorUtil$MDCAwareThreadPoolExecutor.lambda$execute$0(ExecutorUtil.java:218)
        at app//org.apache.solr.common.util.ExecutorUtil$MDCAwareThreadPoolExecutor$$Lambda$329/0x00007f7f413fc5b8.run(Unknown Source)
        at java.base@11.0.6/java.util.concurrent.ThreadPoolExecutor.runWorker(ThreadPoolExecutor.java:1128)
        at java.base@11.0.6/java.util.concurrent.ThreadPoolExecutor$Worker.run(ThreadPoolExecutor.java:628)
        at java.base@11.0.6/java.lang.Thread.run(Thread.java:834)
   2) Thread[id=5389, name=Core Async Task-3128-thread-1-processing-n:127.0.0.1:43095_solr x:testSchemaLoadingColl_shard1_replica_n3 c:testSchemaLoadingColl s:shard1 r:core_node5, state=RUNNABLE, group=TGRP-TestPackages]
        at java.base@11.0.6/java.lang.Throwable.fillInStackTrace(Native Method)
        at java.base@11.0.6/java.lang.Throwable.fillInStackTrace(Throwable.java:787)
        at java.base@11.0.6/java.lang.Throwable.<init>(Throwable.java:255)
        at java.base@11.0.6/java.lang.Exception.<init>(Exception.java:54)
        at java.base@11.0.6/java.lang.InterruptedException.<init>(InterruptedException.java:57)
        at java.base@11.0.6/java.util.concurrent.locks.AbstractQueuedSynchronizer$ConditionObject.awaitNanos(AbstractQueuedSynchronizer.java:2109)
        at java.base@11.0.6/java.util.concurrent.ThreadPoolExecutor.awaitTermination(ThreadPoolExecutor.java:1454)
        at app//org.apache.solr.common.util.ExecutorUtil.awaitTermination(ExecutorUtil.java:91)
        at app//org.apache.solr.common.util.ExecutorUtil.shutdownAndAwaitTermination(ExecutorUtil.java:77)
        at app//org.apache.solr.core.SolrCore.close(SolrCore.java:1576)
        at app//org.apache.solr.core.SolrResourceLoader.lambda$createSchemaLoader$2(SolrResourceLoader.java:845)
        at app//org.apache.solr.core.SolrResourceLoader$$Lambda$486/0x00007f7f409df440.run(Unknown Source)
        at app//org.apache.solr.pkg.PackageListeningClassLoader.lambda$new$0(PackageListeningClassLoader.java:56)
        at app//org.apache.solr.pkg.PackageListeningClassLoader$$Lambda$487/0x00007f7f409decb0.run(Unknown Source)
        at java.base@11.0.6/java.util.concurrent.Executors$RunnableAdapter.call(Executors.java:515)
        at java.base@11.0.6/java.util.concurrent.FutureTask.run(FutureTask.java:264)
        at app//org.apache.solr.common.util.ExecutorUtil$MDCAwareThreadPoolExecutor.lambda$execute$0(ExecutorUtil.java:218)
        at app//org.apache.solr.common.util.ExecutorUtil$MDCAwareThreadPoolExecutor$$Lambda$329/0x00007f7f413fc5b8.run(Unknown Source)
        at java.base@11.0.6/java.util.concurrent.ThreadPoolExecutor.runWorker(ThreadPoolExecutor.java:1128)
        at java.base@11.0.6/java.util.concurrent.ThreadPoolExecutor$Worker.run(ThreadPoolExecutor.java:628)
        at java.base@11.0.6/java.lang.Thread.run(Thread.java:834)
	at __randomizedtesting.SeedInfo.seed([14698FAD34031C5F]:0)




Build Log:
[...truncated 5778 lines...]
ERROR: The following test(s) have failed:
  - org.apache.solr.pkg.TestPackages.testSchemaPlugins (:solr:core)
    Test output: /home/jenkins/workspace/Lucene-Solr-master-Linux/solr/core/build/test-results/test/outputs/OUTPUT-org.apache.solr.pkg.TestPackages.txt
    Reproduce with: gradlew :solr:core:test --tests "org.apache.solr.pkg.TestPackages" -Ptests.jvms=6 -Ptests.haltonfailure=false -Ptests.jvmargs=-XX:-UseCompressedOops -XX:+UseConcMarkSweepGC -Ptests.seed=14698FAD34031C5F -Ptests.multiplier=3 -Ptests.badapples=false -Ptests.file.encoding=UTF-8

  - org.apache.solr.pkg.TestPackages.classMethod (:solr:core)
    Test output: /home/jenkins/workspace/Lucene-Solr-master-Linux/solr/core/build/test-results/test/outputs/OUTPUT-org.apache.solr.pkg.TestPackages.txt
    Reproduce with: gradlew :solr:core:test --tests "org.apache.solr.pkg.TestPackages" -Ptests.jvms=6 -Ptests.haltonfailure=false -Ptests.jvmargs=-XX:-UseCompressedOops -XX:+UseConcMarkSweepGC -Ptests.seed=14698FAD34031C5F -Ptests.multiplier=3 -Ptests.badapples=false -Ptests.file.encoding=UTF-8

  - org.apache.solr.pkg.TestPackages.classMethod (:solr:core)
    Test output: /home/jenkins/workspace/Lucene-Solr-master-Linux/solr/core/build/test-results/test/outputs/OUTPUT-org.apache.solr.pkg.TestPackages.txt
    Reproduce with: gradlew :solr:core:test --tests "org.apache.solr.pkg.TestPackages" -Ptests.jvms=6 -Ptests.haltonfailure=false -Ptests.jvmargs=-XX:-UseCompressedOops -XX:+UseConcMarkSweepGC -Ptests.seed=14698FAD34031C5F -Ptests.multiplier=3 -Ptests.badapples=false -Ptests.file.encoding=UTF-8


Deprecated Gradle features were used in this build, making it incompatible with Gradle 7.0.
Use '--warning-mode all' to show the individual deprecation warnings.
See https://docs.gradle.org/6.4.1/userguide/command_line_interface.html#sec:command_line_warnings

BUILD SUCCESSFUL in 42m 42s
836 actionable tasks: 836 executed
Build step 'Invoke Gradle script' changed build result to SUCCESS
Archiving artifacts
java.lang.InterruptedException: no matches found within 10000
	at hudson.FilePath$ValidateAntFileMask.hasMatch(FilePath.java:2875)
	at hudson.FilePath$ValidateAntFileMask.invoke(FilePath.java:2754)
	at hudson.FilePath$ValidateAntFileMask.invoke(FilePath.java:2735)
	at hudson.FilePath.act(FilePath.java:1076)
	at hudson.FilePath.act(FilePath.java:1059)
	at hudson.FilePath.validateAntFileMask(FilePath.java:2733)
	at hudson.tasks.ArtifactArchiver.perform(ArtifactArchiver.java:270)
	at hudson.tasks.BuildStepCompatibilityLayer.perform(BuildStepCompatibilityLayer.java:78)
	at hudson.tasks.BuildStepMonitor$1.perform(BuildStepMonitor.java:20)
	at hudson.model.AbstractBuild$AbstractBuildExecution.perform(AbstractBuild.java:804)
	at hudson.model.AbstractBuild$AbstractBuildExecution.performAllBuildSteps(AbstractBuild.java:753)
	at hudson.model.Build$BuildExecution.post2(Build.java:177)
	at hudson.model.AbstractBuild$AbstractBuildExecution.post(AbstractBuild.java:698)
	at hudson.model.Run.execute(Run.java:1919)
	at hudson.model.FreeStyleBuild.run(FreeStyleBuild.java:43)
	at hudson.model.ResourceController.execute(ResourceController.java:97)
	at hudson.model.Executor.run(Executor.java:428)
No artifacts found that match the file pattern "**/*.events,heapdumps/**,**/*_pid*.log". Configuration error?
[Java] Sleeping for 5 seconds due to JENKINS-32191...
[Java] Parsing console log (workspace: '/home/jenkins/workspace/Lucene-Solr-master-Linux')
[Java] Successfully parsed console log
[Java] -> found 0 issues (skipped 0 duplicates)
[Java] Skipping post processing
[Java] No filter has been set, publishing all 0 issues
[Java] Using reference build 'Lucene-Solr-master-Linux #28071' to compute new, fixed, and outstanding issues
[Java] Issues delta (vs. reference build): outstanding: 0, new: 0, fixed: 0
[Java] No quality gates have been set - skipping
[Java] Health report is disabled - skipping
[Java] Created analysis result for 0 issues (found 0 new issues, fixed 0 issues)
[Java] Attaching ResultAction with ID 'java' to run 'Lucene-Solr-master-Linux #28072'.
[Checks API] No suitable checks publisher found.
Recording test results
Build step 'Publish JUnit test result report' changed build result to UNSTABLE
[Checks API] No suitable checks publisher found.
Email was triggered for: Unstable (Test Failures)
Sending email for trigger: Unstable (Test Failures)