You are viewing a plain text version of this content. The canonical link for it is here.
Posted to dev@mahout.apache.org by Apache Jenkins Server <je...@builds.apache.org> on 2013/06/12 01:12:34 UTC
Build failed in Jenkins: mahout-nightly » Mahout Integration #1259
See <https://builds.apache.org/job/mahout-nightly/org.apache.mahout$mahout-integration/1259/>
------------------------------------------
[INFO]
[INFO] ------------------------------------------------------------------------
[INFO] Building Mahout Integration 0.8-SNAPSHOT
[INFO] ------------------------------------------------------------------------
Downloading: http://repo.maven.apache.org/maven2/org/apache/lucene/lucene-benchmark/4.3.0/lucene-benchmark-4.3.0.pom
Downloaded: http://repo.maven.apache.org/maven2/org/apache/lucene/lucene-benchmark/4.3.0/lucene-benchmark-4.3.0.pom (6 KB at 17.3 KB/sec)
Downloading: http://repo.maven.apache.org/maven2/org/apache/lucene/lucene-highlighter/4.3.0/lucene-highlighter-4.3.0.pom
Downloaded: http://repo.maven.apache.org/maven2/org/apache/lucene/lucene-highlighter/4.3.0/lucene-highlighter-4.3.0.pom (4 KB at 182.7 KB/sec)
Downloading: http://repo.maven.apache.org/maven2/org/apache/lucene/lucene-memory/4.3.0/lucene-memory-4.3.0.pom
Downloaded: http://repo.maven.apache.org/maven2/org/apache/lucene/lucene-memory/4.3.0/lucene-memory-4.3.0.pom (3 KB at 82.8 KB/sec)
Downloading: http://repo.maven.apache.org/maven2/org/apache/lucene/lucene-queries/4.3.0/lucene-queries-4.3.0.pom
Downloaded: http://repo.maven.apache.org/maven2/org/apache/lucene/lucene-queries/4.3.0/lucene-queries-4.3.0.pom (3 KB at 47.9 KB/sec)
Downloading: http://repo.maven.apache.org/maven2/org/apache/lucene/lucene-queryparser/4.3.0/lucene-queryparser-4.3.0.pom
Downloaded: http://repo.maven.apache.org/maven2/org/apache/lucene/lucene-queryparser/4.3.0/lucene-queryparser-4.3.0.pom (6 KB at 88.9 KB/sec)
Downloading: http://repo.maven.apache.org/maven2/org/apache/lucene/lucene-sandbox/4.3.0/lucene-sandbox-4.3.0.pom
Downloaded: http://repo.maven.apache.org/maven2/org/apache/lucene/lucene-sandbox/4.3.0/lucene-sandbox-4.3.0.pom (3 KB at 58.0 KB/sec)
Downloading: http://repo.maven.apache.org/maven2/org/apache/lucene/lucene-facet/4.3.0/lucene-facet-4.3.0.pom
Downloaded: http://repo.maven.apache.org/maven2/org/apache/lucene/lucene-facet/4.3.0/lucene-facet-4.3.0.pom (5 KB at 12.7 KB/sec)
Downloading: http://repo.maven.apache.org/maven2/org/apache/lucene/lucene-benchmark/4.3.0/lucene-benchmark-4.3.0.jar
Downloading: http://repo.maven.apache.org/maven2/org/apache/lucene/lucene-highlighter/4.3.0/lucene-highlighter-4.3.0.jar
Downloading: http://repo.maven.apache.org/maven2/org/apache/lucene/lucene-queries/4.3.0/lucene-queries-4.3.0.jar
Downloading: http://repo.maven.apache.org/maven2/org/apache/lucene/lucene-memory/4.3.0/lucene-memory-4.3.0.jar
Downloading: http://repo.maven.apache.org/maven2/org/apache/lucene/lucene-queryparser/4.3.0/lucene-queryparser-4.3.0.jar
Downloaded: http://repo.maven.apache.org/maven2/org/apache/lucene/lucene-memory/4.3.0/lucene-memory-4.3.0.jar (36 KB at 2191.2 KB/sec)
Downloading: http://repo.maven.apache.org/maven2/org/apache/lucene/lucene-sandbox/4.3.0/lucene-sandbox-4.3.0.jar
Downloaded: http://repo.maven.apache.org/maven2/org/apache/lucene/lucene-highlighter/4.3.0/lucene-highlighter-4.3.0.jar (121 KB at 5483.5 KB/sec)
Downloading: http://repo.maven.apache.org/maven2/org/apache/lucene/lucene-facet/4.3.0/lucene-facet-4.3.0.jar
Downloaded: http://repo.maven.apache.org/maven2/org/apache/lucene/lucene-queries/4.3.0/lucene-queries-4.3.0.jar (198 KB at 8241.4 KB/sec)
Downloaded: http://repo.maven.apache.org/maven2/org/apache/lucene/lucene-sandbox/4.3.0/lucene-sandbox-4.3.0.jar (45 KB at 4443.5 KB/sec)
Downloaded: http://repo.maven.apache.org/maven2/org/apache/lucene/lucene-queryparser/4.3.0/lucene-queryparser-4.3.0.jar (377 KB at 13448.7 KB/sec)
Downloaded: http://repo.maven.apache.org/maven2/org/apache/lucene/lucene-benchmark/4.3.0/lucene-benchmark-4.3.0.jar (257 KB at 717.7 KB/sec)
Downloaded: http://repo.maven.apache.org/maven2/org/apache/lucene/lucene-facet/4.3.0/lucene-facet-4.3.0.jar (337 KB at 886.4 KB/sec)
[INFO]
[INFO] --- maven-clean-plugin:2.4.1:clean (default-clean) @ mahout-integration ---
[INFO] Using 'UTF-8' encoding to copy filtered resources.
[INFO] [INFO] Copying 0 resource
[INFO] --- maven-resources-plugin:2.6:resources (default-resources) @ mahout-integration ---
[INFO]
[INFO] --- maven-compiler-plugin:3.1:compile (default-compile) @ mahout-integration ---
[INFO] Changes detected - recompiling the module!
[INFO] Compiling 127 source files to <https://builds.apache.org/job/mahout-nightly/org.apache.mahout$mahout-integration/ws/target/classes>
[WARNING] Note: Some input files use or override a deprecated API.
[WARNING] Note: Recompile with -Xlint:deprecation for details.
[WARNING] Note: <https://builds.apache.org/job/mahout-nightly/org.apache.mahout$mahout-integration/ws/src/main/java/org/apache/mahout/cf/taste/impl/model/mongodb/MongoDBDataModel.java> uses unchecked or unsafe operations.
[WARNING] Note: Recompile with -Xlint:unchecked for details.
[INFO] [INFO] Using 'UTF-8' encoding to copy filtered resources.
[INFO] Copying 10 resources
[INFO] --- maven-resources-plugin:2.6:testResources (default-testResources) @ mahout-integration ---
[INFO]
[INFO] --- maven-compiler-plugin:3.1:testCompile (default-testCompile) @ mahout-integration ---
[INFO] Changes detected - recompiling the module!
[INFO] Compiling 39 source files to <https://builds.apache.org/job/mahout-nightly/org.apache.mahout$mahout-integration/ws/target/test-classes>
[WARNING] Note: Some input files use or override a deprecated API.
[WARNING] Note: Recompile with -Xlint:deprecation for details.
[INFO] [INFO] Surefire report directory: <https://builds.apache.org/job/mahout-nightly/org.apache.mahout$mahout-integration/ws/target/surefire-reports>
-------------------------------------------------------
T E S T S
-------------------------------------------------------
-------------------------------------------------------
T E S T S
-------------------------------------------------------
[INFO] --- maven-surefire-plugin:2.14.1:test (default-test) @ mahout-integration ---
parallel='classes', perCoreThreadCount=false, threadCount=1, useUnlimitedThreads=false
parallel='classes', perCoreThreadCount=false, threadCount=1, useUnlimitedThreads=false
parallel='classes', perCoreThreadCount=false, threadCount=1, useUnlimitedThreads=false
parallel='classes', perCoreThreadCount=false, threadCount=1, useUnlimitedThreads=false
parallel='classes', perCoreThreadCount=false, threadCount=1, useUnlimitedThreads=false
parallel='classes', perCoreThreadCount=false, threadCount=1, useUnlimitedThreads=false
parallel='classes', perCoreThreadCount=false, threadCount=1, useUnlimitedThreads=false
parallel='classes', perCoreThreadCount=false, threadCount=1, useUnlimitedThreads=false
parallel='classes', perCoreThreadCount=false, threadCount=1, useUnlimitedThreads=false
parallel='classes', perCoreThreadCount=false, threadCount=1, useUnlimitedThreads=false
parallel='classes', perCoreThreadCount=false, threadCount=1, useUnlimitedThreads=false
Running org.apache.mahout.text.LuceneSegmentInputSplitTest
Running org.apache.mahout.text.MailArchivesClusteringAnalyzerTest
Running org.apache.mahout.text.SequenceFilesFromMailArchivesTest
Running org.apache.mahout.text.TestSequenceFilesFromDirectory
parallel='classes', perCoreThreadCount=false, threadCount=1, useUnlimitedThreads=false
Running org.apache.mahout.text.LuceneSegmentInputFormatTest
Tests run: 1, Failures: 0, Errors: 0, Skipped: 0, Time elapsed: 0.139 sec
Running org.apache.mahout.text.SequenceFilesFromLuceneStorageMRJobTest
Running org.apache.mahout.text.SequenceFilesFromLuceneStorageDriverTest
Running org.apache.mahout.text.LuceneSegmentRecordReaderTest
Running org.apache.mahout.text.LuceneStorageConfigurationTest
Running org.apache.mahout.text.SequenceFilesFromLuceneStorageTest
Running org.apache.mahout.utils.vectors.VectorHelperTest
Tests run: 3, Failures: 0, Errors: 0, Skipped: 0, Time elapsed: 0.039 sec
Running org.apache.mahout.utils.vectors.csv.CSVVectorIteratorTest
parallel='classes', perCoreThreadCount=false, threadCount=1, useUnlimitedThreads=false
Running org.apache.mahout.utils.vectors.arff.MapBackedARFFModelTest
Tests run: 1, Failures: 0, Errors: 0, Skipped: 0, Time elapsed: 0.018 sec
Tests run: 1, Failures: 0, Errors: 0, Skipped: 0, Time elapsed: 0.753 sec
parallel='classes', perCoreThreadCount=false, threadCount=1, useUnlimitedThreads=false
Tests run: 2, Failures: 0, Errors: 0, Skipped: 0, Time elapsed: 1.219 sec
Tests run: 1, Failures: 0, Errors: 0, Skipped: 0, Time elapsed: 1.563 sec
Running org.apache.mahout.utils.vectors.arff.DriverTest
Tests run: 1, Failures: 0, Errors: 0, Skipped: 0, Time elapsed: 1.592 sec
parallel='classes', perCoreThreadCount=false, threadCount=1, useUnlimitedThreads=false
Running org.apache.mahout.utils.vectors.arff.ARFFVectorIterableTest
parallel='classes', perCoreThreadCount=false, threadCount=1, useUnlimitedThreads=false
Tests run: 8, Failures: 0, Errors: 0, Skipped: 0, Time elapsed: 0.154 sec
Running org.apache.mahout.utils.vectors.arff.ARFFTypeTest
Tests run: 1, Failures: 0, Errors: 0, Skipped: 0, Time elapsed: 0.006 sec
parallel='classes', perCoreThreadCount=false, threadCount=1, useUnlimitedThreads=false
parallel='classes', perCoreThreadCount=false, threadCount=1, useUnlimitedThreads=false
Tests run: 2, Failures: 0, Errors: 0, Skipped: 0, Time elapsed: 0.763 sec
parallel='classes', perCoreThreadCount=false, threadCount=1, useUnlimitedThreads=false
Running org.apache.mahout.utils.vectors.lucene.DriverTest
Running org.apache.mahout.utils.vectors.lucene.CachedTermInfoTest
Running org.apache.mahout.utils.vectors.lucene.LuceneIterableTest
parallel='classes', perCoreThreadCount=false, threadCount=1, useUnlimitedThreads=false
parallel='classes', perCoreThreadCount=false, threadCount=1, useUnlimitedThreads=false
Running org.apache.mahout.utils.vectors.io.VectorWriterTest
parallel='classes', perCoreThreadCount=false, threadCount=1, useUnlimitedThreads=false
Running org.apache.mahout.utils.nlp.collocations.llr.BloomTokenFilterTest
Tests run: 5, Failures: 0, Errors: 0, Skipped: 0, Time elapsed: 0.044 sec
Running org.apache.mahout.utils.SplitInputTest
Tests run: 1, Failures: 0, Errors: 0, Skipped: 0, Time elapsed: 0.542 sec
Tests run: 3, Failures: 0, Errors: 0, Skipped: 0, Time elapsed: 0.737 sec
parallel='classes', perCoreThreadCount=false, threadCount=1, useUnlimitedThreads=false
Running org.apache.mahout.utils.regex.RegexMapperTest
parallel='classes', perCoreThreadCount=false, threadCount=1, useUnlimitedThreads=false
Tests run: 2, Failures: 0, Errors: 0, Skipped: 0, Time elapsed: 1.136 sec
parallel='classes', perCoreThreadCount=false, threadCount=1, useUnlimitedThreads=false
Tests run: 1, Failures: 0, Errors: 0, Skipped: 0, Time elapsed: 3.9 sec
Running org.apache.mahout.utils.regex.RegexUtilsTest
Tests run: 1, Failures: 0, Errors: 0, Skipped: 0, Time elapsed: 0.028 sec
Running org.apache.mahout.utils.email.MailProcessorTest
Tests run: 2, Failures: 0, Errors: 0, Skipped: 0, Time elapsed: 0.194 sec
Tests run: 1, Failures: 0, Errors: 0, Skipped: 0, Time elapsed: 4.4 sec
parallel='classes', perCoreThreadCount=false, threadCount=1, useUnlimitedThreads=false
parallel='classes', perCoreThreadCount=false, threadCount=1, useUnlimitedThreads=false
Running org.apache.mahout.utils.TestConcatenateVectorsJob
parallel='classes', perCoreThreadCount=false, threadCount=1, useUnlimitedThreads=false
Tests run: 2, Failures: 0, Errors: 0, Skipped: 0, Time elapsed: 5.127 sec
parallel='classes', perCoreThreadCount=false, threadCount=1, useUnlimitedThreads=false
Tests run: 3, Failures: 0, Errors: 0, Skipped: 0, Time elapsed: 1.461 sec
parallel='classes', perCoreThreadCount=false, threadCount=1, useUnlimitedThreads=false
Running org.apache.mahout.utils.Bump125Test
Tests run: 1, Failures: 0, Errors: 0, Skipped: 0, Time elapsed: 0.014 sec
Running org.apache.mahout.cf.taste.impl.similarity.jdbc.MySQLJDBCInMemoryItemSimilarityTest
Tests run: 1, Failures: 0, Errors: 0, Skipped: 0, Time elapsed: 3.201 sec
Running org.apache.mahout.clustering.TestClusterEvaluator
Running org.apache.mahout.clustering.TestClusterDumper
parallel='classes', perCoreThreadCount=false, threadCount=1, useUnlimitedThreads=false
parallel='classes', perCoreThreadCount=false, threadCount=1, useUnlimitedThreads=false
Tests run: 1, Failures: 0, Errors: 0, Skipped: 0, Time elapsed: 0.536 sec
Tests run: 1, Failures: 0, Errors: 0, Skipped: 0, Time elapsed: 1.424 sec
Running org.apache.mahout.clustering.dirichlet.TestL1ModelClustering
Running org.apache.mahout.clustering.cdbw.TestCDbwEvaluator
Tests run: 1, Failures: 1, Errors: 0, Skipped: 0, Time elapsed: 6.971 sec <<< FAILURE!
testRun(org.apache.mahout.text.SequenceFilesFromLuceneStorageMRJobTest) Time elapsed: 6.97 sec <<< FAILURE!
java.lang.AssertionError: expected:<2002> but was:<0>
at org.junit.Assert.fail(Assert.java:88)
at org.junit.Assert.failNotEquals(Assert.java:743)
at org.junit.Assert.assertEquals(Assert.java:118)
at org.junit.Assert.assertEquals(Assert.java:555)
at org.junit.Assert.assertEquals(Assert.java:542)
at org.apache.mahout.text.SequenceFilesFromLuceneStorageMRJobTest.testRun(SequenceFilesFromLuceneStorageMRJobTest.java:73)
Tests run: 4, Failures: 0, Errors: 0, Skipped: 0, Time elapsed: 1.497 sec
Tests run: 12, Failures: 0, Errors: 0, Skipped: 0, Time elapsed: 7.778 sec
Tests run: 5, Failures: 0, Errors: 0, Skipped: 0, Time elapsed: 10.924 sec
Tests run: 6, Failures: 0, Errors: 0, Skipped: 0, Time elapsed: 11.04 sec
Tests run: 6, Failures: 0, Errors: 0, Skipped: 0, Time elapsed: 7.59 sec
Tests run: 12, Failures: 0, Errors: 0, Skipped: 0, Time elapsed: 7.881 sec
Tests run: 12, Failures: 0, Errors: 0, Skipped: 0, Time elapsed: 18.055 sec
Results :
Failed tests:
SequenceFilesFromLuceneStorageMRJobTest.testRun:73->Assert.assertEquals:542->Assert.assertEquals:555->Assert.assertEquals:118->Assert.failNotEquals:743->Assert.fail:88 expected:<2002> but was:<0>
Tests run: 104, Failures: 1, Errors: 0, Skipped: 0
[JENKINS] Recording test results
Jenkins build is back to normal : mahout-nightly » Mahout Integration #1260
Posted by Apache Jenkins Server <je...@builds.apache.org>.
See <https://builds.apache.org/job/mahout-nightly/org.apache.mahout$mahout-integration/1260/changes>