You are viewing a plain text version of this content. The canonical link for it is here.
Posted to notifications@maven.apache.org by Apache Jenkins Server <je...@builds.apache.org> on 2020/09/26 09:44:45 UTC
Build failed in Jenkins: Maven » Maven TLP » maven-wagon » master #18
See https://ci-builds.apache.org/job/Maven/job/maven-box/job/maven-wagon/job/master/18/
Changes:
* fix }
No tests ran.
Build log:
Started by user Robert Scholte
Obtained Jenkinsfile from 1a90ecc5819ee3e146ba0769e6488579d865de16
Running in Durability level: PERFORMANCE_OPTIMIZED
Loading library jenkins-env@master
Attempting to resolve master from remote references...
> git --version # timeout=10
> git ls-remote -h -- https://gitbox.apache.org/repos/asf/maven-jenkins-env.git # timeout=10
Found match: refs/heads/master revision 6e8965c3e604ff37e18bdaccfe14f976d3526c12
No credentials specified
> git rev-parse --is-inside-work-tree # timeout=10
Fetching changes from the remote Git repository
> git config remote.origin.url https://gitbox.apache.org/repos/asf/maven-jenkins-env.git # timeout=10
Fetching without tags
Fetching upstream changes from https://gitbox.apache.org/repos/asf/maven-jenkins-env.git
> git --version # timeout=10
> git fetch --no-tags --force --progress -- https://gitbox.apache.org/repos/asf/maven-jenkins-env.git +refs/heads/*:refs/remotes/origin/* # timeout=10
Checking out Revision 6e8965c3e604ff37e18bdaccfe14f976d3526c12 (master)
> git config core.sparsecheckout # timeout=10
> git checkout -f 6e8965c3e604ff37e18bdaccfe14f976d3526c12 # timeout=10
Commit message: "There's no M3.6.3 for Windows"
> git rev-list --no-walk 6e8965c3e604ff37e18bdaccfe14f976d3526c12 # timeout=10
Loading library jenkins-lib@master
Attempting to resolve master from remote references...
> git --version # timeout=10
> git ls-remote -h -- https://gitbox.apache.org/repos/asf/maven-jenkins-lib.git # timeout=10
Found match: refs/heads/master revision 97e79eb867e8a731880e5c6c2e01f77505cffc3c
No credentials specified
> git rev-parse --is-inside-work-tree # timeout=10
Fetching changes from the remote Git repository
> git config remote.origin.url https://gitbox.apache.org/repos/asf/maven-jenkins-lib.git # timeout=10
Fetching without tags
Fetching upstream changes from https://gitbox.apache.org/repos/asf/maven-jenkins-lib.git
> git --version # timeout=10
> git fetch --no-tags --force --progress -- https://gitbox.apache.org/repos/asf/maven-jenkins-lib.git +refs/heads/*:refs/remotes/origin/* # timeout=10
Checking out Revision 97e79eb867e8a731880e5c6c2e01f77505cffc3c (master)
> git config core.sparsecheckout # timeout=10
> git checkout -f 97e79eb867e8a731880e5c6c2e01f77505cffc3c # timeout=10
Commit message: "fix }"
> git rev-list --no-walk f936616c399eb35d9e65f32d5ab7b24955b2fe91 # timeout=10
[Pipeline] Start of Pipeline
[Pipeline] properties
[Pipeline] echo
OS: linux JDK: 7 Maven: 3.x.x => Label: ubuntu JDK: JDK 1.7 (latest) Maven: Maven 3.6.3
[Pipeline] echo
OS: linux JDK: 8 Maven: 3.x.x => Label: ubuntu JDK: JDK 1.8 (latest) Maven: Maven 3.6.3
[Pipeline] echo
OS: linux JDK: 11 Maven: 3.x.x => Label: ubuntu JDK: JDK 11 (latest) Maven: Maven 3.6.3
[Pipeline] echo
OS: windows JDK: 7 Maven: 3.x.x => Label: Windows JDK: JDK 1.7 (latest) Maven: Maven 3.6.2 (Windows)
[Pipeline] echo
OS: windows JDK: 8 Maven: 3.x.x => Label: Windows JDK: JDK 1.8 (latest) Maven: Maven 3.6.2 (Windows)
[Pipeline] echo
OS: windows JDK: 11 Maven: 3.x.x => Label: Windows JDK: JDK 11 (latest) Maven: Maven 3.6.2 (Windows)
[Pipeline] parallel
[Pipeline] { (Branch: linux-jdk7)
[Pipeline] { (Branch: linux-jdk8)
[Pipeline] { (Branch: linux-jdk11)
[Pipeline] { (Branch: windows-jdk7)
[Pipeline] { (Branch: windows-jdk8)
[Pipeline] { (Branch: windows-jdk11)
[Pipeline] node
[Pipeline] node
[Pipeline] node
Running on H34 in /home/jenkins/workspace/ven_maven-box_maven-wagon_master
Running on H28 in /home/jenkins/jenkins-agent/workspace/ven_maven-box_maven-wagon_master
[Pipeline] node
Running on H43 in /home/jenkins/workspace/ven_maven-box_maven-wagon_master
[Pipeline] node
[Pipeline] node
[Pipeline] {
[Pipeline] {
[Pipeline] {
[Pipeline] pwd
[Pipeline] }
[Pipeline] pwd
[Pipeline] }
[Pipeline] pwd
[Pipeline] }
Running on jenkins-win-he-de-1 in f:\jenkins\jenkins-slave\712657a4\workspace\ven_maven-box_maven-wagon_master
[Pipeline] // node
[Pipeline] // node
[Pipeline] // node
[Pipeline] {
[Pipeline] }
Failed in branch linux-jdk7
[Pipeline] }
Failed in branch linux-jdk8
[Pipeline] }
Failed in branch linux-jdk11
[Pipeline] pwd
[Pipeline] }
[Pipeline] // node
Running on jenkins-win-he-de-1 in f:\jenkins\jenkins-slave\712657a4\workspace\ven_maven-box_maven-wagon_master
[Pipeline] }
Failed in branch windows-jdk7
[Pipeline] {
[Pipeline] pwd
[Pipeline] }
[Pipeline] // node
Running on jenkins-win-he-de-1 in f:\jenkins\jenkins-slave\712657a4\workspace\ven_maven-box_maven-wagon_master
[Pipeline] }
Failed in branch windows-jdk8
[Pipeline] {
[Pipeline] pwd
[Pipeline] }
[Pipeline] // node
[Pipeline] }
Failed in branch windows-jdk11
[Pipeline] // parallel
[Pipeline] echo
[FAILURE-001] groovy.lang.MissingPropertyException: No such property: taskContext for class: groovy.lang.Binding
[Pipeline] stage
[Pipeline] { (Notifications)
[Pipeline] echo
Build result: FAILURE
[Pipeline] jiraIssueSelector
[Pipeline] echo
The authors of changes [rfscholte].
[Pipeline] echo
Sending email ...
[Pipeline] emailext
Build unstable in Jenkins: Maven » Maven TLP » maven-wagon » master #20
Posted by Apache Jenkins Server <je...@builds.apache.org>.
See https://ci-builds.apache.org/job/Maven/job/maven-box/job/maven-wagon/job/master/20/
Changes:
* Revert "don't pick up tmpWs from a context"
* enable tmpWs to prevent long path failures on Windows
18 tests failed.
FAILED: org.apache.maven.wagon.providers.scm.ScmGitExeWagonTest.windows-jdk7 / Build windows-jdk7 / testWagonPutDirectory
Error Message:
Error checking out: command failed: Cloning into 'checkout-org.apache.maven.wagon.providers.scm.UserSafeGitExeScmProvider'...
From file:///F:/jenkins/jenkins-slave/712657a4/workspace/ven_maven-box_maven-wagon_master/m/wagon-providers/wagon-scm/target/test-classes/test-repo-git-test
* branch master -> FETCH_HEAD
fatal: failed to read object 3a67db9b159d7130f6fb7bf6588f9c2619fecafe: Filename too long
Stack Trace:
org.apache.maven.wagon.TransferFailedException:
Error checking out: command failed: Cloning into 'checkout-org.apache.maven.wagon.providers.scm.UserSafeGitExeScmProvider'...
From file:///F:/jenkins/jenkins-slave/712657a4/workspace/ven_maven-box_maven-wagon_master/m/wagon-providers/wagon-scm/target/test-classes/test-repo-git-test
* branch master -> FETCH_HEAD
fatal: failed to read object 3a67db9b159d7130f6fb7bf6588f9c2619fecafe: Filename too long
Caused by: org.apache.maven.scm.ScmException:
command failed: Cloning into 'checkout-org.apache.maven.wagon.providers.scm.UserSafeGitExeScmProvider'...
From file:///F:/jenkins/jenkins-slave/712657a4/workspace/ven_maven-box_maven-wagon_master/m/wagon-providers/wagon-scm/target/test-classes/test-repo-git-test
* branch master -> FETCH_HEAD
fatal: failed to read object 3a67db9b159d7130f6fb7bf6588f9c2619fecafe: Filename too long
FAILED: org.apache.maven.wagon.providers.scm.ScmGitExeWagonTest.windows-jdk7 / Build windows-jdk7 / testWagonPutDirectoryDeepDestination
Error Message:
Error checking out: command failed: Cloning into 'checkout-org.apache.maven.wagon.providers.scm.UserSafeGitExeScmProvider'...
From file:///F:/jenkins/jenkins-slave/712657a4/workspace/ven_maven-box_maven-wagon_master/m/wagon-providers/wagon-scm/target/test-classes/test-repo-git-test
* branch master -> FETCH_HEAD
fatal: failed to read object 3a67db9b159d7130f6fb7bf6588f9c2619fecafe: Filename too long
Stack Trace:
org.apache.maven.wagon.TransferFailedException:
Error checking out: command failed: Cloning into 'checkout-org.apache.maven.wagon.providers.scm.UserSafeGitExeScmProvider'...
From file:///F:/jenkins/jenkins-slave/712657a4/workspace/ven_maven-box_maven-wagon_master/m/wagon-providers/wagon-scm/target/test-classes/test-repo-git-test
* branch master -> FETCH_HEAD
fatal: failed to read object 3a67db9b159d7130f6fb7bf6588f9c2619fecafe: Filename too long
Caused by: org.apache.maven.scm.ScmException:
command failed: Cloning into 'checkout-org.apache.maven.wagon.providers.scm.UserSafeGitExeScmProvider'...
From file:///F:/jenkins/jenkins-slave/712657a4/workspace/ven_maven-box_maven-wagon_master/m/wagon-providers/wagon-scm/target/test-classes/test-repo-git-test
* branch master -> FETCH_HEAD
fatal: failed to read object 3a67db9b159d7130f6fb7bf6588f9c2619fecafe: Filename too long
FAILED: org.apache.maven.wagon.providers.scm.ScmGitExeWagonTest.windows-jdk7 / Build windows-jdk7 / testWagon
Error Message:
Unexpected method call TransferListener.transferError(TransferEvent[GET|ERROR|Repository[scm:git:file:///F:/jenkins/jenkins-slave/712657a4/workspace/ven_maven-box_maven-wagon_master/m/wagon-providers/wagon-scm/target/test-classes/test-repo-git-test/]|null|test-resource[len = 18; mod = 1601114268550]]):
TransferListener.transferCompleted(TransferEvent[PUT|COMPLETED|Repository[scm:git:file:///F:/jenkins/jenkins-slave/712657a4/workspace/ven_maven-box_maven-wagon_master/m/wagon-providers/wagon-scm/target/test-classes/test-repo-git-test/]|F:\jenkins\jenkins-slave\712657a4\workspace\ven_maven-box_maven-wagon_master\m\wagon-providers\wagon-scm\target\test-output\test-resource|test-resource[len = 18; mod = 1601114268550]]): expected: 1, actual: 0
Stack Trace:
java.lang.AssertionError:
Unexpected method call TransferListener.transferError(TransferEvent[GET|ERROR|Repository[scm:git:file:///F:/jenkins/jenkins-slave/712657a4/workspace/ven_maven-box_maven-wagon_master/m/wagon-providers/wagon-scm/target/test-classes/test-repo-git-test/]|null|test-resource[len = 18; mod = 1601114268550]]):
TransferListener.transferCompleted(TransferEvent[PUT|COMPLETED|Repository[scm:git:file:///F:/jenkins/jenkins-slave/712657a4/workspace/ven_maven-box_maven-wagon_master/m/wagon-providers/wagon-scm/target/test-classes/test-repo-git-test/]|F:\jenkins\jenkins-slave\712657a4\workspace\ven_maven-box_maven-wagon_master\m\wagon-providers\wagon-scm\target\test-output\test-resource|test-resource[len = 18; mod = 1601114268550]]): expected: 1, actual: 0
FAILED: org.apache.maven.wagon.providers.scm.ScmGitExeWagonTest.windows-jdk7 / Build windows-jdk7 / testWagonPutDirectoryForDot
Error Message:
Error checking out: command failed: Cloning into 'checkout-org.apache.maven.wagon.providers.scm.UserSafeGitExeScmProvider'...
From file:///F:/jenkins/jenkins-slave/712657a4/workspace/ven_maven-box_maven-wagon_master/m/wagon-providers/wagon-scm/target/test-classes/test-repo-git-test
* branch master -> FETCH_HEAD
fatal: failed to read object 3a67db9b159d7130f6fb7bf6588f9c2619fecafe: Filename too long
Stack Trace:
org.apache.maven.wagon.TransferFailedException:
Error checking out: command failed: Cloning into 'checkout-org.apache.maven.wagon.providers.scm.UserSafeGitExeScmProvider'...
From file:///F:/jenkins/jenkins-slave/712657a4/workspace/ven_maven-box_maven-wagon_master/m/wagon-providers/wagon-scm/target/test-classes/test-repo-git-test
* branch master -> FETCH_HEAD
fatal: failed to read object 3a67db9b159d7130f6fb7bf6588f9c2619fecafe: Filename too long
Caused by: org.apache.maven.scm.ScmException:
command failed: Cloning into 'checkout-org.apache.maven.wagon.providers.scm.UserSafeGitExeScmProvider'...
From file:///F:/jenkins/jenkins-slave/712657a4/workspace/ven_maven-box_maven-wagon_master/m/wagon-providers/wagon-scm/target/test-classes/test-repo-git-test
* branch master -> FETCH_HEAD
fatal: failed to read object 3a67db9b159d7130f6fb7bf6588f9c2619fecafe: Filename too long
FAILED: org.apache.maven.wagon.providers.scm.ScmGitExeWagonTest.windows-jdk7 / Build windows-jdk7 / testFailedGet
Error Message:
Error getting file from SCM
Stack Trace:
org.apache.maven.wagon.TransferFailedException: Error getting file from SCM
Caused by: org.apache.maven.scm.ScmException:
command failed: Cloning into 'checkout-org.apache.maven.wagon.providers.scm.UserSafeGitExeScmProvider'...
From file:///F:/jenkins/jenkins-slave/712657a4/workspace/ven_maven-box_maven-wagon_master/m/wagon-providers/wagon-scm/target/test-classes/test-repo-git-test
* branch master -> FETCH_HEAD
fatal: failed to read object 3a67db9b159d7130f6fb7bf6588f9c2619fecafe: Filename too long
FAILED: org.apache.maven.wagon.providers.scm.ScmGitExeWagonTest.windows-jdk7 / Build windows-jdk7 / testWagonPutDirectoryWhenDirectoryAlreadyExists
Error Message:
Error checking out: command failed: Cloning into 'checkout-org.apache.maven.wagon.providers.scm.UserSafeGitExeScmProvider'...
From file:///F:/jenkins/jenkins-slave/712657a4/workspace/ven_maven-box_maven-wagon_master/m/wagon-providers/wagon-scm/target/test-classes/test-repo-git-test
* branch master -> FETCH_HEAD
fatal: failed to read object 3a67db9b159d7130f6fb7bf6588f9c2619fecafe: Filename too long
Stack Trace:
org.apache.maven.wagon.TransferFailedException:
Error checking out: command failed: Cloning into 'checkout-org.apache.maven.wagon.providers.scm.UserSafeGitExeScmProvider'...
From file:///F:/jenkins/jenkins-slave/712657a4/workspace/ven_maven-box_maven-wagon_master/m/wagon-providers/wagon-scm/target/test-classes/test-repo-git-test
* branch master -> FETCH_HEAD
fatal: failed to read object 3a67db9b159d7130f6fb7bf6588f9c2619fecafe: Filename too long
Caused by: org.apache.maven.scm.ScmException:
command failed: Cloning into 'checkout-org.apache.maven.wagon.providers.scm.UserSafeGitExeScmProvider'...
From file:///F:/jenkins/jenkins-slave/712657a4/workspace/ven_maven-box_maven-wagon_master/m/wagon-providers/wagon-scm/target/test-classes/test-repo-git-test
* branch master -> FETCH_HEAD
fatal: failed to read object 3a67db9b159d7130f6fb7bf6588f9c2619fecafe: Filename too long
FAILED: org.apache.maven.wagon.providers.scm.ScmGitExeWagonTest.windows-jdk8 / Build windows-jdk8 / testWagonPutDirectory
Error Message:
Error checking out: command failed: Cloning into 'checkout-org.apache.maven.wagon.providers.scm.UserSafeGitExeScmProvider'...
From file:///F:********@2/m/wagon-providers/wagon-scm/target/test-classes/test-repo-git-test
* branch master -> FETCH_HEAD
fatal: failed to read object 3a67db9b159d7130f6fb7bf6588f9c2619fecafe: Filename too long
Stack Trace:
org.apache.maven.wagon.TransferFailedException:
Error checking out: command failed: Cloning into 'checkout-org.apache.maven.wagon.providers.scm.UserSafeGitExeScmProvider'...
From file:///F:********@2/m/wagon-providers/wagon-scm/target/test-classes/test-repo-git-test
* branch master -> FETCH_HEAD
fatal: failed to read object 3a67db9b159d7130f6fb7bf6588f9c2619fecafe: Filename too long
Caused by: org.apache.maven.scm.ScmException:
command failed: Cloning into 'checkout-org.apache.maven.wagon.providers.scm.UserSafeGitExeScmProvider'...
From file:///F:********@2/m/wagon-providers/wagon-scm/target/test-classes/test-repo-git-test
* branch master -> FETCH_HEAD
fatal: failed to read object 3a67db9b159d7130f6fb7bf6588f9c2619fecafe: Filename too long
FAILED: org.apache.maven.wagon.providers.scm.ScmGitExeWagonTest.windows-jdk8 / Build windows-jdk8 / testWagonPutDirectoryDeepDestination
Error Message:
Error checking out: command failed: Cloning into 'checkout-org.apache.maven.wagon.providers.scm.UserSafeGitExeScmProvider'...
From file:///F:********@2/m/wagon-providers/wagon-scm/target/test-classes/test-repo-git-test
* branch master -> FETCH_HEAD
fatal: failed to read object 3a67db9b159d7130f6fb7bf6588f9c2619fecafe: Filename too long
Stack Trace:
org.apache.maven.wagon.TransferFailedException:
Error checking out: command failed: Cloning into 'checkout-org.apache.maven.wagon.providers.scm.UserSafeGitExeScmProvider'...
From file:///F:********@2/m/wagon-providers/wagon-scm/target/test-classes/test-repo-git-test
* branch master -> FETCH_HEAD
fatal: failed to read object 3a67db9b159d7130f6fb7bf6588f9c2619fecafe: Filename too long
Caused by: org.apache.maven.scm.ScmException:
command failed: Cloning into 'checkout-org.apache.maven.wagon.providers.scm.UserSafeGitExeScmProvider'...
From file:///F:********@2/m/wagon-providers/wagon-scm/target/test-classes/test-repo-git-test
* branch master -> FETCH_HEAD
fatal: failed to read object 3a67db9b159d7130f6fb7bf6588f9c2619fecafe: Filename too long
FAILED: org.apache.maven.wagon.providers.scm.ScmGitExeWagonTest.windows-jdk8 / Build windows-jdk8 / testWagon
Error Message:
Unexpected method call TransferListener.transferError(TransferEvent[GET|ERROR|Repository[scm:git:file:///F:/jenkins/jenkins-slave/712657a4/workspace/ven_maven-box_maven-wagon_master@2/m/wagon-providers/wagon-scm/target/test-classes/test-repo-git-test/]|null|test-resource[len = 18; mod = 1601114595433]]):
TransferListener.transferCompleted(TransferEvent[PUT|COMPLETED|Repository[scm:git:file:///F:/jenkins/jenkins-slave/712657a4/workspace/ven_maven-box_maven-wagon_master@2/m/wagon-providers/wagon-scm/target/test-classes/test-repo-git-test/]|F:\jenkins\jenkins-slave\712657a4\workspace\ven_maven-box_maven-wagon_master@2\m\wagon-providers\wagon-scm\target\test-output\test-resource|test-resource[len = 18; mod = 1601114595433]]): expected: 1, actual: 0
Stack Trace:
java.lang.AssertionError:
Unexpected method call TransferListener.transferError(TransferEvent[GET|ERROR|Repository[scm:git:file:///F:/jenkins/jenkins-slave/712657a4/workspace/ven_maven-box_maven-wagon_master@2/m/wagon-providers/wagon-scm/target/test-classes/test-repo-git-test/]|null|test-resource[len = 18; mod = 1601114595433]]):
TransferListener.transferCompleted(TransferEvent[PUT|COMPLETED|Repository[scm:git:file:///F:/jenkins/jenkins-slave/712657a4/workspace/ven_maven-box_maven-wagon_master@2/m/wagon-providers/wagon-scm/target/test-classes/test-repo-git-test/]|F:\jenkins\jenkins-slave\712657a4\workspace\ven_maven-box_maven-wagon_master@2\m\wagon-providers\wagon-scm\target\test-output\test-resource|test-resource[len = 18; mod = 1601114595433]]): expected: 1, actual: 0
FAILED: org.apache.maven.wagon.providers.scm.ScmGitExeWagonTest.windows-jdk8 / Build windows-jdk8 / testWagonPutDirectoryForDot
Error Message:
Error checking out: command failed: Cloning into 'checkout-org.apache.maven.wagon.providers.scm.UserSafeGitExeScmProvider'...
From file:///F:********@2/m/wagon-providers/wagon-scm/target/test-classes/test-repo-git-test
* branch master -> FETCH_HEAD
fatal: failed to read object 3a67db9b159d7130f6fb7bf6588f9c2619fecafe: Filename too long
Stack Trace:
org.apache.maven.wagon.TransferFailedException:
Error checking out: command failed: Cloning into 'checkout-org.apache.maven.wagon.providers.scm.UserSafeGitExeScmProvider'...
From file:///F:********@2/m/wagon-providers/wagon-scm/target/test-classes/test-repo-git-test
* branch master -> FETCH_HEAD
fatal: failed to read object 3a67db9b159d7130f6fb7bf6588f9c2619fecafe: Filename too long
Caused by: org.apache.maven.scm.ScmException:
command failed: Cloning into 'checkout-org.apache.maven.wagon.providers.scm.UserSafeGitExeScmProvider'...
From file:///F:********@2/m/wagon-providers/wagon-scm/target/test-classes/test-repo-git-test
* branch master -> FETCH_HEAD
fatal: failed to read object 3a67db9b159d7130f6fb7bf6588f9c2619fecafe: Filename too long
FAILED: org.apache.maven.wagon.providers.scm.ScmGitExeWagonTest.windows-jdk8 / Build windows-jdk8 / testFailedGet
Error Message:
Error getting file from SCM
Stack Trace:
org.apache.maven.wagon.TransferFailedException: Error getting file from SCM
Caused by: org.apache.maven.scm.ScmException:
command failed: Cloning into 'checkout-org.apache.maven.wagon.providers.scm.UserSafeGitExeScmProvider'...
From file:///F:********@2/m/wagon-providers/wagon-scm/target/test-classes/test-repo-git-test
* branch master -> FETCH_HEAD
fatal: failed to read object 3a67db9b159d7130f6fb7bf6588f9c2619fecafe: Filename too long
FAILED: org.apache.maven.wagon.providers.scm.ScmGitExeWagonTest.windows-jdk8 / Build windows-jdk8 / testWagonPutDirectoryWhenDirectoryAlreadyExists
Error Message:
Error checking out: command failed: Cloning into 'checkout-org.apache.maven.wagon.providers.scm.UserSafeGitExeScmProvider'...
From file:///F:********@2/m/wagon-providers/wagon-scm/target/test-classes/test-repo-git-test
* branch master -> FETCH_HEAD
fatal: failed to read object 3a67db9b159d7130f6fb7bf6588f9c2619fecafe: Filename too long
Stack Trace:
org.apache.maven.wagon.TransferFailedException:
Error checking out: command failed: Cloning into 'checkout-org.apache.maven.wagon.providers.scm.UserSafeGitExeScmProvider'...
From file:///F:********@2/m/wagon-providers/wagon-scm/target/test-classes/test-repo-git-test
* branch master -> FETCH_HEAD
fatal: failed to read object 3a67db9b159d7130f6fb7bf6588f9c2619fecafe: Filename too long
Caused by: org.apache.maven.scm.ScmException:
command failed: Cloning into 'checkout-org.apache.maven.wagon.providers.scm.UserSafeGitExeScmProvider'...
From file:///F:********@2/m/wagon-providers/wagon-scm/target/test-classes/test-repo-git-test
* branch master -> FETCH_HEAD
fatal: failed to read object 3a67db9b159d7130f6fb7bf6588f9c2619fecafe: Filename too long
FAILED: org.apache.maven.wagon.providers.scm.ScmGitExeWagonTest.windows-jdk11 / Build windows-jdk11 / testWagonPutDirectory
Error Message:
Error checking out: command failed: Cloning into 'checkout-org.apache.maven.wagon.providers.scm.UserSafeGitExeScmProvider'...
From file:///F:/jenkins/jenkins-slave/712657a4/workspace/ven_maven-box_maven-wagon_master/m/wagon-providers/wagon-scm/target/test-classes/test-repo-git-test
* branch master -> FETCH_HEAD
fatal: failed to read object 3a67db9b159d7130f6fb7bf6588f9c2619fecafe: Filename too long
Stack Trace:
org.apache.maven.wagon.TransferFailedException:
Error checking out: command failed: Cloning into 'checkout-org.apache.maven.wagon.providers.scm.UserSafeGitExeScmProvider'...
From file:///F:/jenkins/jenkins-slave/712657a4/workspace/ven_maven-box_maven-wagon_master/m/wagon-providers/wagon-scm/target/test-classes/test-repo-git-test
* branch master -> FETCH_HEAD
fatal: failed to read object 3a67db9b159d7130f6fb7bf6588f9c2619fecafe: Filename too long
Caused by: org.apache.maven.scm.ScmException:
command failed: Cloning into 'checkout-org.apache.maven.wagon.providers.scm.UserSafeGitExeScmProvider'...
From file:///F:/jenkins/jenkins-slave/712657a4/workspace/ven_maven-box_maven-wagon_master/m/wagon-providers/wagon-scm/target/test-classes/test-repo-git-test
* branch master -> FETCH_HEAD
fatal: failed to read object 3a67db9b159d7130f6fb7bf6588f9c2619fecafe: Filename too long
FAILED: org.apache.maven.wagon.providers.scm.ScmGitExeWagonTest.windows-jdk11 / Build windows-jdk11 / testWagonPutDirectoryDeepDestination
Error Message:
Error checking out: command failed: Cloning into 'checkout-org.apache.maven.wagon.providers.scm.UserSafeGitExeScmProvider'...
From file:///F:/jenkins/jenkins-slave/712657a4/workspace/ven_maven-box_maven-wagon_master/m/wagon-providers/wagon-scm/target/test-classes/test-repo-git-test
* branch master -> FETCH_HEAD
fatal: failed to read object 3a67db9b159d7130f6fb7bf6588f9c2619fecafe: Filename too long
Stack Trace:
org.apache.maven.wagon.TransferFailedException:
Error checking out: command failed: Cloning into 'checkout-org.apache.maven.wagon.providers.scm.UserSafeGitExeScmProvider'...
From file:///F:/jenkins/jenkins-slave/712657a4/workspace/ven_maven-box_maven-wagon_master/m/wagon-providers/wagon-scm/target/test-classes/test-repo-git-test
* branch master -> FETCH_HEAD
fatal: failed to read object 3a67db9b159d7130f6fb7bf6588f9c2619fecafe: Filename too long
Caused by: org.apache.maven.scm.ScmException:
command failed: Cloning into 'checkout-org.apache.maven.wagon.providers.scm.UserSafeGitExeScmProvider'...
From file:///F:/jenkins/jenkins-slave/712657a4/workspace/ven_maven-box_maven-wagon_master/m/wagon-providers/wagon-scm/target/test-classes/test-repo-git-test
* branch master -> FETCH_HEAD
fatal: failed to read object 3a67db9b159d7130f6fb7bf6588f9c2619fecafe: Filename too long
FAILED: org.apache.maven.wagon.providers.scm.ScmGitExeWagonTest.windows-jdk11 / Build windows-jdk11 / testWagon
Error Message:
Unexpected method call TransferListener.transferError(TransferEvent[GET|ERROR|Repository[scm:git:file:///F:/jenkins/jenkins-slave/712657a4/workspace/ven_maven-box_maven-wagon_master/m/wagon-providers/wagon-scm/target/test-classes/test-repo-git-test/]|null|test-resource[len = 18; mod = 1601114595409]]):
TransferListener.transferCompleted(TransferEvent[PUT|COMPLETED|Repository[scm:git:file:///F:/jenkins/jenkins-slave/712657a4/workspace/ven_maven-box_maven-wagon_master/m/wagon-providers/wagon-scm/target/test-classes/test-repo-git-test/]|F:\jenkins\jenkins-slave\712657a4\workspace\ven_maven-box_maven-wagon_master\m\wagon-providers\wagon-scm\target\test-output\test-resource|test-resource[len = 18; mod = 1601114595409]]): expected: 1, actual: 0
Stack Trace:
java.lang.AssertionError:
Unexpected method call TransferListener.transferError(TransferEvent[GET|ERROR|Repository[scm:git:file:///F:/jenkins/jenkins-slave/712657a4/workspace/ven_maven-box_maven-wagon_master/m/wagon-providers/wagon-scm/target/test-classes/test-repo-git-test/]|null|test-resource[len = 18; mod = 1601114595409]]):
TransferListener.transferCompleted(TransferEvent[PUT|COMPLETED|Repository[scm:git:file:///F:/jenkins/jenkins-slave/712657a4/workspace/ven_maven-box_maven-wagon_master/m/wagon-providers/wagon-scm/target/test-classes/test-repo-git-test/]|F:\jenkins\jenkins-slave\712657a4\workspace\ven_maven-box_maven-wagon_master\m\wagon-providers\wagon-scm\target\test-output\test-resource|test-resource[len = 18; mod = 1601114595409]]): expected: 1, actual: 0
FAILED: org.apache.maven.wagon.providers.scm.ScmGitExeWagonTest.windows-jdk11 / Build windows-jdk11 / testWagonPutDirectoryForDot
Error Message:
Error checking out: command failed: Cloning into 'checkout-org.apache.maven.wagon.providers.scm.UserSafeGitExeScmProvider'...
From file:///F:/jenkins/jenkins-slave/712657a4/workspace/ven_maven-box_maven-wagon_master/m/wagon-providers/wagon-scm/target/test-classes/test-repo-git-test
* branch master -> FETCH_HEAD
fatal: failed to read object 3a67db9b159d7130f6fb7bf6588f9c2619fecafe: Filename too long
Stack Trace:
org.apache.maven.wagon.TransferFailedException:
Error checking out: command failed: Cloning into 'checkout-org.apache.maven.wagon.providers.scm.UserSafeGitExeScmProvider'...
From file:///F:/jenkins/jenkins-slave/712657a4/workspace/ven_maven-box_maven-wagon_master/m/wagon-providers/wagon-scm/target/test-classes/test-repo-git-test
* branch master -> FETCH_HEAD
fatal: failed to read object 3a67db9b159d7130f6fb7bf6588f9c2619fecafe: Filename too long
Caused by: org.apache.maven.scm.ScmException:
command failed: Cloning into 'checkout-org.apache.maven.wagon.providers.scm.UserSafeGitExeScmProvider'...
From file:///F:/jenkins/jenkins-slave/712657a4/workspace/ven_maven-box_maven-wagon_master/m/wagon-providers/wagon-scm/target/test-classes/test-repo-git-test
* branch master -> FETCH_HEAD
fatal: failed to read object 3a67db9b159d7130f6fb7bf6588f9c2619fecafe: Filename too long
FAILED: org.apache.maven.wagon.providers.scm.ScmGitExeWagonTest.windows-jdk11 / Build windows-jdk11 / testFailedGet
Error Message:
Error getting file from SCM
Stack Trace:
org.apache.maven.wagon.TransferFailedException: Error getting file from SCM
Caused by: org.apache.maven.scm.ScmException:
command failed: Cloning into 'checkout-org.apache.maven.wagon.providers.scm.UserSafeGitExeScmProvider'...
From file:///F:/jenkins/jenkins-slave/712657a4/workspace/ven_maven-box_maven-wagon_master/m/wagon-providers/wagon-scm/target/test-classes/test-repo-git-test
* branch master -> FETCH_HEAD
fatal: failed to read object 3a67db9b159d7130f6fb7bf6588f9c2619fecafe: Filename too long
FAILED: org.apache.maven.wagon.providers.scm.ScmGitExeWagonTest.windows-jdk11 / Build windows-jdk11 / testWagonPutDirectoryWhenDirectoryAlreadyExists
Error Message:
Error checking out: command failed: Cloning into 'checkout-org.apache.maven.wagon.providers.scm.UserSafeGitExeScmProvider'...
From file:///F:/jenkins/jenkins-slave/712657a4/workspace/ven_maven-box_maven-wagon_master/m/wagon-providers/wagon-scm/target/test-classes/test-repo-git-test
* branch master -> FETCH_HEAD
fatal: failed to read object 3a67db9b159d7130f6fb7bf6588f9c2619fecafe: Filename too long
Stack Trace:
org.apache.maven.wagon.TransferFailedException:
Error checking out: command failed: Cloning into 'checkout-org.apache.maven.wagon.providers.scm.UserSafeGitExeScmProvider'...
From file:///F:/jenkins/jenkins-slave/712657a4/workspace/ven_maven-box_maven-wagon_master/m/wagon-providers/wagon-scm/target/test-classes/test-repo-git-test
* branch master -> FETCH_HEAD
fatal: failed to read object 3a67db9b159d7130f6fb7bf6588f9c2619fecafe: Filename too long
Caused by: org.apache.maven.scm.ScmException:
command failed: Cloning into 'checkout-org.apache.maven.wagon.providers.scm.UserSafeGitExeScmProvider'...
From file:///F:/jenkins/jenkins-slave/712657a4/workspace/ven_maven-box_maven-wagon_master/m/wagon-providers/wagon-scm/target/test-classes/test-repo-git-test
* branch master -> FETCH_HEAD
fatal: failed to read object 3a67db9b159d7130f6fb7bf6588f9c2619fecafe: Filename too long
Build log:
[...truncated 19389 lines...]
[INFO] 62 implicit excludes (use -debug for more details).
[INFO] 13 explicit excludes (use -debug for more details).
[INFO] 12 resources included (use -debug for more details)
[INFO] Rat check: Summary over all files. Unapproved: 0, unknown: 0, generated: 0, approved: 12 licenses.
[INFO]
[INFO] --- maven-remote-resources-plugin:1.7.0:process (process-resource-bundles) @ wagon-webdav-jackrabbit ---
[INFO] Preparing remote bundle org.apache:apache-jar-resource-bundle:1.4
[INFO] Copying 3 resources from 1 bundle.
[INFO]
[INFO] --- maven-resources-plugin:3.1.0:resources (default-resources) @ wagon-webdav-jackrabbit ---
[INFO] Using 'UTF-8' encoding to copy filtered resources.
[INFO] Copying 1 resource
[INFO] Copying 3 resources
[INFO]
[INFO] --- maven-compiler-plugin:3.8.1:compile (default-compile) @ wagon-webdav-jackrabbit ---
[INFO] Changes detected - recompiling the module!
[INFO] Compiling 4 source files to F:\jenkins\jenkins-slave\712657a4\workspace\ven_maven-box_maven-wagon_master@2\m\wagon-providers\wagon-webdav-jackrabbit\target\classes
[INFO] Rat check: Summary over all files. Unapproved: 0, unknown: 0, generated: 0, approved: 12 licenses.
[INFO]
[INFO] --- maven-remote-resources-plugin:1.7.0:process (process-resource-bundles) @ wagon-webdav-jackrabbit ---
[INFO] Preparing remote bundle org.apache:apache-jar-resource-bundle:1.4
[INFO] Copying 3 resources from 1 bundle.
[INFO]
[INFO] --- maven-resources-plugin:3.1.0:resources (default-resources) @ wagon-webdav-jackrabbit ---
[INFO] Using 'UTF-8' encoding to copy filtered resources.
[INFO] Copying 1 resource
[INFO] Copying 3 resources
[INFO]
[INFO] --- maven-compiler-plugin:3.8.1:compile (default-compile) @ wagon-webdav-jackrabbit ---
[INFO] Changes detected - recompiling the module!
[INFO] Compiling 4 source files to F:\jenkins\jenkins-slave\712657a4\workspace\ven_maven-box_maven-wagon_master\m\wagon-providers\wagon-webdav-jackrabbit\target\classes
[INFO] /F:/jenkins/jenkins-slave/712657a4/workspace/ven_maven-box_maven-wagon_master/m/wagon-providers/wagon-webdav-jackrabbit/src/main/java/org/apache/maven/wagon/providers/webdav/WebDavWagon.java: F:\jenkins\jenkins-slave\712657a4\workspace\ven_maven-box_maven-wagon_master\m\wagon-providers\wagon-webdav-jackrabbit\src\main\java\org\apache\maven\wagon\providers\webdav\WebDavWagon.java uses or overrides a deprecated API.
[INFO] /F:/jenkins/jenkins-slave/712657a4/workspace/ven_maven-box_maven-wagon_master/m/wagon-providers/wagon-webdav-jackrabbit/src/main/java/org/apache/maven/wagon/providers/webdav/WebDavWagon.java: Recompile with -Xlint:deprecation for details.
[INFO]
[INFO] --- plexus-component-metadata:2.0.0:generate-metadata (generate) @ wagon-webdav-jackrabbit ---
[INFO] Discovered 1 component descriptors(s)
[INFO] /F:/jenkins/jenkins-slave/712657a4/workspace/ven_maven-box_maven-wagon_master@2/m/wagon-providers/wagon-webdav-jackrabbit/src/main/java/org/apache/maven/wagon/providers/webdav/WebDavWagon.java: F:\jenkins\jenkins-slave\712657a4\workspace\ven_maven-box_maven-wagon_master@2\m\wagon-providers\wagon-webdav-jackrabbit\src\main\java\org\apache\maven\wagon\providers\webdav\WebDavWagon.java uses or overrides a deprecated API.
[INFO] /F:/jenkins/jenkins-slave/712657a4/workspace/ven_maven-box_maven-wagon_master@2/m/wagon-providers/wagon-webdav-jackrabbit/src/main/java/org/apache/maven/wagon/providers/webdav/WebDavWagon.java: Recompile with -Xlint:deprecation for details.
[INFO]
[INFO] --- plexus-component-metadata:2.0.0:generate-metadata (generate) @ wagon-webdav-jackrabbit ---
[INFO] Discovered 1 component descriptors(s)
[INFO]
[INFO] --- animal-sniffer-maven-plugin:1.15:check (check-java-1.7-compat) @ wagon-webdav-jackrabbit ---
[INFO] Checking unresolved references to org.codehaus.mojo.signature:java17:1.0
[INFO]
[INFO] --- animal-sniffer-maven-plugin:1.15:check (check-java-1.7-compat) @ wagon-webdav-jackrabbit ---
[INFO] Checking unresolved references to org.codehaus.mojo.signature:java17:1.0
[INFO]
[INFO] --- maven-resources-plugin:3.1.0:testResources (default-testResources) @ wagon-webdav-jackrabbit ---
[INFO] Using 'UTF-8' encoding to copy filtered resources.
[INFO] Copying 2 resources
[INFO] Copying 3 resources
[INFO]
[INFO] --- maven-compiler-plugin:3.8.1:testCompile (default-testCompile) @ wagon-webdav-jackrabbit ---
[INFO] Changes detected - recompiling the module!
[INFO] Compiling 4 source files to F:\jenkins\jenkins-slave\712657a4\workspace\ven_maven-box_maven-wagon_master\m\wagon-providers\wagon-webdav-jackrabbit\target\test-classes
[INFO]
[INFO] --- maven-resources-plugin:3.1.0:testResources (default-testResources) @ wagon-webdav-jackrabbit ---
[INFO] Using 'UTF-8' encoding to copy filtered resources.
[INFO] Copying 2 resources
[INFO] Copying 3 resources
[INFO]
[INFO] --- maven-compiler-plugin:3.8.1:testCompile (default-testCompile) @ wagon-webdav-jackrabbit ---
[INFO] Changes detected - recompiling the module!
[INFO] Compiling 4 source files to F:\jenkins\jenkins-slave\712657a4\workspace\ven_maven-box_maven-wagon_master@2\m\wagon-providers\wagon-webdav-jackrabbit\target\test-classes
[INFO] /F:/jenkins/jenkins-slave/712657a4/workspace/ven_maven-box_maven-wagon_master/m/wagon-providers/wagon-webdav-jackrabbit/src/test/java/org/apache/maven/wagon/providers/webdav/HttpClientWagonTest.java: F:\jenkins\jenkins-slave\712657a4\workspace\ven_maven-box_maven-wagon_master\m\wagon-providers\wagon-webdav-jackrabbit\src\test\java\org\apache\maven\wagon\providers\webdav\HttpClientWagonTest.java uses or overrides a deprecated API.
[INFO] /F:/jenkins/jenkins-slave/712657a4/workspace/ven_maven-box_maven-wagon_master/m/wagon-providers/wagon-webdav-jackrabbit/src/test/java/org/apache/maven/wagon/providers/webdav/HttpClientWagonTest.java: Recompile with -Xlint:deprecation for details.
[INFO]
[INFO] --- maven-surefire-plugin:2.22.2:test (default-test) @ wagon-webdav-jackrabbit ---
[INFO]
[INFO] -------------------------------------------------------
[INFO] T E S T S
[INFO] -------------------------------------------------------
[INFO] /F:/jenkins/jenkins-slave/712657a4/workspace/ven_maven-box_maven-wagon_master@2/m/wagon-providers/wagon-webdav-jackrabbit/src/test/java/org/apache/maven/wagon/providers/webdav/HttpClientWagonTest.java: F:\jenkins\jenkins-slave\712657a4\workspace\ven_maven-box_maven-wagon_master@2\m\wagon-providers\wagon-webdav-jackrabbit\src\test\java\org\apache\maven\wagon\providers\webdav\HttpClientWagonTest.java uses or overrides a deprecated API.
[INFO] /F:/jenkins/jenkins-slave/712657a4/workspace/ven_maven-box_maven-wagon_master@2/m/wagon-providers/wagon-webdav-jackrabbit/src/test/java/org/apache/maven/wagon/providers/webdav/HttpClientWagonTest.java: Recompile with -Xlint:deprecation for details.
[INFO]
[INFO] --- maven-surefire-plugin:2.22.2:test (default-test) @ wagon-webdav-jackrabbit ---
[INFO]
[INFO] -------------------------------------------------------
[INFO] T E S T S
[INFO] -------------------------------------------------------
[INFO] Running org.apache.maven.wagon.providers.webdav.HttpClientWagonTest
[INFO] Running org.apache.maven.wagon.providers.webdav.HttpClientWagonTest
[INFO] Tests run: 6, Failures: 0, Errors: 0, Skipped: 0, Time elapsed: 0.507 s - in org.apache.maven.wagon.providers.webdav.HttpClientWagonTest
[INFO] Running org.apache.maven.wagon.providers.webdav.PathNavigatorTest
[INFO] Tests run: 1, Failures: 0, Errors: 0, Skipped: 0, Time elapsed: 0.013 s - in org.apache.maven.wagon.providers.webdav.PathNavigatorTest
[INFO] Running org.apache.maven.wagon.providers.webdav.WebDavsWagonTest
[INFO] Tests run: 6, Failures: 0, Errors: 0, Skipped: 0, Time elapsed: 0.625 s - in org.apache.maven.wagon.providers.webdav.HttpClientWagonTest
[INFO] Running org.apache.maven.wagon.providers.webdav.PathNavigatorTest
[INFO] Tests run: 1, Failures: 0, Errors: 0, Skipped: 0, Time elapsed: 0.001 s - in org.apache.maven.wagon.providers.webdav.PathNavigatorTest
[INFO] Running org.apache.maven.wagon.providers.webdav.WebDavsWagonTest
[INFO] Tests run: 70, Failures: 0, Errors: 0, Skipped: 0, Time elapsed: 32.931 s - in org.apache.maven.wagon.providers.webdav.WebDavsWagonTest
[INFO] Running org.apache.maven.wagon.providers.webdav.WebDavWagonTest
[INFO] Tests run: 70, Failures: 0, Errors: 0, Skipped: 0, Time elapsed: 31.061 s - in org.apache.maven.wagon.providers.webdav.WebDavsWagonTest
[INFO] Running org.apache.maven.wagon.providers.webdav.WebDavWagonTest
[INFO] Tests run: 70, Failures: 0, Errors: 0, Skipped: 0, Time elapsed: 26.411 s - in org.apache.maven.wagon.providers.webdav.WebDavWagonTest
[INFO]
[INFO] Results:
[INFO]
[INFO] Tests run: 147, Failures: 0, Errors: 0, Skipped: 0
[INFO]
[INFO]
[INFO] --- maven-jar-plugin:3.2.0:jar (default-jar) @ wagon-webdav-jackrabbit ---
[INFO] Building jar: F:\jenkins\jenkins-slave\712657a4\workspace\ven_maven-box_maven-wagon_master\m\wagon-providers\wagon-webdav-jackrabbit\target\wagon-webdav-jackrabbit-3.4.2-SNAPSHOT.jar
[INFO]
[INFO] --- maven-site-plugin:3.7.1:attach-descriptor (attach-descriptor) @ wagon-webdav-jackrabbit ---
[INFO] Skipping because packaging 'jar' is not pom.
[INFO]
[INFO] --- maven-checkstyle-plugin:3.0.0:check (checkstyle-check) @ wagon-webdav-jackrabbit ---
[INFO] ------------------------------------------------------------------------
[INFO] Reactor Summary for Apache Maven Wagon 3.4.2-SNAPSHOT:
[INFO]
[INFO] Apache Maven Wagon ................................. SUCCESS [ 44.480 s]
[INFO] Apache Maven Wagon :: API .......................... SUCCESS [ 13.004 s]
[INFO] Apache Maven Wagon :: Provider Test ................ SUCCESS [ 4.396 s]
[INFO] Apache Maven Wagon :: Providers .................... SUCCESS [ 0.703 s]
[INFO] Apache Maven Wagon :: Providers :: File Provider ... SUCCESS [ 4.763 s]
[INFO] Apache Maven Wagon :: Providers :: FTP Provider .... SUCCESS [ 5.188 s]
[INFO] Apache Maven Wagon :: Providers :: HTTP Shared Library SUCCESS [ 4.029 s]
[INFO] Apache Maven Wagon :: Test Compatibility Kits ...... SUCCESS [ 0.567 s]
[INFO] Apache Maven Wagon :: HTTP Test Compatibility Kit .. SUCCESS [ 2.012 s]
[INFO] Apache Maven Wagon :: Providers :: HTTP Provider ... SUCCESS [05:33 min]
[INFO] Apache Maven Wagon :: Providers :: Lightweight HTTP Provider SUCCESS [02:13 min]
[INFO] Apache Maven Wagon :: Providers :: SCM Provider .... SUCCESS [ 44.189 s]
[INFO] Apache Maven Wagon :: Providers :: SSH Common Library SUCCESS [ 3.304 s]
[INFO] Apache Maven Wagon :: Providers :: SSH Common Tests SUCCESS [ 2.709 s]
[INFO] Apache Maven Wagon :: Providers :: SSH External Provider SUCCESS [ 1.669 s]
[INFO] Apache Maven Wagon :: Providers :: SSH Provider .... SUCCESS [ 4.014 s]
[INFO] Apache Maven Wagon :: Providers :: WebDAV Provider . SUCCESS [01:03 min]
[INFO] ------------------------------------------------------------------------
[INFO] BUILD SUCCESS
[INFO] ------------------------------------------------------------------------
[INFO] Total time: 11:07 min
[INFO] Finished at: 2020-09-26T03:05:08-07:00
[INFO] ------------------------------------------------------------------------
[WARNING] The requested profile "run-its" could not be activated because it does not exist.
[INFO] [jenkins-event-spy] Generated F:\jenkins\jenkins-slave\712657a4\workspace\ven_maven-box_maven-wagon_master@tmp\withMavenecdf2204\maven-spy-20200926-025400-5514121806373910427286.log
[Pipeline] }
[INFO] Tests run: 70, Failures: 0, Errors: 0, Skipped: 0, Time elapsed: 26.408 s - in org.apache.maven.wagon.providers.webdav.WebDavWagonTest
[INFO]
[INFO] Results:
[INFO]
[INFO] Tests run: 147, Failures: 0, Errors: 0, Skipped: 0
[INFO]
[INFO]
[INFO] --- maven-jar-plugin:3.2.0:jar (default-jar) @ wagon-webdav-jackrabbit ---
[INFO] Building jar: F:\jenkins\jenkins-slave\712657a4\workspace\ven_maven-box_maven-wagon_master@2\m\wagon-providers\wagon-webdav-jackrabbit\target\wagon-webdav-jackrabbit-3.4.2-SNAPSHOT.jar
[INFO]
[INFO] --- maven-site-plugin:3.7.1:attach-descriptor (attach-descriptor) @ wagon-webdav-jackrabbit ---
[INFO] Skipping because packaging 'jar' is not pom.
[INFO]
[INFO] --- maven-checkstyle-plugin:3.0.0:check (checkstyle-check) @ wagon-webdav-jackrabbit ---
[INFO] ------------------------------------------------------------------------
[INFO] Reactor Summary for Apache Maven Wagon 3.4.2-SNAPSHOT:
[INFO]
[INFO] Apache Maven Wagon ................................. SUCCESS [ 44.427 s]
[INFO] Apache Maven Wagon :: API .......................... SUCCESS [ 12.440 s]
[INFO] Apache Maven Wagon :: Provider Test ................ SUCCESS [ 4.756 s]
[INFO] Apache Maven Wagon :: Providers .................... SUCCESS [ 0.948 s]
[INFO] Apache Maven Wagon :: Providers :: File Provider ... SUCCESS [ 4.789 s]
[INFO] Apache Maven Wagon :: Providers :: FTP Provider .... SUCCESS [ 5.099 s]
[INFO] Apache Maven Wagon :: Providers :: HTTP Shared Library SUCCESS [ 4.034 s]
[INFO] Apache Maven Wagon :: Test Compatibility Kits ...... SUCCESS [ 0.647 s]
[INFO] Apache Maven Wagon :: HTTP Test Compatibility Kit .. SUCCESS [ 2.065 s]
[INFO] Apache Maven Wagon :: Providers :: HTTP Provider ... SUCCESS [05:33 min]
[INFO] Apache Maven Wagon :: Providers :: Lightweight HTTP Provider SUCCESS [02:11 min]
[INFO] Apache Maven Wagon :: Providers :: SCM Provider .... SUCCESS [ 46.455 s]
[INFO] Apache Maven Wagon :: Providers :: SSH Common Library SUCCESS [ 3.213 s]
[INFO] Apache Maven Wagon :: Providers :: SSH Common Tests SUCCESS [ 2.909 s]
[INFO] Apache Maven Wagon :: Providers :: SSH External Provider SUCCESS [ 1.583 s]
[INFO] Apache Maven Wagon :: Providers :: SSH Provider .... SUCCESS [ 4.351 s]
[INFO] Apache Maven Wagon :: Providers :: WebDAV Provider . SUCCESS [01:01 min]
[INFO] ------------------------------------------------------------------------
[INFO] BUILD SUCCESS
[INFO] ------------------------------------------------------------------------
[INFO] Total time: 11:06 min
[INFO] Finished at: 2020-09-26T03:05:06-07:00
[INFO] ------------------------------------------------------------------------
[WARNING] The requested profile "run-its" could not be activated because it does not exist.
[INFO] [jenkins-event-spy] Generated F:\jenkins\jenkins-slave\712657a4\workspace\ven_maven-box_maven-wagon_master@2@tmp\withMavend0dd499c\maven-spy-20200926-025359-9308830066138948539190.log
Picked up JAVA_TOOL_OPTIONS: -Dmaven.ext.class.path="f:\jenkins\jenkins-slave\712657a4\workspace\ven_maven-box_maven-wagon_master@2@tmp\withMavend0dd499c\pipeline-maven-spy.jar" -Dorg.jenkinsci.plugins.pipeline.maven.reportsFolder="f:\jenkins\jenkins-slave\712657a4\workspace\ven_maven-box_maven-wagon_master@2@tmp\withMavend0dd499c"
[Pipeline] // dir
[Pipeline] }
[Pipeline] }
[Pipeline] // dir
[Pipeline] }
[withMaven] junitPublisher - Archive test results for Maven artifact org.apache.maven.wagon:wagon-provider-api:jar:3.4.2-SNAPSHOT generated by maven-surefire-plugin:test (default-test): m\wagon-provider-api\target\surefire-reports\*.xml
[withMaven] junitPublisher - Archive test results for Maven artifact org.apache.maven.wagon:wagon-provider-test:jar:3.4.2-SNAPSHOT generated by maven-surefire-plugin:test (default-test): m\wagon-provider-test\target\surefire-reports\*.xml
[withMaven] junitPublisher - Archive test results for Maven artifact org.apache.maven.wagon:wagon-file:jar:3.4.2-SNAPSHOT generated by maven-surefire-plugin:test (default-test): m\wagon-providers\wagon-file\target\surefire-reports\*.xml
[withMaven] junitPublisher - Archive test results for Maven artifact org.apache.maven.wagon:wagon-ftp:jar:3.4.2-SNAPSHOT generated by maven-surefire-plugin:test (default-test): m\wagon-providers\wagon-ftp\target\surefire-reports\*.xml
[withMaven] junitPublisher - Archive test results for Maven artifact org.apache.maven.wagon:wagon-http-shared:jar:3.4.2-SNAPSHOT generated by maven-surefire-plugin:test (default-test): m\wagon-providers\wagon-http-shared\target\surefire-reports\*.xml
[withMaven] junitPublisher - Archive test results for Maven artifact org.apache.maven.wagon:wagon-tck-http:jar:3.4.2-SNAPSHOT generated by maven-surefire-plugin:test (default-test): m\wagon-tcks\wagon-tck-http\target\surefire-reports\*.xml
[withMaven] junitPublisher - Archive test results for Maven artifact org.apache.maven.wagon:wagon-http:jar:3.4.2-SNAPSHOT generated by maven-surefire-plugin:test (default-test): m\wagon-providers\wagon-http\target\surefire-reports\*.xml
[withMaven] junitPublisher - Archive test results for Maven artifact org.apache.maven.wagon:wagon-http-lightweight:jar:3.4.2-SNAPSHOT generated by maven-surefire-plugin:test (default-test): m\wagon-providers\wagon-http-lightweight\target\surefire-reports\*.xml
[withMaven] junitPublisher - Archive test results for Maven artifact org.apache.maven.wagon:wagon-scm:jar:3.4.2-SNAPSHOT generated by maven-surefire-plugin:test (default-test): m\wagon-providers\wagon-scm\target\surefire-reports\*.xml
[withMaven] junitPublisher - Archive test results for Maven artifact org.apache.maven.wagon:wagon-ssh-common:jar:3.4.2-SNAPSHOT generated by maven-surefire-plugin:test (default-test): m\wagon-providers\wagon-ssh-common\target\surefire-reports\*.xml
[withMaven] junitPublisher - Archive test results for Maven artifact org.apache.maven.wagon:wagon-ssh-common-test:jar:3.4.2-SNAPSHOT generated by maven-surefire-plugin:test (default-test): m\wagon-providers\wagon-ssh-common-test\target\surefire-reports\*.xml
[withMaven] junitPublisher - Archive test results for Maven artifact org.apache.maven.wagon:wagon-ssh-external:jar:3.4.2-SNAPSHOT generated by maven-surefire-plugin:test (default-test): m\wagon-providers\wagon-ssh-external\target\surefire-reports\*.xml
[withMaven] junitPublisher - Archive test results for Maven artifact org.apache.maven.wagon:wagon-ssh:jar:3.4.2-SNAPSHOT generated by maven-surefire-plugin:test (default-test): m\wagon-providers\wagon-ssh\target\surefire-reports\*.xml
[withMaven] junitPublisher - Archive test results for Maven artifact org.apache.maven.wagon:wagon-webdav-jackrabbit:jar:3.4.2-SNAPSHOT generated by maven-surefire-plugin:test (default-test): m\wagon-providers\wagon-webdav-jackrabbit\target\surefire-reports\*.xml
Recording test results
[withMaven] junitPublisher - Archive test results for Maven artifact org.apache.maven.wagon:wagon-provider-api:jar:3.4.2-SNAPSHOT generated by maven-surefire-plugin:test (default-test): m\wagon-provider-api\target\surefire-reports\*.xml
[withMaven] junitPublisher - Archive test results for Maven artifact org.apache.maven.wagon:wagon-provider-test:jar:3.4.2-SNAPSHOT generated by maven-surefire-plugin:test (default-test): m\wagon-provider-test\target\surefire-reports\*.xml
[withMaven] junitPublisher - Archive test results for Maven artifact org.apache.maven.wagon:wagon-file:jar:3.4.2-SNAPSHOT generated by maven-surefire-plugin:test (default-test): m\wagon-providers\wagon-file\target\surefire-reports\*.xml
[withMaven] junitPublisher - Archive test results for Maven artifact org.apache.maven.wagon:wagon-ftp:jar:3.4.2-SNAPSHOT generated by maven-surefire-plugin:test (default-test): m\wagon-providers\wagon-ftp\target\surefire-reports\*.xml
[withMaven] junitPublisher - Archive test results for Maven artifact org.apache.maven.wagon:wagon-http-shared:jar:3.4.2-SNAPSHOT generated by maven-surefire-plugin:test (default-test): m\wagon-providers\wagon-http-shared\target\surefire-reports\*.xml
[withMaven] junitPublisher - Archive test results for Maven artifact org.apache.maven.wagon:wagon-tck-http:jar:3.4.2-SNAPSHOT generated by maven-surefire-plugin:test (default-test): m\wagon-tcks\wagon-tck-http\target\surefire-reports\*.xml
[withMaven] junitPublisher - Archive test results for Maven artifact org.apache.maven.wagon:wagon-http:jar:3.4.2-SNAPSHOT generated by maven-surefire-plugin:test (default-test): m\wagon-providers\wagon-http\target\surefire-reports\*.xml
[withMaven] junitPublisher - Archive test results for Maven artifact org.apache.maven.wagon:wagon-http-lightweight:jar:3.4.2-SNAPSHOT generated by maven-surefire-plugin:test (default-test): m\wagon-providers\wagon-http-lightweight\target\surefire-reports\*.xml
[withMaven] junitPublisher - Archive test results for Maven artifact org.apache.maven.wagon:wagon-scm:jar:3.4.2-SNAPSHOT generated by maven-surefire-plugin:test (default-test): m\wagon-providers\wagon-scm\target\surefire-reports\*.xml
[withMaven] junitPublisher - Archive test results for Maven artifact org.apache.maven.wagon:wagon-ssh-common:jar:3.4.2-SNAPSHOT generated by maven-surefire-plugin:test (default-test): m\wagon-providers\wagon-ssh-common\target\surefire-reports\*.xml
[withMaven] junitPublisher - Archive test results for Maven artifact org.apache.maven.wagon:wagon-ssh-common-test:jar:3.4.2-SNAPSHOT generated by maven-surefire-plugin:test (default-test): m\wagon-providers\wagon-ssh-common-test\target\surefire-reports\*.xml
[withMaven] junitPublisher - Archive test results for Maven artifact org.apache.maven.wagon:wagon-ssh-external:jar:3.4.2-SNAPSHOT generated by maven-surefire-plugin:test (default-test): m\wagon-providers\wagon-ssh-external\target\surefire-reports\*.xml
[withMaven] junitPublisher - Archive test results for Maven artifact org.apache.maven.wagon:wagon-ssh:jar:3.4.2-SNAPSHOT generated by maven-surefire-plugin:test (default-test): m\wagon-providers\wagon-ssh\target\surefire-reports\*.xml
[withMaven] junitPublisher - Archive test results for Maven artifact org.apache.maven.wagon:wagon-webdav-jackrabbit:jar:3.4.2-SNAPSHOT generated by maven-surefire-plugin:test (default-test): m\wagon-providers\wagon-webdav-jackrabbit\target\surefire-reports\*.xml
Recording test results
[withMaven] Publishers: Junit Publisher: 7765 ms
[Pipeline] // withMaven
[withMaven] Publishers: Junit Publisher: 12978 ms
[Pipeline] cleanWs
[Pipeline] // withMaven
[WS-CLEANUP] Deleting project workspace...
[WS-CLEANUP] Deferred wipeout is used...
[WS-CLEANUP] done
[Pipeline] cleanWs
[WS-CLEANUP] Deleting project workspace...
[WS-CLEANUP] Deferred wipeout is used...
[WS-CLEANUP] done
[Pipeline] }
[Pipeline] // stage
[Pipeline] }
[Pipeline] }
[Pipeline] // node
[Pipeline] // stage
[Pipeline] }
[Pipeline] }
[Pipeline] // node
[Pipeline] }
[Pipeline] // parallel
[Pipeline] stage
[Pipeline] { (Notifications)
[Pipeline] echo
Build result: UNSTABLE
[Pipeline] jiraIssueSelector
[Pipeline] echo
The authors of changes [rfscholte].
[Pipeline] echo
Sending email ...
[Pipeline] emailext
Build failed in Jenkins: Maven » Maven TLP » maven-wagon » master #19
Posted by Apache Jenkins Server <je...@builds.apache.org>.
See https://ci-builds.apache.org/job/Maven/job/maven-box/job/maven-wagon/job/master/19/
Changes:
* don't pick up tmpWs from a context
No tests ran.
Build log:
Started by user Robert Scholte
Obtained Jenkinsfile from 1a90ecc5819ee3e146ba0769e6488579d865de16
Running in Durability level: PERFORMANCE_OPTIMIZED
Loading library jenkins-env@master
Attempting to resolve master from remote references...
> git --version # timeout=10
> git ls-remote -h -- https://gitbox.apache.org/repos/asf/maven-jenkins-env.git # timeout=10
Found match: refs/heads/master revision 6e8965c3e604ff37e18bdaccfe14f976d3526c12
No credentials specified
> git rev-parse --is-inside-work-tree # timeout=10
Fetching changes from the remote Git repository
> git config remote.origin.url https://gitbox.apache.org/repos/asf/maven-jenkins-env.git # timeout=10
Fetching without tags
Fetching upstream changes from https://gitbox.apache.org/repos/asf/maven-jenkins-env.git
> git --version # timeout=10
> git fetch --no-tags --force --progress -- https://gitbox.apache.org/repos/asf/maven-jenkins-env.git +refs/heads/*:refs/remotes/origin/* # timeout=10
Checking out Revision 6e8965c3e604ff37e18bdaccfe14f976d3526c12 (master)
> git config core.sparsecheckout # timeout=10
> git checkout -f 6e8965c3e604ff37e18bdaccfe14f976d3526c12 # timeout=10
Commit message: "There's no M3.6.3 for Windows"
> git rev-list --no-walk 6e8965c3e604ff37e18bdaccfe14f976d3526c12 # timeout=10
Loading library jenkins-lib@master
Attempting to resolve master from remote references...
> git --version # timeout=10
> git ls-remote -h -- https://gitbox.apache.org/repos/asf/maven-jenkins-lib.git # timeout=10
Found match: refs/heads/master revision 87c2c5f5735f13b7eec62f8cd0cf4fbbbb63dd88
No credentials specified
> git rev-parse --is-inside-work-tree # timeout=10
Fetching changes from the remote Git repository
> git config remote.origin.url https://gitbox.apache.org/repos/asf/maven-jenkins-lib.git # timeout=10
Fetching without tags
Fetching upstream changes from https://gitbox.apache.org/repos/asf/maven-jenkins-lib.git
> git --version # timeout=10
> git fetch --no-tags --force --progress -- https://gitbox.apache.org/repos/asf/maven-jenkins-lib.git +refs/heads/*:refs/remotes/origin/* # timeout=10
Checking out Revision 87c2c5f5735f13b7eec62f8cd0cf4fbbbb63dd88 (master)
> git config core.sparsecheckout # timeout=10
> git checkout -f 87c2c5f5735f13b7eec62f8cd0cf4fbbbb63dd88 # timeout=10
Commit message: "don't pick up tmpWs from a context"
> git rev-list --no-walk 97e79eb867e8a731880e5c6c2e01f77505cffc3c # timeout=10
[Pipeline] Start of Pipeline
[Pipeline] properties
[Pipeline] echo
OS: linux JDK: 7 Maven: 3.x.x => Label: ubuntu JDK: JDK 1.7 (latest) Maven: Maven 3.6.3
[Pipeline] echo
OS: linux JDK: 8 Maven: 3.x.x => Label: ubuntu JDK: JDK 1.8 (latest) Maven: Maven 3.6.3
[Pipeline] echo
OS: linux JDK: 11 Maven: 3.x.x => Label: ubuntu JDK: JDK 11 (latest) Maven: Maven 3.6.3
[Pipeline] echo
OS: windows JDK: 7 Maven: 3.x.x => Label: Windows JDK: JDK 1.7 (latest) Maven: Maven 3.6.2 (Windows)
[Pipeline] echo
OS: windows JDK: 8 Maven: 3.x.x => Label: Windows JDK: JDK 1.8 (latest) Maven: Maven 3.6.2 (Windows)
[Pipeline] echo
OS: windows JDK: 11 Maven: 3.x.x => Label: Windows JDK: JDK 11 (latest) Maven: Maven 3.6.2 (Windows)
[Pipeline] parallel
[Pipeline] { (Branch: linux-jdk7)
[Pipeline] { (Branch: linux-jdk8)
[Pipeline] { (Branch: linux-jdk11)
[Pipeline] { (Branch: windows-jdk7)
[Pipeline] { (Branch: windows-jdk8)
[Pipeline] { (Branch: windows-jdk11)
[Pipeline] node
[Pipeline] node
[Pipeline] node
Running on H34 in /home/jenkins/workspace/ven_maven-box_maven-wagon_master
Running on H28 in /home/jenkins/jenkins-agent/workspace/ven_maven-box_maven-wagon_master
[Pipeline] node
Running on H43 in /home/jenkins/workspace/ven_maven-box_maven-wagon_master
[Pipeline] node
[Pipeline] node
Running on jenkins-win-he-de-1 in f:\jenkins\jenkins-slave\712657a4\workspace\ven_maven-box_maven-wagon_master
[Pipeline] {
[Pipeline] {
[Pipeline] {
[Pipeline] {
[Pipeline] pwd
[Pipeline] ws
Running in F:\short\jenkins-Maven-maven-box-maven-wagon-master-19
[Pipeline] }
[Pipeline] pwd
[Pipeline] ws
Running in F:\short\jenkins-Maven-maven-box-maven-wagon-master-19
[Pipeline] }
[Pipeline] pwd
[Pipeline] ws
Running in F:\short\jenkins-Maven-maven-box-maven-wagon-master-19
[Pipeline] }
[Pipeline] pwd
[Pipeline] ws
Running in F:\short\jenkins-Maven-maven-box-maven-wagon-master-19
[Pipeline] }
[Pipeline] // node
Running on jenkins-win-he-de-1 in f:\jenkins\jenkins-slave\712657a4\workspace\ven_maven-box_maven-wagon_master
[Pipeline] // node
[Pipeline] // node
[Pipeline] // node
[Pipeline] }
Failed in branch linux-jdk7
[Pipeline] }
Failed in branch linux-jdk8
[Pipeline] }
Failed in branch linux-jdk11
[Pipeline] }
Failed in branch windows-jdk7
[Pipeline] {
[Pipeline] pwd
[Pipeline] ws
Running in F:\short\jenkins-Maven-maven-box-maven-wagon-master-19@2
[Pipeline] }
Running on jenkins-win-he-de-1 in f:\jenkins\jenkins-slave\712657a4\workspace\ven_maven-box_maven-wagon_master
[Pipeline] // node
[Pipeline] {
[Pipeline] }
Failed in branch windows-jdk8
[Pipeline] pwd
[Pipeline] ws
Running in F:\short\jenkins-Maven-maven-box-maven-wagon-master-19@3
[Pipeline] }
[Pipeline] // node
[Pipeline] }
Failed in branch windows-jdk11
[Pipeline] // parallel
[Pipeline] echo
[FAILURE-001] java.lang.IllegalStateException: There is no body to invoke
[Pipeline] stage
[Pipeline] { (Notifications)
[Pipeline] echo
Build result: FAILURE
[Pipeline] jiraIssueSelector
[Pipeline] echo
The authors of changes [rfscholte].
[Pipeline] echo
Sending email ...
[Pipeline] emailext