You are viewing a plain text version of this content. The canonical link for it is here.
Posted to builds@beam.apache.org by Apache Jenkins Server <je...@builds.apache.org> on 2021/11/26 00:11:05 UTC

Build failed in Jenkins: beam_PreCommit_CommunityMetrics_Cron #4440

See <https://ci-beam.apache.org/job/beam_PreCommit_CommunityMetrics_Cron/4440/display/redirect>

Changes:


------------------------------------------
Started by timer
Running as SYSTEM
[EnvInject] - Loading node environment variables.
Building remotely on apache-beam-jenkins-15 (beam) in workspace <https://ci-beam.apache.org/job/beam_PreCommit_CommunityMetrics_Cron/ws/>
The recommended git tool is: NONE
No credentials specified
Wiping out workspace first.
Cloning the remote Git repository
Cloning repository https://github.com/apache/beam.git
 > git init <https://ci-beam.apache.org/job/beam_PreCommit_CommunityMetrics_Cron/ws/src> # timeout=10
Fetching upstream changes from https://github.com/apache/beam.git
 > git --version # timeout=10
 > git --version # 'git version 2.7.4'
 > git fetch --tags --progress https://github.com/apache/beam.git +refs/heads/*:refs/remotes/origin/* # timeout=10
 > git config remote.origin.url https://github.com/apache/beam.git # timeout=10
 > git config --add remote.origin.fetch +refs/heads/*:refs/remotes/origin/* # timeout=10
 > git config remote.origin.url https://github.com/apache/beam.git # timeout=10
Fetching upstream changes from https://github.com/apache/beam.git
 > git fetch --tags --progress https://github.com/apache/beam.git +refs/heads/*:refs/remotes/origin/* +refs/pull/${ghprbPullId}/*:refs/remotes/origin/pr/${ghprbPullId}/* # timeout=10
 > git rev-parse origin/master^{commit} # timeout=10
Checking out Revision 042547c31eb4e7e13d1afcfdf08583fbd01a9865 (origin/master)
 > git config core.sparsecheckout # timeout=10
 > git checkout -f 042547c31eb4e7e13d1afcfdf08583fbd01a9865 # timeout=10
Commit message: "[BEAM-13015] Simplify DataStreamsDecoder by moving hasNext logic to next"
 > git rev-list --no-walk 042547c31eb4e7e13d1afcfdf08583fbd01a9865 # timeout=10
No emails were triggered.
[EnvInject] - Executing scripts and injecting environment variables after the SCM step.
[EnvInject] - Injecting as environment variables the properties content 
SPARK_LOCAL_IP=127.0.0.1
SETUPTOOLS_USE_DISTUTILS=stdlib

[EnvInject] - Variables injected successfully.
[Gradle] - Launching build.
[src] $ <https://ci-beam.apache.org/job/beam_PreCommit_CommunityMetrics_Cron/ws/src/gradlew> --continue --max-workers=12 -Dorg.gradle.jvmargs=-Xms2g -Dorg.gradle.jvmargs=-Xmx4g -Dorg.gradle.vfs.watch=false -Pdocker-pull-licenses :communityMetricsPreCommit
Starting a Gradle Daemon, 3 busy and 1 incompatible Daemons could not be reused, use --status for details
> Task :buildSrc:compileJava NO-SOURCE
> Task :buildSrc:compileGroovy FROM-CACHE
> Task :buildSrc:pluginDescriptors
> Task :buildSrc:processResources
> Task :buildSrc:classes
> Task :buildSrc:jar
> Task :buildSrc:assemble
> Task :buildSrc:spotlessGroovy FROM-CACHE
> Task :buildSrc:spotlessGroovyCheck UP-TO-DATE
> Task :buildSrc:spotlessGroovyGradle FROM-CACHE
> Task :buildSrc:spotlessGroovyGradleCheck UP-TO-DATE
> Task :buildSrc:spotlessCheck UP-TO-DATE
> Task :buildSrc:pluginUnderTestMetadata
> Task :buildSrc:compileTestJava NO-SOURCE
> Task :buildSrc:compileTestGroovy NO-SOURCE
> Task :buildSrc:processTestResources NO-SOURCE
> Task :buildSrc:testClasses UP-TO-DATE
> Task :buildSrc:test NO-SOURCE
> Task :buildSrc:validatePlugins FROM-CACHE
> Task :buildSrc:check UP-TO-DATE
> Task :buildSrc:build
Configuration on demand is an incubating feature.
> Task :beam-test-infra-metrics:createEmptyConfig

> Task :beam-test-infra-metrics:composeUp
postgresql uses an image, skipping
influxdb uses an image, skipping
Building influxdb-restore
Building grafana
Building syncgithub
Building syncjenkins
Building syncjira
Creating network "7f68c8270306616dc9f681dd43484432_beam-test-infra-metrics__default" with the default driver
Creating volume "7f68c8270306616dc9f681dd43484432_beam-test-infra-metrics__beam-postgresql-data" with default driver
Creating volume "7f68c8270306616dc9f681dd43484432_beam-test-infra-metrics__beam-grafana-libdata" with default driver
Creating volume "7f68c8270306616dc9f681dd43484432_beam-test-infra-metrics__beam-grafana-etcdata" with default driver
Creating volume "7f68c8270306616dc9f681dd43484432_beam-test-infra-metrics__beam-grafana-logdata" with default driver
Creating volume "7f68c8270306616dc9f681dd43484432_beam-test-infra-metrics__beam-influxdb-storage" with default driver
Pulling postgresql (postgres:)...
latest: Pulling from library/postgres
Digest: sha256:1fe27b334443793af98d7eb320ad6f9f30fcc9bc068f545cb46ec01cefe9c8ee
Status: Downloaded newer image for postgres:latest
Creating beamsyncjenkins ... 
Creating influxdb        ... 
Creating beamgrafana     ... 
Creating beampostgresql  ... 
Creating beamsyncgithub  ... 
Creating beamsyncjira    ... 

ERROR: for beamsyncjenkins  UnixHTTPConnectionPool(host='localhost', port=None): Read timed out. (read timeout=60)

ERROR: for beampostgresql  UnixHTTPConnectionPool(host='localhost', port=None): Read timed out. (read timeout=60)

ERROR: for beamsyncgithub  UnixHTTPConnectionPool(host='localhost', port=None): Read timed out. (read timeout=60)

ERROR: for beamgrafana  UnixHTTPConnectionPool(host='localhost', port=None): Read timed out. (read timeout=60)

ERROR: for influxdb  UnixHTTPConnectionPool(host='localhost', port=None): Read timed out. (read timeout=60)

ERROR: for beamsyncjira  UnixHTTPConnectionPool(host='localhost', port=None): Read timed out. (read timeout=60)

ERROR: for syncjenkins  UnixHTTPConnectionPool(host='localhost', port=None): Read timed out. (read timeout=60)

ERROR: for postgresql  UnixHTTPConnectionPool(host='localhost', port=None): Read timed out. (read timeout=60)

ERROR: for syncgithub  UnixHTTPConnectionPool(host='localhost', port=None): Read timed out. (read timeout=60)

ERROR: for grafana  UnixHTTPConnectionPool(host='localhost', port=None): Read timed out. (read timeout=60)

ERROR: for influxdb  UnixHTTPConnectionPool(host='localhost', port=None): Read timed out. (read timeout=60)

ERROR: for syncjira  UnixHTTPConnectionPool(host='localhost', port=None): Read timed out. (read timeout=60)
An HTTP request took too long to complete. Retry with --verbose to obtain debug information.
If you encounter this issue regularly because of slow network conditions, consider setting COMPOSE_HTTP_TIMEOUT to a higher value (current value: 60).
No such container: 48a321cd471ee3a06b8878e82ade28aaaa9cd33ed70cf573820449aed30753f8

> Task :beam-test-infra-metrics:composeUp FAILED

> Task :beam-test-infra-metrics:validateConfiguration
persistentvolumeclaim/beam-grafana-etcdata created (dry run)
persistentvolumeclaim/beam-grafana-libdata created (dry run)
persistentvolumeclaim/beam-grafana-logdata created (dry run)
cronjob.batch/influxdb-autobackup created (dry run)
persistentvolumeclaim/influxdb-storage created (dry run)
configmap/influxdb-init-scripts created (dry run)
deployment.apps/influxdb created (dry run)
service/influxdb created (dry run)
service/influxdb-rpc created (dry run)
persistentvolumeclaim/beam-postgresql-data created (dry run)
deployment.apps/beamgrafana created (dry run)

FAILURE: Build failed with an exception.

* What went wrong:
Execution failed for task ':beam-test-infra-metrics:composeUp'.
> Exit-code 1 when calling docker-compose, stdout: N/A

* Try:
Run with --stacktrace option to get the stack trace. Run with --info or --debug option to get more log output. Run with --scan to get full insights.

* Get more help at https://help.gradle.org

Deprecated Gradle features were used in this build, making it incompatible with Gradle 7.0.
Use '--warning-mode all' to show the individual deprecation warnings.
See https://docs.gradle.org/6.9.1/userguide/command_line_interface.html#sec:command_line_warnings

BUILD FAILED in 8m 28s
3 actionable tasks: 3 executed

Publishing build scan...
https://gradle.com/s/lxhco3paxdsy6

Build step 'Invoke Gradle script' changed build result to FAILURE
Build step 'Invoke Gradle script' marked build as failure

---------------------------------------------------------------------
To unsubscribe, e-mail: builds-unsubscribe@beam.apache.org
For additional commands, e-mail: builds-help@beam.apache.org


Jenkins build is back to normal : beam_PreCommit_CommunityMetrics_Cron #4443

Posted by Apache Jenkins Server <je...@builds.apache.org>.
See <https://ci-beam.apache.org/job/beam_PreCommit_CommunityMetrics_Cron/4443/display/redirect>


---------------------------------------------------------------------
To unsubscribe, e-mail: builds-unsubscribe@beam.apache.org
For additional commands, e-mail: builds-help@beam.apache.org


Build failed in Jenkins: beam_PreCommit_CommunityMetrics_Cron #4442

Posted by Apache Jenkins Server <je...@builds.apache.org>.
See <https://ci-beam.apache.org/job/beam_PreCommit_CommunityMetrics_Cron/4442/display/redirect>

Changes:


------------------------------------------
Started by timer
Running as SYSTEM
[EnvInject] - Loading node environment variables.
Building remotely on apache-beam-jenkins-8 (beam) in workspace <https://ci-beam.apache.org/job/beam_PreCommit_CommunityMetrics_Cron/ws/>
The recommended git tool is: NONE
No credentials specified
Wiping out workspace first.
Cloning the remote Git repository
Cloning repository https://github.com/apache/beam.git
 > git init <https://ci-beam.apache.org/job/beam_PreCommit_CommunityMetrics_Cron/ws/src> # timeout=10
Fetching upstream changes from https://github.com/apache/beam.git
 > git --version # timeout=10
 > git --version # 'git version 2.7.4'
 > git fetch --tags --progress https://github.com/apache/beam.git +refs/heads/*:refs/remotes/origin/* # timeout=10
 > git config remote.origin.url https://github.com/apache/beam.git # timeout=10
 > git config --add remote.origin.fetch +refs/heads/*:refs/remotes/origin/* # timeout=10
 > git config remote.origin.url https://github.com/apache/beam.git # timeout=10
Fetching upstream changes from https://github.com/apache/beam.git
 > git fetch --tags --progress https://github.com/apache/beam.git +refs/heads/*:refs/remotes/origin/* +refs/pull/${ghprbPullId}/*:refs/remotes/origin/pr/${ghprbPullId}/* # timeout=10
 > git rev-parse origin/master^{commit} # timeout=10
Checking out Revision 042547c31eb4e7e13d1afcfdf08583fbd01a9865 (origin/master)
 > git config core.sparsecheckout # timeout=10
 > git checkout -f 042547c31eb4e7e13d1afcfdf08583fbd01a9865 # timeout=10
Commit message: "[BEAM-13015] Simplify DataStreamsDecoder by moving hasNext logic to next"
 > git rev-list --no-walk 042547c31eb4e7e13d1afcfdf08583fbd01a9865 # timeout=10
No emails were triggered.
[EnvInject] - Executing scripts and injecting environment variables after the SCM step.
[EnvInject] - Injecting as environment variables the properties content 
SPARK_LOCAL_IP=127.0.0.1
SETUPTOOLS_USE_DISTUTILS=stdlib

[EnvInject] - Variables injected successfully.
[Gradle] - Launching build.
[src] $ <https://ci-beam.apache.org/job/beam_PreCommit_CommunityMetrics_Cron/ws/src/gradlew> --continue --max-workers=12 -Dorg.gradle.jvmargs=-Xms2g -Dorg.gradle.jvmargs=-Xmx4g -Dorg.gradle.vfs.watch=false -Pdocker-pull-licenses :communityMetricsPreCommit
Starting a Gradle Daemon, 3 busy Daemons could not be reused, use --status for details
> Task :buildSrc:compileJava NO-SOURCE
> Task :buildSrc:compileGroovy FROM-CACHE
> Task :buildSrc:pluginDescriptors
> Task :buildSrc:processResources
> Task :buildSrc:classes
> Task :buildSrc:jar
> Task :buildSrc:assemble
> Task :buildSrc:spotlessGroovy FROM-CACHE
> Task :buildSrc:spotlessGroovyCheck UP-TO-DATE
> Task :buildSrc:spotlessGroovyGradle FROM-CACHE
> Task :buildSrc:spotlessGroovyGradleCheck UP-TO-DATE
> Task :buildSrc:spotlessCheck UP-TO-DATE
> Task :buildSrc:pluginUnderTestMetadata
> Task :buildSrc:compileTestJava NO-SOURCE
> Task :buildSrc:compileTestGroovy NO-SOURCE
> Task :buildSrc:processTestResources NO-SOURCE
> Task :buildSrc:testClasses UP-TO-DATE
> Task :buildSrc:test NO-SOURCE
> Task :buildSrc:validatePlugins FROM-CACHE
> Task :buildSrc:check UP-TO-DATE
> Task :buildSrc:build
Configuration on demand is an incubating feature.
> Task :beam-test-infra-metrics:createEmptyConfig

> Task :beam-test-infra-metrics:composeUp
postgresql uses an image, skipping
influxdb uses an image, skipping
Building influxdb-restore
Building grafana
Building syncgithub
Building syncjenkins
Building syncjira
Creating network "7f68c8270306616dc9f681dd43484432_beam-test-infra-metrics__default" with the default driver
Creating volume "7f68c8270306616dc9f681dd43484432_beam-test-infra-metrics__beam-postgresql-data" with default driver
Creating volume "7f68c8270306616dc9f681dd43484432_beam-test-infra-metrics__beam-grafana-libdata" with default driver
Creating volume "7f68c8270306616dc9f681dd43484432_beam-test-infra-metrics__beam-grafana-etcdata" with default driver
Creating volume "7f68c8270306616dc9f681dd43484432_beam-test-infra-metrics__beam-grafana-logdata" with default driver
Creating volume "7f68c8270306616dc9f681dd43484432_beam-test-infra-metrics__beam-influxdb-storage" with default driver
Creating influxdb ... 
Creating beamsyncjira ... 
Creating beamsyncjenkins ... 
Creating beamsyncgithub  ... 
Creating beamgrafana     ... 
Creating influxdb        ... error

ERROR: for influxdb  Cannot create container for service influxdb: Conflict. The container name "/influxdb" is already in use by container "7741b3d6f0ef6573ebafb2b66cf17744fa378d09f96439f91651baa9d2d39b03". You have to remove (or rename) that container to be able to reuse that name.
Creating beamsyncjira    ... error

ERROR: for beamsyncjira  Cannot create container for service syncjira: Conflict. The container name "/beamsyncjira" is already in use by container "cbe999895e0a84e6cf731d55d7b96602d9211711739dbe55d385ef8798837e9d". You have to remove (or rename) that container to be able to reuse that name.
Creating beampostgresql  ... 
Creating beamsyncjenkins ... error

ERROR: for beamsyncjenkins  Cannot create container for service syncjenkins: Conflict. The container name "/beamsyncjenkins" is already in use by container "21ffc9a4e26b02b11bd153d64cd21ae4eab9d36c9a9d5bffdd760c632f20434c". You have to remove (or rename) that container to be able to reuse that name.
Creating beamsyncgithub  ... error

ERROR: for beamsyncgithub  Cannot create container for service syncgithub: Conflict. The container name "/beamsyncgithub" is already in use by container "a390300f6ea88f1ed6fc2b9658676bcbcce1f7947df969af27d7d56cb002e79f". You have to remove (or rename) that container to be able to reuse that name.
Creating beamgrafana     ... error

ERROR: for beamgrafana  Cannot create container for service grafana: Conflict. The container name "/beamgrafana" is already in use by container "e8719849f47fe2f2fea52ecab279c3b038f03a0b723b296ede84fcef1d718d99". You have to remove (or rename) that container to be able to reuse that name.
Creating beampostgresql  ... error

ERROR: for beampostgresql  Cannot create container for service postgresql: Conflict. The container name "/beampostgresql" is already in use by container "815a088bd5ce997184de2d2f521f85ceba53b7f8e830bf5444c86b4ac0a9347f". You have to remove (or rename) that container to be able to reuse that name.

ERROR: for influxdb  Cannot create container for service influxdb: Conflict. The container name "/influxdb" is already in use by container "7741b3d6f0ef6573ebafb2b66cf17744fa378d09f96439f91651baa9d2d39b03". You have to remove (or rename) that container to be able to reuse that name.

ERROR: for syncjira  Cannot create container for service syncjira: Conflict. The container name "/beamsyncjira" is already in use by container "cbe999895e0a84e6cf731d55d7b96602d9211711739dbe55d385ef8798837e9d". You have to remove (or rename) that container to be able to reuse that name.

ERROR: for syncjenkins  Cannot create container for service syncjenkins: Conflict. The container name "/beamsyncjenkins" is already in use by container "21ffc9a4e26b02b11bd153d64cd21ae4eab9d36c9a9d5bffdd760c632f20434c". You have to remove (or rename) that container to be able to reuse that name.

ERROR: for syncgithub  Cannot create container for service syncgithub: Conflict. The container name "/beamsyncgithub" is already in use by container "a390300f6ea88f1ed6fc2b9658676bcbcce1f7947df969af27d7d56cb002e79f". You have to remove (or rename) that container to be able to reuse that name.

ERROR: for grafana  Cannot create container for service grafana: Conflict. The container name "/beamgrafana" is already in use by container "e8719849f47fe2f2fea52ecab279c3b038f03a0b723b296ede84fcef1d718d99". You have to remove (or rename) that container to be able to reuse that name.

ERROR: for postgresql  Cannot create container for service postgresql: Conflict. The container name "/beampostgresql" is already in use by container "815a088bd5ce997184de2d2f521f85ceba53b7f8e830bf5444c86b4ac0a9347f". You have to remove (or rename) that container to be able to reuse that name.
Encountered errors while bringing up the project.
Removing network 7f68c8270306616dc9f681dd43484432_beam-test-infra-metrics__default
Removing volume 7f68c8270306616dc9f681dd43484432_beam-test-infra-metrics__beam-postgresql-data
Removing volume 7f68c8270306616dc9f681dd43484432_beam-test-infra-metrics__beam-grafana-libdata
Removing volume 7f68c8270306616dc9f681dd43484432_beam-test-infra-metrics__beam-grafana-etcdata
Removing volume 7f68c8270306616dc9f681dd43484432_beam-test-infra-metrics__beam-grafana-logdata
Removing volume 7f68c8270306616dc9f681dd43484432_beam-test-infra-metrics__beam-influxdb-storage

> Task :beam-test-infra-metrics:composeUp FAILED

> Task :beam-test-infra-metrics:validateConfiguration
persistentvolumeclaim/beam-grafana-etcdata created (dry run)
persistentvolumeclaim/beam-grafana-libdata created (dry run)
persistentvolumeclaim/beam-grafana-logdata created (dry run)
cronjob.batch/influxdb-autobackup created (dry run)
persistentvolumeclaim/influxdb-storage created (dry run)
configmap/influxdb-init-scripts created (dry run)
deployment.apps/influxdb created (dry run)
service/influxdb created (dry run)
service/influxdb-rpc created (dry run)
persistentvolumeclaim/beam-postgresql-data created (dry run)
deployment.apps/beamgrafana created (dry run)

FAILURE: Build failed with an exception.

* What went wrong:
Execution failed for task ':beam-test-infra-metrics:composeUp'.
> Exit-code 1 when calling docker-compose, stdout: N/A

* Try:
Run with --stacktrace option to get the stack trace. Run with --info or --debug option to get more log output. Run with --scan to get full insights.

* Get more help at https://help.gradle.org

Deprecated Gradle features were used in this build, making it incompatible with Gradle 7.0.
Use '--warning-mode all' to show the individual deprecation warnings.
See https://docs.gradle.org/6.9.1/userguide/command_line_interface.html#sec:command_line_warnings

BUILD FAILED in 49s
3 actionable tasks: 3 executed

Publishing build scan...
https://gradle.com/s/lhkmhtzbprai4

Build step 'Invoke Gradle script' changed build result to FAILURE
Build step 'Invoke Gradle script' marked build as failure

---------------------------------------------------------------------
To unsubscribe, e-mail: builds-unsubscribe@beam.apache.org
For additional commands, e-mail: builds-help@beam.apache.org


Build failed in Jenkins: beam_PreCommit_CommunityMetrics_Cron #4441

Posted by Apache Jenkins Server <je...@builds.apache.org>.
See <https://ci-beam.apache.org/job/beam_PreCommit_CommunityMetrics_Cron/4441/display/redirect>

Changes:


------------------------------------------
Started by timer
Running as SYSTEM
[EnvInject] - Loading node environment variables.
Building remotely on apache-beam-jenkins-8 (beam) in workspace <https://ci-beam.apache.org/job/beam_PreCommit_CommunityMetrics_Cron/ws/>
The recommended git tool is: NONE
No credentials specified
Wiping out workspace first.
Cloning the remote Git repository
Cloning repository https://github.com/apache/beam.git
 > git init <https://ci-beam.apache.org/job/beam_PreCommit_CommunityMetrics_Cron/ws/src> # timeout=10
Fetching upstream changes from https://github.com/apache/beam.git
 > git --version # timeout=10
 > git --version # 'git version 2.7.4'
 > git fetch --tags --progress https://github.com/apache/beam.git +refs/heads/*:refs/remotes/origin/* # timeout=10
 > git config remote.origin.url https://github.com/apache/beam.git # timeout=10
 > git config --add remote.origin.fetch +refs/heads/*:refs/remotes/origin/* # timeout=10
 > git config remote.origin.url https://github.com/apache/beam.git # timeout=10
Fetching upstream changes from https://github.com/apache/beam.git
 > git fetch --tags --progress https://github.com/apache/beam.git +refs/heads/*:refs/remotes/origin/* +refs/pull/${ghprbPullId}/*:refs/remotes/origin/pr/${ghprbPullId}/* # timeout=10
 > git rev-parse origin/master^{commit} # timeout=10
Checking out Revision 042547c31eb4e7e13d1afcfdf08583fbd01a9865 (origin/master)
 > git config core.sparsecheckout # timeout=10
 > git checkout -f 042547c31eb4e7e13d1afcfdf08583fbd01a9865 # timeout=10
Commit message: "[BEAM-13015] Simplify DataStreamsDecoder by moving hasNext logic to next"
 > git rev-list --no-walk 042547c31eb4e7e13d1afcfdf08583fbd01a9865 # timeout=10
No emails were triggered.
[EnvInject] - Executing scripts and injecting environment variables after the SCM step.
[EnvInject] - Injecting as environment variables the properties content 
SPARK_LOCAL_IP=127.0.0.1
SETUPTOOLS_USE_DISTUTILS=stdlib

[EnvInject] - Variables injected successfully.
[Gradle] - Launching build.
[src] $ <https://ci-beam.apache.org/job/beam_PreCommit_CommunityMetrics_Cron/ws/src/gradlew> --continue --max-workers=12 -Dorg.gradle.jvmargs=-Xms2g -Dorg.gradle.jvmargs=-Xmx4g -Dorg.gradle.vfs.watch=false -Pdocker-pull-licenses :communityMetricsPreCommit
> Task :buildSrc:compileJava NO-SOURCE
> Task :buildSrc:compileGroovy FROM-CACHE
> Task :buildSrc:pluginDescriptors
> Task :buildSrc:processResources
> Task :buildSrc:classes
> Task :buildSrc:jar
> Task :buildSrc:assemble
> Task :buildSrc:spotlessGroovy FROM-CACHE
> Task :buildSrc:spotlessGroovyCheck UP-TO-DATE
> Task :buildSrc:spotlessGroovyGradle FROM-CACHE
> Task :buildSrc:spotlessGroovyGradleCheck UP-TO-DATE
> Task :buildSrc:spotlessCheck UP-TO-DATE
> Task :buildSrc:pluginUnderTestMetadata
> Task :buildSrc:compileTestJava NO-SOURCE
> Task :buildSrc:compileTestGroovy NO-SOURCE
> Task :buildSrc:processTestResources NO-SOURCE
> Task :buildSrc:testClasses UP-TO-DATE
> Task :buildSrc:test NO-SOURCE
> Task :buildSrc:validatePlugins FROM-CACHE
> Task :buildSrc:check UP-TO-DATE
> Task :buildSrc:build
Configuration on demand is an incubating feature.
> Task :beam-test-infra-metrics:createEmptyConfig

> Task :beam-test-infra-metrics:composeUp
postgresql uses an image, skipping
influxdb uses an image, skipping
Building influxdb-restore
Building grafana
Building syncgithub
Building syncjenkins
Building syncjira
Creating network "7f68c8270306616dc9f681dd43484432_beam-test-infra-metrics__default" with the default driver
Creating volume "7f68c8270306616dc9f681dd43484432_beam-test-infra-metrics__beam-postgresql-data" with default driver
Creating volume "7f68c8270306616dc9f681dd43484432_beam-test-infra-metrics__beam-grafana-libdata" with default driver
Creating volume "7f68c8270306616dc9f681dd43484432_beam-test-infra-metrics__beam-grafana-etcdata" with default driver
Creating volume "7f68c8270306616dc9f681dd43484432_beam-test-infra-metrics__beam-grafana-logdata" with default driver
Creating volume "7f68c8270306616dc9f681dd43484432_beam-test-infra-metrics__beam-influxdb-storage" with default driver
Creating beamsyncjira ... 
Creating influxdb     ... 
Creating beamsyncjenkins ... 
Creating beamsyncgithub  ... 
Creating beamgrafana     ... 
Creating influxdb        ... error

ERROR: for influxdb  Cannot create container for service influxdb: Conflict. The container name "/influxdb" is already in use by container "7741b3d6f0ef6573ebafb2b66cf17744fa378d09f96439f91651baa9d2d39b03". You have to remove (or rename) that container to be able to reuse that name.
Creating beamsyncjira    ... error

ERROR: for beamsyncjira  Cannot create container for service syncjira: Conflict. The container name "/beamsyncjira" is already in use by container "cbe999895e0a84e6cf731d55d7b96602d9211711739dbe55d385ef8798837e9d". You have to remove (or rename) that container to be able to reuse that name.
Creating beamsyncjenkins ... error

ERROR: for beamsyncjenkins  Cannot create container for service syncjenkins: Conflict. The container name "/beamsyncjenkins" is already in use by container "21ffc9a4e26b02b11bd153d64cd21ae4eab9d36c9a9d5bffdd760c632f20434c". You have to remove (or rename) that container to be able to reuse that name.
Creating beampostgresql  ... 
Creating beamsyncgithub  ... error

ERROR: for beamsyncgithub  Cannot create container for service syncgithub: Conflict. The container name "/beamsyncgithub" is already in use by container "a390300f6ea88f1ed6fc2b9658676bcbcce1f7947df969af27d7d56cb002e79f". You have to remove (or rename) that container to be able to reuse that name.
Creating beamgrafana     ... error

ERROR: for beamgrafana  Cannot create container for service grafana: Conflict. The container name "/beamgrafana" is already in use by container "e8719849f47fe2f2fea52ecab279c3b038f03a0b723b296ede84fcef1d718d99". You have to remove (or rename) that container to be able to reuse that name.
Creating beampostgresql  ... error

ERROR: for beampostgresql  Cannot create container for service postgresql: Conflict. The container name "/beampostgresql" is already in use by container "815a088bd5ce997184de2d2f521f85ceba53b7f8e830bf5444c86b4ac0a9347f". You have to remove (or rename) that container to be able to reuse that name.

ERROR: for influxdb  Cannot create container for service influxdb: Conflict. The container name "/influxdb" is already in use by container "7741b3d6f0ef6573ebafb2b66cf17744fa378d09f96439f91651baa9d2d39b03". You have to remove (or rename) that container to be able to reuse that name.

ERROR: for syncjira  Cannot create container for service syncjira: Conflict. The container name "/beamsyncjira" is already in use by container "cbe999895e0a84e6cf731d55d7b96602d9211711739dbe55d385ef8798837e9d". You have to remove (or rename) that container to be able to reuse that name.

ERROR: for syncjenkins  Cannot create container for service syncjenkins: Conflict. The container name "/beamsyncjenkins" is already in use by container "21ffc9a4e26b02b11bd153d64cd21ae4eab9d36c9a9d5bffdd760c632f20434c". You have to remove (or rename) that container to be able to reuse that name.

ERROR: for syncgithub  Cannot create container for service syncgithub: Conflict. The container name "/beamsyncgithub" is already in use by container "a390300f6ea88f1ed6fc2b9658676bcbcce1f7947df969af27d7d56cb002e79f". You have to remove (or rename) that container to be able to reuse that name.

ERROR: for grafana  Cannot create container for service grafana: Conflict. The container name "/beamgrafana" is already in use by container "e8719849f47fe2f2fea52ecab279c3b038f03a0b723b296ede84fcef1d718d99". You have to remove (or rename) that container to be able to reuse that name.

ERROR: for postgresql  Cannot create container for service postgresql: Conflict. The container name "/beampostgresql" is already in use by container "815a088bd5ce997184de2d2f521f85ceba53b7f8e830bf5444c86b4ac0a9347f". You have to remove (or rename) that container to be able to reuse that name.
Encountered errors while bringing up the project.
Removing network 7f68c8270306616dc9f681dd43484432_beam-test-infra-metrics__default
Removing volume 7f68c8270306616dc9f681dd43484432_beam-test-infra-metrics__beam-postgresql-data
Removing volume 7f68c8270306616dc9f681dd43484432_beam-test-infra-metrics__beam-grafana-libdata
Removing volume 7f68c8270306616dc9f681dd43484432_beam-test-infra-metrics__beam-grafana-etcdata
Removing volume 7f68c8270306616dc9f681dd43484432_beam-test-infra-metrics__beam-grafana-logdata
Removing volume 7f68c8270306616dc9f681dd43484432_beam-test-infra-metrics__beam-influxdb-storage

> Task :beam-test-infra-metrics:composeUp FAILED

> Task :beam-test-infra-metrics:validateConfiguration
persistentvolumeclaim/beam-grafana-etcdata created (dry run)
persistentvolumeclaim/beam-grafana-libdata created (dry run)
persistentvolumeclaim/beam-grafana-logdata created (dry run)
cronjob.batch/influxdb-autobackup created (dry run)
persistentvolumeclaim/influxdb-storage created (dry run)
configmap/influxdb-init-scripts created (dry run)
deployment.apps/influxdb created (dry run)
service/influxdb created (dry run)
service/influxdb-rpc created (dry run)
persistentvolumeclaim/beam-postgresql-data created (dry run)
deployment.apps/beamgrafana created (dry run)

FAILURE: Build failed with an exception.

* What went wrong:
Execution failed for task ':beam-test-infra-metrics:composeUp'.
> Exit-code 1 when calling docker-compose, stdout: N/A

* Try:
Run with --stacktrace option to get the stack trace. Run with --info or --debug option to get more log output. Run with --scan to get full insights.

* Get more help at https://help.gradle.org

Deprecated Gradle features were used in this build, making it incompatible with Gradle 7.0.
Use '--warning-mode all' to show the individual deprecation warnings.
See https://docs.gradle.org/6.9.1/userguide/command_line_interface.html#sec:command_line_warnings

BUILD FAILED in 28s
3 actionable tasks: 3 executed

Publishing build scan...
https://gradle.com/s/tqhnaouhn2rkq

Build step 'Invoke Gradle script' changed build result to FAILURE
Build step 'Invoke Gradle script' marked build as failure

---------------------------------------------------------------------
To unsubscribe, e-mail: builds-unsubscribe@beam.apache.org
For additional commands, e-mail: builds-help@beam.apache.org