You are viewing a plain text version of this content. The canonical link for it is here.
Posted to dev@lucenenet.apache.org by tc...@codebetter.com on 2015/02/01 22:22:58 UTC
[TeamCity, FAILED] Build Lucene.NET :: Lucene.NET Core [master]
#137
Build Lucene.NET :: Lucene.NET Core [master] #137 failed (Tests failed: 96 (10 new), passed: 2376, ignored: 112).
Agent: JetBrains-dotnet-agent01
Build results: http://teamcity.codebetter.com/viewLog.html?buildId=180292&buildTypeId=LuceneNet_Core
Failed Tests Summary:
Newly failed tests (10 tests, alphabetically ordered)
==================================================================
Lucene.Net.Tests.dll: Lucene.Net.Index.TestBagOfPositions.Test
Lucene.Net.Tests.dll: Lucene.Net.Index.TestIndexWriterReader.TestAddIndexesAndDoDeletesThreads
Lucene.Net.Tests.dll: Lucene.Net.Index.TestIndexWriterReader.TestDuringAddIndexes
Lucene.Net.Tests.dll: Lucene.Net.Index.TestTermsEnum.TestIntersectRandom
Lucene.Net.Tests.dll: Lucene.Net.Search.TestSimpleExplanations.TestFQ4
Lucene.Net.Tests.dll: Lucene.Net.Search.TestSimpleExplanations.TestFQ6
Lucene.Net.Tests.dll: Lucene.Net.Search.TestSimpleExplanations.TestT2
Lucene.Net.Tests.dll: Lucene.Net.Store.TestMockDirectoryWrapper.TestDiskFull
Lucene.Net.Tests.dll: Lucene.Net.Util.TestOpenBitSet.BaseDocIdSetTestCase`1.TestNoBit
Lucene.Net.Tests.dll: Lucene.Net.Util.TestPagedBytes.TestDataInputOutput
Other failed tests (86 tests, alphabetically ordered)
==================================================================
Lucene.Net.Tests.dll: Lucene.Net.Analysis.TestLookaheadTokenFilter.TestRandomStrings
Lucene.Net.Tests.dll: Lucene.Net.Analysis.TestMockAnalyzer.TestRandomRegexps
Lucene.Net.Tests.dll: Lucene.Net.Codecs.Lucene41.TestBlockPostingsFormat2
Lucene.Net.Tests.dll: Lucene.Net.Codecs.Lucene41.TestBlockPostingsFormat3.Test
Lucene.Net.Tests.dll: Lucene.Net.Codecs.Lucene42.TestLucene42DocValuesFormat.BaseDocValuesFormatTestCase.TestVeryLargeButLegalSortedBytes
Lucene.Net.Tests.dll: Lucene.Net.Index.TestAddIndexes.TestAddIndexMissingCodec
Lucene.Net.Tests.dll: Lucene.Net.Index.TestAddIndexes.TestAddIndexesWithThreads
Lucene.Net.Tests.dll: Lucene.Net.Index.TestAtomicUpdate.TestAtomicUpdates
Lucene.Net.Tests.dll: Lucene.Net.Index.TestBinaryDocValuesUpdates.TestStressMultiThreading
Lucene.Net.Tests.dll: Lucene.Net.Index.TestBinaryDocValuesUpdates.TestTonsOfUpdates
Lucene.Net.Tests.dll: Lucene.Net.Index.TestBinaryDocValuesUpdates.TestUpdateSegmentWithNoDocValues
Lucene.Net.Tests.dll: Lucene.Net.Index.TestBinaryDocValuesUpdates.TestUpdatesAndDeletes
Lucene.Net.Tests.dll: Lucene.Net.Index.TestCodecHoldsOpenFiles.Test
Lucene.Net.Tests.dll: Lucene.Net.Index.TestCustomNorms.TestFloatNorms
Lucene.Net.Tests.dll: Lucene.Net.Index.TestDirectoryReader.TestNoDir
Lucene.Net.Tests.dll: Lucene.Net.Index.TestDocumentsWriterStallControl.TestSimpleStall
Lucene.Net.Tests.dll: Lucene.Net.Index.TestDuelingCodecs.TestEquals
Lucene.Net.Tests.dll: Lucene.Net.Index.TestFieldsReader.TestExceptions
Lucene.Net.Tests.dll: Lucene.Net.Index.TestFilterAtomicReader.TestOverrideMethods
Lucene.Net.Tests.dll: Lucene.Net.Index.TestIndexWriter.TestThreadInterruptDeadlock
Lucene.Net.Tests.dll: Lucene.Net.Index.TestIndexWriter.TestTwoThreadsInterruptDeadlock
Lucene.Net.Tests.dll: Lucene.Net.Index.TestIndexWriterConfig.TestSettersChaining
Lucene.Net.Tests.dll: Lucene.Net.Index.TestIndexWriterExceptions.TestDocumentsWriterAbort
Lucene.Net.Tests.dll: Lucene.Net.Index.TestIndexWriterExceptions.TestExceptionDuringSync
Lucene.Net.Tests.dll: Lucene.Net.Index.TestIndexWriterExceptions.TestExceptionOnMergeInit
Lucene.Net.Tests.dll: Lucene.Net.Index.TestIndexWriterExceptions.TestExceptionsDuringCommit
Lucene.Net.Tests.dll: Lucene.Net.Index.TestIndexWriterExceptions.TestNoLostDeletesOrUpdates
Lucene.Net.Tests.dll: Lucene.Net.Index.TestIndexWriterExceptions.TestSegmentsChecksumError
Lucene.Net.Tests.dll: Lucene.Net.Index.TestIndexWriterReader.TestDuringAddDelete
Lucene.Net.Tests.dll: Lucene.Net.Index.TestIndexWriterReader.TestNRTOpenExceptions
Lucene.Net.Tests.dll: Lucene.Net.Index.TestIndexWriterUnicode.TestRandomUnicodeStrings
Lucene.Net.Tests.dll: Lucene.Net.Index.TestIndexWriterUnicode.TestTermUTF16SortOrder
Lucene.Net.Tests.dll: Lucene.Net.Index.TestIndexableField.TestArbitraryFields
Lucene.Net.Tests.dll: Lucene.Net.Index.TestLongPostings.TestLongPostingsNoPositions
Lucene.Net.Tests.dll: Lucene.Net.Index.TestLongPostings.TestLongPostings_Mem
Lucene.Net.Tests.dll: Lucene.Net.Index.TestMixedDocValuesUpdates.TestStressMultiThreading
Lucene.Net.Tests.dll: Lucene.Net.Index.TestMixedDocValuesUpdates.TestTonsOfUpdates
Lucene.Net.Tests.dll: Lucene.Net.Index.TestNRTThreads.TestNRTThreads_Mem
Lucene.Net.Tests.dll: Lucene.Net.Index.TestNumericDocValuesUpdates.TestUpdatesOrder
Lucene.Net.Tests.dll: Lucene.Net.Index.TestParallelCompositeReader.TestToStringCompositeComposite
Lucene.Net.Tests.dll: Lucene.Net.Index.TestPersistentSnapshotDeletionPolicy.TestSnapshotDeletionPolicy.TestBasicSnapshots
Lucene.Net.Tests.dll: Lucene.Net.Index.TestPersistentSnapshotDeletionPolicy.TestSnapshotDeletionPolicy.TestRollbackToOldSnapshot
Lucene.Net.Tests.dll: Lucene.Net.Index.TestRollingUpdates.TestUpdateSameDoc
Lucene.Net.Tests.dll: Lucene.Net.Index.TestSegmentMerger.TestMerge
Lucene.Net.Tests.dll: Lucene.Net.Index.TestSegmentReader.TestDocument
Lucene.Net.Tests.dll: Lucene.Net.Index.TestSegmentTermDocs.TestIndexDivisor
Lucene.Net.Tests.dll: Lucene.Net.Index.TestSegmentTermDocs.TestTermDocs
Lucene.Net.Tests.dll: Lucene.Net.Index.TestSnapshotDeletionPolicy.TestRollbackToOldSnapshot
Lucene.Net.Tests.dll: Lucene.Net.Index.TestStressIndexing.TestStressIndexAndSearching
Lucene.Net.Tests.dll: Lucene.Net.Index.TestTermdocPerf.TestTermDocPerf
Lucene.Net.Tests.dll: Lucene.Net.Index.TestTermsEnum.TestFloorBlocks
Lucene.Net.Tests.dll: Lucene.Net.Index.TestTermsEnum.TestRandomTerms
Lucene.Net.Tests.dll: Lucene.Net.Index.TestThreadedForceMerge.TestThreadedForceMerge_Mem
Lucene.Net.Tests.dll: Lucene.Net.Index.TestTransactions.TestTransactions_Mem
Lucene.Net.Tests.dll: Lucene.Net.Search.Payloads.TestPayloadNearQuery.Test
Lucene.Net.Tests.dll: Lucene.Net.Search.Payloads.TestPayloadNearQuery.TestAverageFunction
Lucene.Net.Tests.dll: Lucene.Net.Search.Payloads.TestPayloadNearQuery.TestComplexNested
Lucene.Net.Tests.dll: Lucene.Net.Search.Payloads.TestPayloadNearQuery.TestLongerSpan
Lucene.Net.Tests.dll: Lucene.Net.Search.Payloads.TestPayloadNearQuery.TestMaxFunction
Lucene.Net.Tests.dll: Lucene.Net.Search.Payloads.TestPayloadNearQuery.TestMinFunction
Lucene.Net.Tests.dll: Lucene.Net.Search.Payloads.TestPayloadNearQuery.TestPayloadNear
Lucene.Net.Tests.dll: Lucene.Net.Search.Spans.TestSpanMultiTermQueryWrapper.TestFuzzy2
Lucene.Net.Tests.dll: Lucene.Net.Search.TestAutomatonQuery.TestRewritePrefix
Lucene.Net.Tests.dll: Lucene.Net.Search.TestFuzzyQuery.TestFuzziness
Lucene.Net.Tests.dll: Lucene.Net.Search.TestFuzzyQuery.TestTieBreaker
Lucene.Net.Tests.dll: Lucene.Net.Search.TestMultiPhraseQuery.TestMultiSloppyWithRepeats
Lucene.Net.Tests.dll: Lucene.Net.Search.TestNumericRangeQuery32.TestInfiniteValues
Lucene.Net.Tests.dll: Lucene.Net.Search.TestNumericRangeQuery64.TestInfiniteValues
Lucene.Net.Tests.dll: Lucene.Net.Search.TestRegexpQuery.TestBacktracking
Lucene.Net.Tests.dll: Lucene.Net.Search.TestRegexpQuery.TestRegexComplement
Lucene.Net.Tests.dll: Lucene.Net.Search.TestRegexpRandom.TestRegexps
Lucene.Net.Tests.dll: Lucene.Net.Search.TestSearcherManager.TestSearcherManager_Mem
Lucene.Net.Tests.dll: Lucene.Net.Search.TestSimpleExplanations.TestDMQ8
Lucene.Net.Tests.dll: Lucene.Net.Search.TestTermVectors
Lucene.Net.Tests.dll: Lucene.Net.Search.TestTermVectors.TestMixedVectrosVectors
Lucene.Net.Tests.dll: Lucene.Net.Search.TestWildcard.TestPrefixTerm
Lucene.Net.Tests.dll: Lucene.Net.Search.TestWildcardRandom.TestWildcards
Lucene.Net.Tests.dll: Lucene.Net.Store.TestBufferedIndexInput.TestSetBufferSize
Lucene.Net.Tests.dll: Lucene.Net.Store.TestFileSwitchDirectory.TestNoDir
Lucene.Net.Tests.dll: Lucene.Net.Store.TestNRTCachingDirectory.TestNoDir
Lucene.Net.Tests.dll: Lucene.Net.Tests.TestAssertions.TestTokenStreams
Lucene.Net.Tests.dll: Lucene.Net.Util.Packed.TestEliasFanoSequence.TestMonotoneSequences
Lucene.Net.Tests.dll: Lucene.Net.Util.Packed.TestEliasFanoSequence.TestStrictMonotoneSequences
Lucene.Net.Tests.dll: Lucene.Net.Util.TestFixedBitSet.BaseDocIdSetTestCase`1.TestAgainstBitSet
Lucene.Net.Tests.dll: Lucene.Net.Util.TestIndexableBinaryStringTools.TestEncodedSortability
Lucene.Net.Tests.dll: Lucene.Net.Util.TestPagedBytes.TestOverflow
Newly failed tests details (only first 3 failures shown here)
==================================================================
Lucene.Net.Tests.dll: Lucene.Net.Index.TestBagOfPositions.Test (new) =================
TearDown method failed. System.InvalidOperationException : Collection was modified after the enumerator was instantiated.
TearDown : System.IO.IOException : The process cannot access the file 'write.lock' because it is being used by another process.
at System.Collections.Generic.LinkedList`1.Enumerator.MoveNext()
at Lucene.Net.Index.DocumentsWriterFlushControl.PruneBlockedQueue(DocumentsWriterDeleteQueue flushingQueue) in z:\Builds\work\bcdbe6b8cc677a49\src\Lucene.Net.Core\Index\DocumentsWriterFlushControl.cs:line 738
at Lucene.Net.Index.DocumentsWriterFlushControl.MarkForFullFlush() in z:\Builds\work\bcdbe6b8cc677a49\src\Lucene.Net.Core\Index\DocumentsWriterFlushControl.cs:line 665
at Lucene.Net.Index.DocumentsWriter.FlushAllThreads(IndexWriter indexWriter) in z:\Builds\work\bcdbe6b8cc677a49\src\Lucene.Net.Core\Index\DocumentsWriter.cs:line 756
at Lucene.Net.Index.IndexWriter.DoFlush(Boolean applyAllDeletes) in z:\Builds\work\bcdbe6b8cc677a49\src\Lucene.Net.Core\Index\IndexWriter.cs:line 3883
at Lucene.Net.Index.IndexWriter.ForceMerge(Int32 maxNumSegments, Boolean doWait) in z:\Builds\work\bcdbe6b8cc677a49\src\Lucene.Net.Core\Index\IndexWriter.cs:line 2130
at Lucene.Net.Index.IndexWriter.ForceMerge(Int32 maxNumSegments) in z:\Builds\work\bcdbe6b8cc677a49\src\Lucene.Net.Core\Index\IndexWriter.cs:line 2101
at Lucene.Net.Index.RandomIndexWriter.ForceMerge(Int32 maxSegmentCount) in z:\Builds\work\bcdbe6b8cc677a49\src\Lucene.Net.TestFramework\Index\RandomIndexWriter.cs:line 510
at Lucene.Net.Index.TestBagOfPositions.Test() in z:\Builds\work\bcdbe6b8cc677a49\src\Lucene.Net.Tests\core\Index\TestBagOfPositions.cs:line 129
--TearDown
at System.IO.Directory.DeleteHelper(String fullPath, String userPath, Boolean recursive, Boolean throwOnTopLevelDirectoryNotFound)
at System.IO.Directory.Delete(String fullPath, String userPath, Boolean recursive, Boolean checkHost)
at Lucene.Net.Util.LuceneTestCase.CleanupTemporaryFiles() in z:\Builds\work\bcdbe6b8cc677a49\src\Lucene.Net.TestFramework\Util\LuceneTestCase.cs:line 2659
at Lucene.Net.Util.LuceneTestCase.TearDown() in z:\Builds\work\bcdbe6b8cc677a49\src\Lucene.Net.TestFramework\Util\LuceneTestCase.cs:line 581
------- Stderr: -------
Unhandled exception in remote appdomain: System.Exception: Collection was modified after the enumerator was instantiated. ---> System.InvalidOperationException: Collection was modified after the enumerator was instantiated.
at System.Collections.Generic.LinkedList`1.Enumerator.MoveNext()
at Lucene.Net.Index.DocumentsWriterFlushControl.PruneBlockedQueue(DocumentsWriterDeleteQueue flushingQueue) in z:\Builds\work\bcdbe6b8cc677a49\src\Lucene.Net.Core\Index\DocumentsWriterFlushControl.cs:line 738
at Lucene.Net.Index.DocumentsWriterFlushControl.FinishFullFlush() in z:\Builds\work\bcdbe6b8cc677a49\src\Lucene.Net.Core\Index\DocumentsWriterFlushControl.cs:line 767
at Lucene.Net.Index.DocumentsWriter.FinishFullFlush(Boolean success) in z:\Builds\work\bcdbe6b8cc677a49\src\Lucene.Net.Core\Index\DocumentsWriter.cs:line 803
at Lucene.Net.Index.IndexWriter.PrepareCommitInternal() in z:\Builds\work\bcdbe6b8cc677a49\src\Lucene.Net.Core\Index\IndexWriter.cs:line 3621
at Lucene.Net.Index.IndexWriter.CommitInternal() in z:\Builds\work\bcdbe6b8cc677a49\src\Lucene.Net.Core\Index\IndexWriter.cs:line 3763
at Lucene.Net.Index.RandomIndexWriter.MaybeCommit() in z:\Builds\work\bcdbe6b8cc677a49\src\Lucene.Net.TestFramework\Index\RandomIndexWriter.cs:line 228
at Lucene.Net.Index.RandomIndexWriter.AddDocument(IEnumerable`1 doc, Analyzer a) in z:\Builds\work\bcdbe6b8cc677a49\src\Lucene.Net.TestFramework\Index\RandomIndexWriter.cs:line 150
at Lucene.Net.Index.RandomIndexWriter.AddDocument(IEnumerable`1 doc) in z:\Builds\work\bcdbe6b8cc677a49\src\Lucene.Net.TestFramework\Index\RandomIndexWriter.cs:line 132
at Lucene.Net.Index.TestBagOfPositions.ThreadAnonymousInnerClassHelper.Run() in z:\Builds\work\bcdbe6b8cc677a49\src\Lucene.Net.Tests\core\Index\TestBagOfPositions.cs:line 197
--- End of inner exception stack trace ---
at Lucene.Net.Index.TestBagOfPositions.ThreadAnonymousInnerClassHelper.Run() in z:\Builds\work\bcdbe6b8cc677a49\src\Lucene.Net.Tests\core\Index\TestBagOfPositions.cs:line 202
at System.Threading.ThreadHelper.ThreadStart_Context(Object state)
at System.Threading.ExecutionContext.RunInternal(ExecutionContext executionContext, ContextCallback callback, Object state, Boolean preserveSyncCtx)
at System.Threading.ExecutionContext.Run(ExecutionContext executionContext, ContextCallback callback, Object state, Boolean preserveSyncCtx)
at System.Threading.ExecutionContext.Run(ExecutionContext executionContext, ContextCallback callback, Object state)
at System.Threading.ThreadHelper.ThreadStart()
Lucene.Net.Tests.dll: Lucene.Net.Index.TestIndexWriterReader.TestAddIndexesAndDoDeletesThreads (new) =================
Test(s) failed. Expected: 1200
But was: 1400
at NUnit.Framework.Assert.That(Object actual, IResolveConstraint expression, String message, Object[] args)
at NUnit.Framework.Assert.AreEqual(Int32 expected, Int32 actual)
at Lucene.Net.Index.TestIndexWriterReader.TestAddIndexesAndDoDeletesThreads() in z:\Builds\work\bcdbe6b8cc677a49\src\Lucene.Net.Tests\core\Index\TestIndexWriterReader.cs:line 438
------- Stderr: -------
at System.Collections.Generic.Dictionary`2.Insert(TKey key, TValue value, Boolean add)
at System.Collections.Generic.Dictionary`2.set_Item(TKey key, TValue value)
at Lucene.Net.Index.IndexWriter.ForceMerge(Int32 maxNumSegments, Boolean doWait) in z:\Builds\work\bcdbe6b8cc677a49\src\Lucene.Net.Core\Index\IndexWriter.cs:line 2147
at Lucene.Net.Index.IndexWriter.ForceMerge(Int32 maxNumSegments) in z:\Builds\work\bcdbe6b8cc677a49\src\Lucene.Net.Core\Index\IndexWriter.cs:line 2101
at Lucene.Net.Index.TestIndexWriterReader.AddDirectoriesThreads.DoBody(Int32 j, Directory[] dirs) in z:\Builds\work\bcdbe6b8cc677a49\src\Lucene.Net.Tests\core\Index\TestIndexWriterReader.cs:line 611
at Lucene.Net.Index.TestIndexWriterReader.AddDirectoriesThreads.ThreadAnonymousInnerClassHelper.Run() in z:\Builds\work\bcdbe6b8cc677a49\src\Lucene.Net.Tests\core\Index\TestIndexWriterReader.cs:line 590
Lucene.Net.Tests.dll: Lucene.Net.Index.TestIndexWriterReader.TestDuringAddIndexes (new) =================
Test(s) failed. Test exceeded Timeout value of 20000ms
see all newly failed tests: http://teamcity.codebetter.com/viewLog.html?buildId=180292&buildTypeId=LuceneNet_Core
Other failed tests details (only first 3 failures shown here)
==================================================================
Lucene.Net.Tests.dll: Lucene.Net.Analysis.TestLookaheadTokenFilter.TestRandomStrings =================
Test(s) failed. Test exceeded Timeout value of 20000ms
Lucene.Net.Tests.dll: Lucene.Net.Analysis.TestMockAnalyzer.TestRandomRegexps =================
Test(s) failed. Test exceeded Timeout value of 20000ms
Lucene.Net.Tests.dll: Lucene.Net.Codecs.Lucene41.TestBlockPostingsFormat2 =================
TearDown method failed. CheckIndex failed
at Lucene.Net.Util.TestUtil.CheckIndex(Directory dir, Boolean crossCheckTermVectors) in z:\Builds\work\bcdbe6b8cc677a49\src\Lucene.Net.TestFramework\Util\TestUtil.cs:line 257
at Lucene.Net.Codecs.Lucene41.TestBlockPostingsFormat2.TearDown() in z:\Builds\work\bcdbe6b8cc677a49\src\Lucene.Net.Tests\core\Codecs\Lucene41\TestBlockPostingsFormat2.cs:line 65
Changes included (2 changes)
====================================================
Change e64da2c5859ff03a6e8464079ea101ade6a6a06b by itamar (0 file):
Merge remote-tracking branch 'wwwb/long-running-test-attribute'
Change faef466f214674ef7f2e35211755bb9d327091b6 by wyatt.barnett (4 files):
Marking a few things long running. (+1 squashed commits)
Squashed commits:
[4f28661] adding LongRunningTest attribute.
see more information about changed files: http://teamcity.codebetter.com/viewLog.html?tab=buildChangesDiv&buildId=180292&buildTypeId=LuceneNet_Core
============================================================================
Configure email notifications: http://teamcity.codebetter.com/profile.html?init=1&tab=userNotifications