You are viewing a plain text version of this content. The canonical link for it is here.
Posted to builds@beam.apache.org by Apache Jenkins Server <je...@builds.apache.org> on 2023/04/22 17:18:32 UTC
Build failed in Jenkins: beam_PostCommit_Py_VR_Dataflow_V2 #4801
See <https://ci-beam.apache.org/job/beam_PostCommit_Py_VR_Dataflow_V2/4801/display/redirect>
Changes:
------------------------------------------
[...truncated 1.73 MB...]
[32mINFO [0m apache_beam.runners.dataflow.dataflow_runner:dataflow_runner.py:238 2023-04-22T17:05:18.314Z: JOB_MESSAGE_ERROR: Workflow failed.
[32mINFO [0m apache_beam.runners.dataflow.dataflow_runner:dataflow_runner.py:238 2023-04-22T17:05:28.256Z: JOB_MESSAGE_ERROR: Startup of the worker pool in zone us-central1-c failed to bring up any of the desired 1 workers. Please refer to https://cloud.google.com/dataflow/docs/guides/common-errors#worker-pool-failure for help troubleshooting. ZONE_RESOURCE_POOL_EXHAUSTED_WITH_DETAILS: Instance 'beamapp-jenkins-042215515-04220852-ike4-harness-vsg9' creation failed: The zone 'projects/apache-beam-testing/zones/us-central1-a' does not have enough resources available to fulfill the request. '(resource type:compute)'.
[32mINFO [0m apache_beam.runners.dataflow.dataflow_runner:dataflow_runner.py:238 2023-04-22T17:05:28.274Z: JOB_MESSAGE_ERROR: Workflow failed.
[32mINFO [0m apache_beam.runners.dataflow.dataflow_runner:dataflow_runner.py:238 2023-04-22T17:05:38.370Z: JOB_MESSAGE_ERROR: Startup of the worker pool in zone us-central1-c failed to bring up any of the desired 1 workers. Please refer to https://cloud.google.com/dataflow/docs/guides/common-errors#worker-pool-failure for help troubleshooting. ZONE_RESOURCE_POOL_EXHAUSTED_WITH_DETAILS: Instance 'beamapp-jenkins-042215515-04220852-ike4-harness-vsg9' creation failed: The zone 'projects/apache-beam-testing/zones/us-central1-a' does not have enough resources available to fulfill the request. '(resource type:compute)'.
[32mINFO [0m apache_beam.runners.dataflow.dataflow_runner:dataflow_runner.py:238 2023-04-22T17:05:38.397Z: JOB_MESSAGE_ERROR: Workflow failed.
[32mINFO [0m apache_beam.runners.dataflow.dataflow_runner:dataflow_runner.py:238 2023-04-22T17:05:48.287Z: JOB_MESSAGE_ERROR: Startup of the worker pool in zone us-central1-c failed to bring up any of the desired 1 workers. Please refer to https://cloud.google.com/dataflow/docs/guides/common-errors#worker-pool-failure for help troubleshooting. ZONE_RESOURCE_POOL_EXHAUSTED_WITH_DETAILS: Instance 'beamapp-jenkins-042215515-04220852-ike4-harness-vsg9' creation failed: The zone 'projects/apache-beam-testing/zones/us-central1-a' does not have enough resources available to fulfill the request. '(resource type:compute)'.
[32mINFO [0m apache_beam.runners.dataflow.dataflow_runner:dataflow_runner.py:238 2023-04-22T17:05:48.312Z: JOB_MESSAGE_ERROR: Workflow failed.
[32mINFO [0m apache_beam.runners.dataflow.dataflow_runner:dataflow_runner.py:238 2023-04-22T17:05:58.332Z: JOB_MESSAGE_ERROR: Startup of the worker pool in zone us-central1-c failed to bring up any of the desired 1 workers. Please refer to https://cloud.google.com/dataflow/docs/guides/common-errors#worker-pool-failure for help troubleshooting. ZONE_RESOURCE_POOL_EXHAUSTED_WITH_DETAILS: Instance 'beamapp-jenkins-042215515-04220852-ike4-harness-vsg9' creation failed: The zone 'projects/apache-beam-testing/zones/us-central1-a' does not have enough resources available to fulfill the request. '(resource type:compute)'.
[32mINFO [0m apache_beam.runners.dataflow.dataflow_runner:dataflow_runner.py:238 2023-04-22T17:05:58.355Z: JOB_MESSAGE_ERROR: Workflow failed.
[32mINFO [0m apache_beam.runners.dataflow.dataflow_runner:dataflow_runner.py:238 2023-04-22T17:06:08.355Z: JOB_MESSAGE_ERROR: Startup of the worker pool in zone us-central1-c failed to bring up any of the desired 1 workers. Please refer to https://cloud.google.com/dataflow/docs/guides/common-errors#worker-pool-failure for help troubleshooting. ZONE_RESOURCE_POOL_EXHAUSTED_WITH_DETAILS: Instance 'beamapp-jenkins-042215515-04220852-ike4-harness-vsg9' creation failed: The zone 'projects/apache-beam-testing/zones/us-central1-a' does not have enough resources available to fulfill the request. '(resource type:compute)'.
[32mINFO [0m apache_beam.runners.dataflow.dataflow_runner:dataflow_runner.py:238 2023-04-22T17:06:08.381Z: JOB_MESSAGE_ERROR: Workflow failed.
[32mINFO [0m apache_beam.runners.dataflow.dataflow_runner:dataflow_runner.py:238 2023-04-22T17:06:18.285Z: JOB_MESSAGE_ERROR: Startup of the worker pool in zone us-central1-c failed to bring up any of the desired 1 workers. Please refer to https://cloud.google.com/dataflow/docs/guides/common-errors#worker-pool-failure for help troubleshooting. ZONE_RESOURCE_POOL_EXHAUSTED_WITH_DETAILS: Instance 'beamapp-jenkins-042215515-04220852-ike4-harness-vsg9' creation failed: The zone 'projects/apache-beam-testing/zones/us-central1-a' does not have enough resources available to fulfill the request. '(resource type:compute)'.
[32mINFO [0m apache_beam.runners.dataflow.dataflow_runner:dataflow_runner.py:238 2023-04-22T17:06:18.308Z: JOB_MESSAGE_ERROR: Workflow failed.
[32mINFO [0m apache_beam.runners.dataflow.dataflow_runner:dataflow_runner.py:238 2023-04-22T17:06:28.367Z: JOB_MESSAGE_ERROR: Startup of the worker pool in zone us-central1-c failed to bring up any of the desired 1 workers. Please refer to https://cloud.google.com/dataflow/docs/guides/common-errors#worker-pool-failure for help troubleshooting. ZONE_RESOURCE_POOL_EXHAUSTED_WITH_DETAILS: Instance 'beamapp-jenkins-042215515-04220852-ike4-harness-vsg9' creation failed: The zone 'projects/apache-beam-testing/zones/us-central1-a' does not have enough resources available to fulfill the request. '(resource type:compute)'.
[32mINFO [0m apache_beam.runners.dataflow.dataflow_runner:dataflow_runner.py:238 2023-04-22T17:06:28.388Z: JOB_MESSAGE_ERROR: Workflow failed.
[32mINFO [0m apache_beam.runners.dataflow.dataflow_runner:dataflow_runner.py:238 2023-04-22T17:06:38.730Z: JOB_MESSAGE_ERROR: Startup of the worker pool in zone us-central1-c failed to bring up any of the desired 1 workers. Please refer to https://cloud.google.com/dataflow/docs/guides/common-errors#worker-pool-failure for help troubleshooting. ZONE_RESOURCE_POOL_EXHAUSTED_WITH_DETAILS: Instance 'beamapp-jenkins-042215515-04220852-ike4-harness-vsg9' creation failed: The zone 'projects/apache-beam-testing/zones/us-central1-a' does not have enough resources available to fulfill the request. '(resource type:compute)'.
[32mINFO [0m apache_beam.runners.dataflow.dataflow_runner:dataflow_runner.py:238 2023-04-22T17:06:38.755Z: JOB_MESSAGE_ERROR: Workflow failed.
[32mINFO [0m apache_beam.runners.dataflow.dataflow_runner:dataflow_runner.py:238 2023-04-22T17:06:48.304Z: JOB_MESSAGE_ERROR: Startup of the worker pool in zone us-central1-c failed to bring up any of the desired 1 workers. Please refer to https://cloud.google.com/dataflow/docs/guides/common-errors#worker-pool-failure for help troubleshooting. ZONE_RESOURCE_POOL_EXHAUSTED_WITH_DETAILS: Instance 'beamapp-jenkins-042215515-04220852-ike4-harness-vsg9' creation failed: The zone 'projects/apache-beam-testing/zones/us-central1-a' does not have enough resources available to fulfill the request. '(resource type:compute)'.
[32mINFO [0m apache_beam.runners.dataflow.dataflow_runner:dataflow_runner.py:238 2023-04-22T17:06:48.321Z: JOB_MESSAGE_ERROR: Workflow failed.
[32mINFO [0m apache_beam.runners.dataflow.dataflow_runner:dataflow_runner.py:238 2023-04-22T17:06:52.660Z: JOB_MESSAGE_BASIC: Cancel request is committed for workflow job: 2023-04-22_08_52_41-17456069206340375371.
[32mINFO [0m apache_beam.runners.dataflow.dataflow_runner:dataflow_runner.py:238 2023-04-22T17:06:52.689Z: JOB_MESSAGE_DETAILED: Cleaning up.
[32mINFO [0m apache_beam.runners.dataflow.dataflow_runner:dataflow_runner.py:193 Job 2023-04-22_08_52_41-17456069206340375371 is in state JOB_STATE_CANCELLING
[33m=============================== warnings summary ===============================[0m
../../build/gradleenv/2050596099/lib/python3.11/site-packages/hdfs/config.py:15
../../build/gradleenv/2050596099/lib/python3.11/site-packages/hdfs/config.py:15
../../build/gradleenv/2050596099/lib/python3.11/site-packages/hdfs/config.py:15
../../build/gradleenv/2050596099/lib/python3.11/site-packages/hdfs/config.py:15
../../build/gradleenv/2050596099/lib/python3.11/site-packages/hdfs/config.py:15
../../build/gradleenv/2050596099/lib/python3.11/site-packages/hdfs/config.py:15
../../build/gradleenv/2050596099/lib/python3.11/site-packages/hdfs/config.py:15
../../build/gradleenv/2050596099/lib/python3.11/site-packages/hdfs/config.py:15
../../build/gradleenv/2050596099/lib/python3.11/site-packages/hdfs/config.py:15
<https://ci-beam.apache.org/job/beam_PostCommit_Py_VR_Dataflow_V2/ws/src/build/gradleenv/2050596099/lib/python3.11/site-packages/hdfs/config.py>:15: DeprecationWarning: the imp module is deprecated in favour of importlib and slated for removal in Python 3.12; see the module's documentation for alternative uses
from imp import load_source
../../build/gradleenv/2050596099/lib/python3.11/site-packages/pkg_resources/__init__.py:121
../../build/gradleenv/2050596099/lib/python3.11/site-packages/pkg_resources/__init__.py:121
../../build/gradleenv/2050596099/lib/python3.11/site-packages/pkg_resources/__init__.py:121
../../build/gradleenv/2050596099/lib/python3.11/site-packages/pkg_resources/__init__.py:121
../../build/gradleenv/2050596099/lib/python3.11/site-packages/pkg_resources/__init__.py:121
../../build/gradleenv/2050596099/lib/python3.11/site-packages/pkg_resources/__init__.py:121
../../build/gradleenv/2050596099/lib/python3.11/site-packages/pkg_resources/__init__.py:121
../../build/gradleenv/2050596099/lib/python3.11/site-packages/pkg_resources/__init__.py:121
../../build/gradleenv/2050596099/lib/python3.11/site-packages/pkg_resources/__init__.py:121
<https://ci-beam.apache.org/job/beam_PostCommit_Py_VR_Dataflow_V2/ws/src/build/gradleenv/2050596099/lib/python3.11/site-packages/pkg_resources/__init__.py>:121: DeprecationWarning: pkg_resources is deprecated as an API
warnings.warn("pkg_resources is deprecated as an API", DeprecationWarning)
../../build/gradleenv/2050596099/lib/python3.11/site-packages/pkg_resources/__init__.py:2870: 162 warnings
<https://ci-beam.apache.org/job/beam_PostCommit_Py_VR_Dataflow_V2/ws/src/build/gradleenv/2050596099/lib/python3.11/site-packages/pkg_resources/__init__.py>:2870: DeprecationWarning: Deprecated call to `pkg_resources.declare_namespace('google')`.
Implementing implicit namespace packages (as specified in PEP 420) is preferred to `pkg_resources.declare_namespace`. See https://setuptools.pypa.io/en/latest/references/keywords.html#keyword-namespace-packages
declare_namespace(pkg)
../../build/gradleenv/2050596099/lib/python3.11/site-packages/pkg_resources/__init__.py:2870: 117 warnings
<https://ci-beam.apache.org/job/beam_PostCommit_Py_VR_Dataflow_V2/ws/src/build/gradleenv/2050596099/lib/python3.11/site-packages/pkg_resources/__init__.py>:2870: DeprecationWarning: Deprecated call to `pkg_resources.declare_namespace('google.cloud')`.
Implementing implicit namespace packages (as specified in PEP 420) is preferred to `pkg_resources.declare_namespace`. See https://setuptools.pypa.io/en/latest/references/keywords.html#keyword-namespace-packages
declare_namespace(pkg)
../../build/gradleenv/2050596099/lib/python3.11/site-packages/pkg_resources/__init__.py:2349: 36 warnings
<https://ci-beam.apache.org/job/beam_PostCommit_Py_VR_Dataflow_V2/ws/src/build/gradleenv/2050596099/lib/python3.11/site-packages/pkg_resources/__init__.py>:2349: DeprecationWarning: Deprecated call to `pkg_resources.declare_namespace('google')`.
Implementing implicit namespace packages (as specified in PEP 420) is preferred to `pkg_resources.declare_namespace`. See https://setuptools.pypa.io/en/latest/references/keywords.html#keyword-namespace-packages
declare_namespace(parent)
../../build/gradleenv/2050596099/lib/python3.11/site-packages/pkg_resources/__init__.py:2870
../../build/gradleenv/2050596099/lib/python3.11/site-packages/pkg_resources/__init__.py:2870
../../build/gradleenv/2050596099/lib/python3.11/site-packages/pkg_resources/__init__.py:2870
../../build/gradleenv/2050596099/lib/python3.11/site-packages/pkg_resources/__init__.py:2870
../../build/gradleenv/2050596099/lib/python3.11/site-packages/pkg_resources/__init__.py:2870
../../build/gradleenv/2050596099/lib/python3.11/site-packages/pkg_resources/__init__.py:2870
../../build/gradleenv/2050596099/lib/python3.11/site-packages/pkg_resources/__init__.py:2870
../../build/gradleenv/2050596099/lib/python3.11/site-packages/pkg_resources/__init__.py:2870
../../build/gradleenv/2050596099/lib/python3.11/site-packages/pkg_resources/__init__.py:2870
<https://ci-beam.apache.org/job/beam_PostCommit_Py_VR_Dataflow_V2/ws/src/build/gradleenv/2050596099/lib/python3.11/site-packages/pkg_resources/__init__.py>:2870: DeprecationWarning: Deprecated call to `pkg_resources.declare_namespace('google.logging')`.
Implementing implicit namespace packages (as specified in PEP 420) is preferred to `pkg_resources.declare_namespace`. See https://setuptools.pypa.io/en/latest/references/keywords.html#keyword-namespace-packages
declare_namespace(pkg)
../../build/gradleenv/2050596099/lib/python3.11/site-packages/pkg_resources/__init__.py:2870
../../build/gradleenv/2050596099/lib/python3.11/site-packages/pkg_resources/__init__.py:2870
../../build/gradleenv/2050596099/lib/python3.11/site-packages/pkg_resources/__init__.py:2870
../../build/gradleenv/2050596099/lib/python3.11/site-packages/pkg_resources/__init__.py:2870
../../build/gradleenv/2050596099/lib/python3.11/site-packages/pkg_resources/__init__.py:2870
../../build/gradleenv/2050596099/lib/python3.11/site-packages/pkg_resources/__init__.py:2870
../../build/gradleenv/2050596099/lib/python3.11/site-packages/pkg_resources/__init__.py:2870
../../build/gradleenv/2050596099/lib/python3.11/site-packages/pkg_resources/__init__.py:2870
../../build/gradleenv/2050596099/lib/python3.11/site-packages/pkg_resources/__init__.py:2870
<https://ci-beam.apache.org/job/beam_PostCommit_Py_VR_Dataflow_V2/ws/src/build/gradleenv/2050596099/lib/python3.11/site-packages/pkg_resources/__init__.py>:2870: DeprecationWarning: Deprecated call to `pkg_resources.declare_namespace('google.iam')`.
Implementing implicit namespace packages (as specified in PEP 420) is preferred to `pkg_resources.declare_namespace`. See https://setuptools.pypa.io/en/latest/references/keywords.html#keyword-namespace-packages
declare_namespace(pkg)
../../build/gradleenv/2050596099/lib/python3.11/site-packages/google/rpc/__init__.py:20
../../build/gradleenv/2050596099/lib/python3.11/site-packages/google/rpc/__init__.py:20
../../build/gradleenv/2050596099/lib/python3.11/site-packages/google/rpc/__init__.py:20
../../build/gradleenv/2050596099/lib/python3.11/site-packages/google/rpc/__init__.py:20
../../build/gradleenv/2050596099/lib/python3.11/site-packages/google/rpc/__init__.py:20
../../build/gradleenv/2050596099/lib/python3.11/site-packages/google/rpc/__init__.py:20
../../build/gradleenv/2050596099/lib/python3.11/site-packages/google/rpc/__init__.py:20
../../build/gradleenv/2050596099/lib/python3.11/site-packages/google/rpc/__init__.py:20
../../build/gradleenv/2050596099/lib/python3.11/site-packages/google/rpc/__init__.py:20
<https://ci-beam.apache.org/job/beam_PostCommit_Py_VR_Dataflow_V2/ws/src/build/gradleenv/2050596099/lib/python3.11/site-packages/google/rpc/__init__.py>:20: DeprecationWarning: Deprecated call to `pkg_resources.declare_namespace('google.rpc')`.
Implementing implicit namespace packages (as specified in PEP 420) is preferred to `pkg_resources.declare_namespace`. See https://setuptools.pypa.io/en/latest/references/keywords.html#keyword-namespace-packages
pkg_resources.declare_namespace(__name__)
../../build/gradleenv/2050596099/lib/python3.11/site-packages/google/api_core/operations_v1/abstract_operations_client.py:17
../../build/gradleenv/2050596099/lib/python3.11/site-packages/google/api_core/operations_v1/abstract_operations_client.py:17
../../build/gradleenv/2050596099/lib/python3.11/site-packages/google/api_core/operations_v1/abstract_operations_client.py:17
../../build/gradleenv/2050596099/lib/python3.11/site-packages/google/api_core/operations_v1/abstract_operations_client.py:17
../../build/gradleenv/2050596099/lib/python3.11/site-packages/google/api_core/operations_v1/abstract_operations_client.py:17
../../build/gradleenv/2050596099/lib/python3.11/site-packages/google/api_core/operations_v1/abstract_operations_client.py:17
../../build/gradleenv/2050596099/lib/python3.11/site-packages/google/api_core/operations_v1/abstract_operations_client.py:17
../../build/gradleenv/2050596099/lib/python3.11/site-packages/google/api_core/operations_v1/abstract_operations_client.py:17
<https://ci-beam.apache.org/job/beam_PostCommit_Py_VR_Dataflow_V2/ws/src/build/gradleenv/2050596099/lib/python3.11/site-packages/google/api_core/operations_v1/abstract_operations_client.py>:17: DeprecationWarning: The distutils package is deprecated and slated for removal in Python 3.12. Use setuptools or check PEP 632 for potential alternatives
from distutils import util
apache_beam/typehints/pandas_type_compatibility_test.py:67
apache_beam/typehints/pandas_type_compatibility_test.py:67
apache_beam/typehints/pandas_type_compatibility_test.py:67
apache_beam/typehints/pandas_type_compatibility_test.py:67
apache_beam/typehints/pandas_type_compatibility_test.py:67
apache_beam/typehints/pandas_type_compatibility_test.py:67
apache_beam/typehints/pandas_type_compatibility_test.py:67
apache_beam/typehints/pandas_type_compatibility_test.py:67
<https://ci-beam.apache.org/job/beam_PostCommit_Py_VR_Dataflow_V2/ws/src/sdks/python/apache_beam/typehints/pandas_type_compatibility_test.py>:67: FutureWarning: pandas.Int64Index is deprecated and will be removed from pandas in a future version. Use pandas.Index with the appropriate dtype instead.
}).set_index(pd.Int64Index(range(123, 223), name='an_index')),
apache_beam/typehints/pandas_type_compatibility_test.py:90
apache_beam/typehints/pandas_type_compatibility_test.py:90
apache_beam/typehints/pandas_type_compatibility_test.py:90
apache_beam/typehints/pandas_type_compatibility_test.py:90
apache_beam/typehints/pandas_type_compatibility_test.py:90
apache_beam/typehints/pandas_type_compatibility_test.py:90
apache_beam/typehints/pandas_type_compatibility_test.py:90
apache_beam/typehints/pandas_type_compatibility_test.py:90
<https://ci-beam.apache.org/job/beam_PostCommit_Py_VR_Dataflow_V2/ws/src/sdks/python/apache_beam/typehints/pandas_type_compatibility_test.py>:90: FutureWarning: pandas.Int64Index is deprecated and will be removed from pandas in a future version. Use pandas.Index with the appropriate dtype instead.
pd.Int64Index(range(123, 223), name='an_index'),
apache_beam/typehints/pandas_type_compatibility_test.py:91
apache_beam/typehints/pandas_type_compatibility_test.py:91
apache_beam/typehints/pandas_type_compatibility_test.py:91
apache_beam/typehints/pandas_type_compatibility_test.py:91
apache_beam/typehints/pandas_type_compatibility_test.py:91
apache_beam/typehints/pandas_type_compatibility_test.py:91
apache_beam/typehints/pandas_type_compatibility_test.py:91
apache_beam/typehints/pandas_type_compatibility_test.py:91
<https://ci-beam.apache.org/job/beam_PostCommit_Py_VR_Dataflow_V2/ws/src/sdks/python/apache_beam/typehints/pandas_type_compatibility_test.py>:91: FutureWarning: pandas.Int64Index is deprecated and will be removed from pandas in a future version. Use pandas.Index with the appropriate dtype instead.
pd.Int64Index(range(475, 575), name='another_index'),
apache_beam/ml/inference/base_test.py::RunInferenceBaseTest::test_run_inference_with_side_inputin_streaming
<https://ci-beam.apache.org/job/beam_PostCommit_Py_VR_Dataflow_V2/ws/src/sdks/python/apache_beam/ml/inference/base_test.py>:543: BeamDeprecationWarning: options is deprecated since First stable release. References to <pipeline>.options will not be supported
test_pipeline.options.view_as(StandardOptions).streaming = True
-- Docs: https://docs.pytest.org/en/stable/how-to/capture-warnings.html
- generated xml file: <https://ci-beam.apache.org/job/beam_PostCommit_Py_VR_Dataflow_V2/ws/src/sdks/python/pytest_validatesRunnerStreamingTests-df-py311-xdist.xml> -
[36m[1m=========================== short test summary info ============================[0m
[31mFAILED[0m apache_beam/transforms/ptransform_test.py::[1mPTransformTest::test_flatten_a_flattened_pcollection[0m - Failed: Timeout >4500.0s
[31mFAILED[0m apache_beam/transforms/ptransform_test.py::[1mPTransformTest::test_flatten_pcollections[0m - Failed: Timeout >4500.0s
[31mFAILED[0m apache_beam/transforms/ptransform_test.py::[1mPTransformTest::test_undeclared_outputs[0m - Failed: Timeout >4500.0s
[31m===== [31m[1m3 failed[0m, [32m31 passed[0m, [33m10 skipped[0m, [33m393 warnings[0m[31m in 5689.44s (1:34:49)[0m[31m ======[0m
> Task :sdks:python:test-suites:dataflow:py311:validatesRunnerStreamingTests FAILED
FAILURE: Build completed with 4 failures.
1: Task failed with an exception.
-----------
* Where:
Script '<https://ci-beam.apache.org/job/beam_PostCommit_Py_VR_Dataflow_V2/ws/src/sdks/python/test-suites/dataflow/common.gradle'> line: 242
* What went wrong:
Execution failed for task ':sdks:python:test-suites:dataflow:py311:validatesRunnerBatchTests'.
> Process 'command 'sh'' finished with non-zero exit value 1
* Try:
> Run with --stacktrace option to get the stack trace.
> Run with --info or --debug option to get more log output.
==============================================================================
2: Task failed with an exception.
-----------
* Where:
Script '<https://ci-beam.apache.org/job/beam_PostCommit_Py_VR_Dataflow_V2/ws/src/sdks/python/test-suites/dataflow/common.gradle'> line: 242
* What went wrong:
Execution failed for task ':sdks:python:test-suites:dataflow:py37:validatesRunnerBatchTests'.
> Process 'command 'sh'' finished with non-zero exit value 1
* Try:
> Run with --stacktrace option to get the stack trace.
> Run with --info or --debug option to get more log output.
==============================================================================
3: Task failed with an exception.
-----------
* Where:
Script '<https://ci-beam.apache.org/job/beam_PostCommit_Py_VR_Dataflow_V2/ws/src/sdks/python/test-suites/dataflow/common.gradle'> line: 265
* What went wrong:
Execution failed for task ':sdks:python:test-suites:dataflow:py37:validatesRunnerStreamingTests'.
> Process 'command 'sh'' finished with non-zero exit value 1
* Try:
> Run with --stacktrace option to get the stack trace.
> Run with --info or --debug option to get more log output.
==============================================================================
4: Task failed with an exception.
-----------
* Where:
Script '<https://ci-beam.apache.org/job/beam_PostCommit_Py_VR_Dataflow_V2/ws/src/sdks/python/test-suites/dataflow/common.gradle'> line: 265
* What went wrong:
Execution failed for task ':sdks:python:test-suites:dataflow:py311:validatesRunnerStreamingTests'.
> Process 'command 'sh'' finished with non-zero exit value 1
* Try:
> Run with --stacktrace option to get the stack trace.
> Run with --info or --debug option to get more log output.
==============================================================================
* Get more help at https://help.gradle.org
Deprecated Gradle features were used in this build, making it incompatible with Gradle 8.0.
You can use '--warning-mode all' to show the individual deprecation warnings and determine if they come from your own scripts or plugins.
See https://docs.gradle.org/7.5.1/userguide/command_line_interface.html#sec:command_line_warnings
BUILD FAILED in 2h 10m 6s
24 actionable tasks: 18 executed, 4 from cache, 2 up-to-date
Build scan background action failed.
java.lang.IllegalArgumentException: com.gradle.enterprise.gradleplugin.internal.extension.a is not an interface
at java.lang.reflect.Proxy$ProxyClassFactory.apply(Proxy.java:590)
at java.lang.reflect.Proxy$ProxyClassFactory.apply(Proxy.java:557)
at java.lang.reflect.WeakCache$Factory.get(WeakCache.java:230)
at java.lang.reflect.WeakCache.get(WeakCache.java:127)
at java.lang.reflect.Proxy.getProxyClass0(Proxy.java:419)
at java.lang.reflect.Proxy.newProxyInstance(Proxy.java:719)
at com.gradle.ProxyFactory$ProxyingInvocationHandler.createLocalProxy(ProxyFactory.java:64)
at com.gradle.ProxyFactory$ProxyingInvocationHandler.lambda$adaptActionArg$1(ProxyFactory.java:59)
at com.gradle.enterprise.gradleplugin.internal.extension.b$3.run(SourceFile:100)
at java.util.concurrent.Executors$RunnableAdapter.call(Executors.java:511)
at java.util.concurrent.FutureTask.run(FutureTask.java:266)
at java.util.concurrent.ThreadPoolExecutor.runWorker(ThreadPoolExecutor.java:1149)
at java.util.concurrent.ThreadPoolExecutor$Worker.run(ThreadPoolExecutor.java:624)
at java.lang.Thread.run(Thread.java:750)
Publishing build scan...
https://gradle.com/s/zqlqz3e23m2aq
Build step 'Invoke Gradle script' changed build result to FAILURE
Build step 'Invoke Gradle script' marked build as failure
---------------------------------------------------------------------
To unsubscribe, e-mail: builds-unsubscribe@beam.apache.org
For additional commands, e-mail: builds-help@beam.apache.org
Jenkins build is back to normal : beam_PostCommit_Py_VR_Dataflow_V2 #4802
Posted by Apache Jenkins Server <je...@builds.apache.org>.
See <https://ci-beam.apache.org/job/beam_PostCommit_Py_VR_Dataflow_V2/4802/display/redirect>
---------------------------------------------------------------------
To unsubscribe, e-mail: builds-unsubscribe@beam.apache.org
For additional commands, e-mail: builds-help@beam.apache.org