You are viewing a plain text version of this content. The canonical link for it is here.
Posted to yarn-dev@hadoop.apache.org by Apache Jenkins Server <je...@builds.apache.org> on 2015/05/27 01:11:09 UTC
Failed: YARN-3626 PreCommit Build #8090
Jira: https://issues.apache.org/jira/browse/YARN-3626
Build: https://builds.apache.org/job/PreCommit-YARN-Build/8090/
###################################################################################
########################## LAST 60 LINES OF THE CONSOLE ###########################
[...truncated 308 lines...]
| | | | eclipse:eclipse.
| +1 | findbugs | 4m 23s | The patch does not introduce any
| | | | new Findbugs (version 3.0.0)
| | | | warnings.
| +1 | mapreduce tests | 9m 59s | Tests passed in
| | | | hadoop-mapreduce-client-app.
| +1 | mapreduce tests | 0m 45s | Tests passed in
| | | | hadoop-mapreduce-client-common.
| +1 | yarn tests | 0m 23s | Tests passed in hadoop-yarn-api.
| +1 | yarn tests | 6m 10s | Tests passed in
| | | | hadoop-yarn-server-nodemanager.
| | | 60m 8s |
|| Subsystem || Report/Notes ||
============================================================================
| Patch URL | http://issues.apache.org/jira/secure/attachment/12735424/YARN-3626.16.patch |
| Optional Tests | javadoc javac unit findbugs checkstyle |
| git revision | trunk / 7dba700 |
| checkstyle | /home/jenkins/jenkins-slave/workspace/PreCommit-YARN-Build/patchprocess/diffcheckstylehadoop-yarn-api.txt |
| hadoop-mapreduce-client-app test log | /home/jenkins/jenkins-slave/workspace/PreCommit-YARN-Build/patchprocess/testrun_hadoop-mapreduce-client-app.txt |
| hadoop-mapreduce-client-common test log | /home/jenkins/jenkins-slave/workspace/PreCommit-YARN-Build/patchprocess/testrun_hadoop-mapreduce-client-common.txt |
| hadoop-yarn-api test log | /home/jenkins/jenkins-slave/workspace/PreCommit-YARN-Build/patchprocess/testrun_hadoop-yarn-api.txt |
| hadoop-yarn-server-nodemanager test log | /home/jenkins/jenkins-slave/workspace/PreCommit-YARN-Build/patchprocess/testrun_hadoop-yarn-server-nodemanager.txt |
| Test Results | https://builds.apache.org/job/PreCommit-YARN-Build/8090/testReport/ |
| Java | 1.7.0_55 |
| uname | Linux asf904.gq1.ygridcore.net 3.13.0-36-lowlatency #63-Ubuntu SMP PREEMPT Wed Sep 3 21:56:12 UTC 2014 x86_64 x86_64 x86_64 GNU/Linux |
============================================================================
============================================================================
Adding comment to JIRA
============================================================================
============================================================================
Comment added.
4e5f215970e91d3215ca2eccc713073c6e0889bc logged out
============================================================================
============================================================================
Finished build.
============================================================================
============================================================================
Build step 'Execute shell' marked build as failure
Archiving artifacts
Sending artifact delta relative to PreCommit-YARN-Build #8088
Archived 52 artifacts
Archive block size is 32768
Received 560 blocks and 16981489 bytes
Compression is 51.9%
Took 10 sec
[description-setter] Could not determine description.
Recording test results
Email was triggered for: Failure
Sending email for trigger: Failure
###################################################################################
############################## FAILED TESTS (if any) ##############################
All tests passed
Success: YARN-3722 PreCommit Build #8095
Posted by Apache Jenkins Server <je...@builds.apache.org>.
Jira: https://issues.apache.org/jira/browse/YARN-3722
Build: https://builds.apache.org/job/PreCommit-YARN-Build/8095/
###################################################################################
########################## LAST 60 LINES OF THE CONSOLE ###########################
[...truncated 249 lines...]
| +1 | javac | 7m 28s | There were no new javac warning
| | | | messages.
| +1 | release audit | 0m 20s | The applied patch does not increase
| | | | the total number of release audit
| | | | warnings.
| +1 | checkstyle | 0m 29s | There were no new checkstyle
| | | | issues.
| +1 | whitespace | 0m 0s | The patch has no lines that end in
| | | | whitespace.
| +1 | install | 1m 32s | mvn install still works.
| +1 | eclipse:eclipse | 0m 33s | The patch built with
| | | | eclipse:eclipse.
| +1 | findbugs | 1m 23s | The patch does not introduce any
| | | | new Findbugs (version 3.0.0)
| | | | warnings.
| +1 | yarn tests | 1m 55s | Tests passed in hadoop-yarn-common.
| | | 18m 56s |
|| Subsystem || Report/Notes ||
============================================================================
| Patch URL | http://issues.apache.org/jira/secure/attachment/12735502/YARN-3722.001.patch |
| Optional Tests | javac unit findbugs checkstyle |
| git revision | trunk / cdbd66b |
| hadoop-yarn-common test log | /home/jenkins/jenkins-slave/workspace/PreCommit-YARN-Build/patchprocess/testrun_hadoop-yarn-common.txt |
| Test Results | https://builds.apache.org/job/PreCommit-YARN-Build/8095/testReport/ |
| Java | 1.7.0_55 |
| uname | Linux asf905.gq1.ygridcore.net 3.13.0-36-lowlatency #63-Ubuntu SMP PREEMPT Wed Sep 3 21:56:12 UTC 2014 x86_64 x86_64 x86_64 GNU/Linux |
============================================================================
============================================================================
Adding comment to JIRA
============================================================================
============================================================================
Comment added.
9050a13151f7167f4e27a0afbb60848bceba6f76 logged out
============================================================================
============================================================================
Finished build.
============================================================================
============================================================================
Archiving artifacts
Sending artifact delta relative to PreCommit-YARN-Build #8088
Archived 22 artifacts
Archive block size is 32768
Received 50 blocks and 2783883 bytes
Compression is 37.0%
Took 5.3 sec
Description set: YARN-3722
Recording test results
Email was triggered for: Success
Sending email for trigger: Success
###################################################################################
############################## FAILED TESTS (if any) ##############################
All tests passed
Failed: YARN-3721 PreCommit Build #8094
Posted by Apache Jenkins Server <je...@builds.apache.org>.
Jira: https://issues.apache.org/jira/browse/YARN-3721
Build: https://builds.apache.org/job/PreCommit-YARN-Build/8094/
###################################################################################
########################## LAST 60 LINES OF THE CONSOLE ###########################
[...truncated 235 lines...]
| | | | messages.
| +1 | release audit | 0m 22s | The applied patch does not increase
| | | | the total number of release audit
| | | | warnings.
| +1 | whitespace | 0m 0s | The patch has no lines that end in
| | | | whitespace.
| +1 | install | 1m 38s | mvn install still works.
| +1 | eclipse:eclipse | 0m 40s | The patch built with
| | | | eclipse:eclipse.
| -1 | yarn tests | 1m 11s | Tests failed in
| | | | hadoop-yarn-server-timelineservice.
| | | 36m 42s |
Reason | Tests
Failed unit tests | hadoop.yarn.server.timelineservice.storage.TestHBaseTimelineWriterImpl
|| Subsystem || Report/Notes ||
============================================================================
| Patch URL | http://issues.apache.org/jira/secure/attachment/12735496/YARN-3721-YARN-2928.001.patch |
| Optional Tests | javadoc javac unit |
| git revision | YARN-2928 / e19566a |
| hadoop-yarn-server-timelineservice test log | /home/jenkins/jenkins-slave/workspace/PreCommit-YARN-Build/patchprocess/testrun_hadoop-yarn-server-timelineservice.txt |
| Test Results | https://builds.apache.org/job/PreCommit-YARN-Build/8094/testReport/ |
| Java | 1.7.0_55 |
| uname | Linux asf905.gq1.ygridcore.net 3.13.0-36-lowlatency #63-Ubuntu SMP PREEMPT Wed Sep 3 21:56:12 UTC 2014 x86_64 x86_64 x86_64 GNU/Linux |
============================================================================
============================================================================
Adding comment to JIRA
============================================================================
============================================================================
Comment added.
be94d5e66f5b3c1302c5f02825771bc6847b2cd2 logged out
============================================================================
============================================================================
Finished build.
============================================================================
============================================================================
Build step 'Execute shell' marked build as failure
Archiving artifacts
Sending artifact delta relative to PreCommit-YARN-Build #8088
Archived 16 artifacts
Archive block size is 32768
Received 35 blocks and 8292154 bytes
Compression is 12.2%
Took 5.4 sec
[description-setter] Could not determine description.
Recording test results
Email was triggered for: Failure
Sending email for trigger: Failure
###################################################################################
############################## FAILED TESTS (if any) ##############################
1 tests failed.
FAILED: org.apache.hadoop.yarn.server.timelineservice.storage.TestHBaseTimelineWriterImpl.testWriteEntityToHBase
Error Message:
expected:<1> but was:<6>
Stack Trace:
java.lang.AssertionError: expected:<1> but was:<6>
at org.junit.Assert.fail(Assert.java:88)
at org.junit.Assert.failNotEquals(Assert.java:743)
at org.junit.Assert.assertEquals(Assert.java:118)
at org.junit.Assert.assertEquals(Assert.java:555)
at org.junit.Assert.assertEquals(Assert.java:542)
at org.apache.hadoop.yarn.server.timelineservice.storage.TestHBaseTimelineWriterImpl.checkMetricsTimeseries(TestHBaseTimelineWriterImpl.java:219)
at org.apache.hadoop.yarn.server.timelineservice.storage.TestHBaseTimelineWriterImpl.testWriteEntityToHBase(TestHBaseTimelineWriterImpl.java:204)
Failed: YARN-3467 PreCommit Build #8093
Posted by Apache Jenkins Server <je...@builds.apache.org>.
Jira: https://issues.apache.org/jira/browse/YARN-3467
Build: https://builds.apache.org/job/PreCommit-YARN-Build/8093/
###################################################################################
########################## LAST 60 LINES OF THE CONSOLE ###########################
Started by remote host 127.0.0.1
Building remotely on H5 (Mapreduce Falcon Hadoop Pig Zookeeper Tez Hdfs) in workspace /home/jenkins/jenkins-slave/workspace/PreCommit-YARN-Build
> git rev-parse --is-inside-work-tree # timeout=10
Fetching changes from the remote Git repository
> git config remote.origin.url https://git-wip-us.apache.org/repos/asf/hadoop.git # timeout=10
Fetching upstream changes from https://git-wip-us.apache.org/repos/asf/hadoop.git
> git --version # timeout=10
> git fetch --tags --progress https://git-wip-us.apache.org/repos/asf/hadoop.git +refs/heads/*:refs/remotes/origin/*
> git rev-parse refs/remotes/origin/trunk^{commit} # timeout=10
> git rev-parse refs/remotes/origin/origin/trunk^{commit} # timeout=10
Checking out Revision cdbd66be111c93c85a409d47284e588c453ecae9 (refs/remotes/origin/trunk)
> git config core.sparsecheckout # timeout=10
> git checkout -f cdbd66be111c93c85a409d47284e588c453ecae9
> git rev-list cdbd66be111c93c85a409d47284e588c453ecae9 # timeout=10
Cleaning workspace
> git rev-parse --verify HEAD # timeout=10
Resetting working tree
> git reset --hard # timeout=10
> git clean -fdx # timeout=10
No emails were triggered.
[PreCommit-YARN-Build] $ /bin/bash /tmp/hudson5882781859635409756.sh
============================================================================
============================================================================
Bootstrapping test harness
============================================================================
============================================================================
Running in Jenkins mode
YARN-3467 patch is being downloaded at Wed May 27 00:50:28 UTC 2015 from
http://issues.apache.org/jira/secure/attachment/12735488/Screen%20Shot%202015-05-26%20at%205.46.54%20PM.png
ERROR: http://issues.apache.org/jira/secure/attachment/12735488/Screen%20Shot%202015-05-26%20at%205.46.54%20PM.png is not a patch file.
============================================================================
============================================================================
Finished build.
============================================================================
============================================================================
Build step 'Execute shell' marked build as failure
Archiving artifacts
Sending artifact delta relative to PreCommit-YARN-Build #8088
Archived 2 artifacts
Archive block size is 32768
Received 0 blocks and 427439 bytes
Compression is 0.0%
Took 2.2 sec
[description-setter] Could not determine description.
Recording test results
Email was triggered for: Failure
Sending email for trigger: Failure
###################################################################################
############################## FAILED TESTS (if any) ##############################
No tests ran.
Failed: YARN-3700 PreCommit Build #8092
Posted by Apache Jenkins Server <je...@builds.apache.org>.
Jira: https://issues.apache.org/jira/browse/YARN-3700
Build: https://builds.apache.org/job/PreCommit-YARN-Build/8092/
###################################################################################
########################## LAST 60 LINES OF THE CONSOLE ###########################
[...truncated 327 lines...]
| | | | eclipse:eclipse.
| +1 | findbugs | 4m 28s | The patch does not introduce any
| | | | new Findbugs (version 3.0.0)
| | | | warnings.
| +1 | yarn tests | 0m 25s | Tests passed in hadoop-yarn-api.
| +1 | yarn tests | 1m 57s | Tests passed in hadoop-yarn-common.
| +1 | yarn tests | 3m 6s | Tests passed in
| | | | hadoop-yarn-server-applicationhistory
| | | | service.
| +1 | yarn tests | 0m 23s | Tests passed in
| | | | hadoop-yarn-server-common.
| | | 55m 32s |
|| Subsystem || Report/Notes ||
============================================================================
| Patch URL | http://issues.apache.org/jira/secure/attachment/12735457/YARN-3700.3.patch |
| Optional Tests | javadoc javac unit findbugs checkstyle site |
| git revision | trunk / cdbd66b |
| checkstyle | /home/jenkins/jenkins-slave/workspace/PreCommit-YARN-Build/patchprocess/diffcheckstylehadoop-yarn-api.txt |
| hadoop-yarn-api test log | /home/jenkins/jenkins-slave/workspace/PreCommit-YARN-Build/patchprocess/testrun_hadoop-yarn-api.txt |
| hadoop-yarn-common test log | /home/jenkins/jenkins-slave/workspace/PreCommit-YARN-Build/patchprocess/testrun_hadoop-yarn-common.txt |
| hadoop-yarn-server-applicationhistoryservice test log | /home/jenkins/jenkins-slave/workspace/PreCommit-YARN-Build/patchprocess/testrun_hadoop-yarn-server-applicationhistoryservice.txt |
| hadoop-yarn-server-common test log | /home/jenkins/jenkins-slave/workspace/PreCommit-YARN-Build/patchprocess/testrun_hadoop-yarn-server-common.txt |
| Test Results | https://builds.apache.org/job/PreCommit-YARN-Build/8092/testReport/ |
| Java | 1.7.0_55 |
| uname | Linux asf903.gq1.ygridcore.net 3.13.0-36-lowlatency #63-Ubuntu SMP PREEMPT Wed Sep 3 21:56:12 UTC 2014 x86_64 x86_64 x86_64 GNU/Linux |
============================================================================
============================================================================
Adding comment to JIRA
============================================================================
============================================================================
Comment added.
adbc8107a8d2c1820c1b882bb8bc4339089bd52b logged out
============================================================================
============================================================================
Finished build.
============================================================================
============================================================================
Build step 'Execute shell' marked build as failure
Archiving artifacts
Sending artifact delta relative to PreCommit-YARN-Build #8088
Archived 54 artifacts
Archive block size is 32768
Received 809 blocks and 5880408 bytes
Compression is 81.8%
Took 3.8 sec
[description-setter] Could not determine description.
Recording test results
Email was triggered for: Failure
Sending email for trigger: Failure
###################################################################################
############################## FAILED TESTS (if any) ##############################
All tests passed
Failed: YARN-3682 PreCommit Build #8091
Posted by Apache Jenkins Server <je...@builds.apache.org>.
Jira: https://issues.apache.org/jira/browse/YARN-3682
Build: https://builds.apache.org/job/PreCommit-YARN-Build/8091/
###################################################################################
########################## LAST 60 LINES OF THE CONSOLE ###########################
[...truncated 143 lines...]
-1 overall
| Vote | Subsystem | Runtime | Comment
============================================================================
| 0 | patch | 0m 1s | The patch file was not named
| | | | according to hadoop's naming
| | | | conventions. Please see
| | | | https://wiki.apache.org/hadoop/HowToCo
| | | | ntribute for instructions.
| 0 | pre-patch | 14m 36s | Pre-patch trunk compilation is
| | | | healthy.
| +1 | @author | 0m 0s | The patch does not contain any
| | | | @author tags.
| +1 | tests included | 0m 0s | The patch appears to include 3 new
| | | | or modified test files.
| -1 | javac | 2m 54s | The patch appears to cause the build
| | | | to fail.
|| Subsystem || Report/Notes ||
============================================================================
| Patch URL | http://issues.apache.org/jira/secure/attachment/12735438/YARN-3682-20150526.txt |
| Optional Tests | javadoc javac unit findbugs checkstyle |
| git revision | trunk / cdbd66b |
============================================================================
============================================================================
Adding comment to JIRA
============================================================================
============================================================================
Comment added.
c88cb8f27cc065c6edc45dd59355c65ca80c75a0 logged out
============================================================================
============================================================================
Finished build.
============================================================================
============================================================================
Build step 'Execute shell' marked build as failure
Archiving artifacts
Sending artifact delta relative to PreCommit-YARN-Build #8088
Archived 9 artifacts
Archive block size is 32768
Received 37 blocks and 3439192 bytes
Compression is 26.1%
Took 3.1 sec
[description-setter] Could not determine description.
Recording test results
Email was triggered for: Failure
Sending email for trigger: Failure
###################################################################################
############################## FAILED TESTS (if any) ##############################
No tests ran.