You are viewing a plain text version of this content. The canonical link for it is here.
Posted to commits@kylin.apache.org by Apache Jenkins Server <je...@builds.apache.org> on 2016/12/28 16:43:43 UTC
Build failed in Jenkins: Kylin-Master-SonarQube #4
See <https://builds.apache.org/job/Kylin-Master-SonarQube/4/>
------------------------------------------
[...truncated 604 lines...]
[INFO] Downloading: http://repo.maven.apache.org/maven2/com/101tec/zkclient/0.9/zkclient-0.9.jar
[INFO] Downloaded: http://repo.maven.apache.org/maven2/net/sf/jopt-simple/jopt-simple/4.9/jopt-simple-4.9.jar (65 KB at 3606.2 KB/sec)
[INFO] Downloaded: http://repo.maven.apache.org/maven2/com/101tec/zkclient/0.9/zkclient-0.9.jar (73 KB at 4051.9 KB/sec)
[INFO] Downloaded: http://repo.maven.apache.org/maven2/org/apache/kafka/kafka-clients/0.10.1.0/kafka-clients-0.10.1.0.jar (781 KB at 22947.4 KB/sec)
[INFO] Downloaded: http://repo.maven.apache.org/maven2/org/apache/kafka/kafka_2.10/0.10.1.0/kafka_2.10-0.10.1.0.jar (5392 KB at 25797.0 KB/sec)
[INFO]
[INFO] --- maven-clean-plugin:2.5:clean (default-clean) @ kylin-source-kafka ---
[INFO]
[INFO] --- maven-checkstyle-plugin:2.17:check (check-style) @ kylin-source-kafka ---
[INFO] Starting audit...
Audit done.
[INFO]
[INFO] --- maven-remote-resources-plugin:1.5:process (default) @ kylin-source-kafka ---
[INFO]
[INFO] --- maven-resources-plugin:3.0.1:resources (default-resources) @ kylin-source-kafka ---
[INFO] Using 'UTF-8' encoding to copy filtered resources.
[INFO] skip non existing resourceDirectory <https://builds.apache.org/job/Kylin-Master-SonarQube/ws/source-kafka/src/main/resources>
[INFO] Copying 3 resources
[INFO]
[INFO] --- maven-compiler-plugin:3.5.1:compile (default-compile) @ kylin-source-kafka ---
[INFO] Changes detected - recompiling the module!
[INFO] Compiling 23 source files to <https://builds.apache.org/job/Kylin-Master-SonarQube/ws/source-kafka/target/classes>
[INFO]
[INFO] ------------------------------------------------------------------------
[INFO] Skipping Apache Kylin - Query
[INFO] This project has been banned from the build due to previous failures.
[INFO] ------------------------------------------------------------------------
[INFO]
[INFO] ------------------------------------------------------------------------
[INFO] Skipping Apache Kylin - Tool
[INFO] This project has been banned from the build due to previous failures.
[INFO] ------------------------------------------------------------------------
[INFO]
[INFO] ------------------------------------------------------------------------
[INFO] Skipping Apache Kylin - REST Server Base
[INFO] This project has been banned from the build due to previous failures.
[INFO] ------------------------------------------------------------------------
[INFO]
[INFO] ------------------------------------------------------------------------
[INFO] Skipping Apache Kylin - REST Server
[INFO] This project has been banned from the build due to previous failures.
[INFO] ------------------------------------------------------------------------
[INFO]
[INFO] ------------------------------------------------------------------------
[INFO] Building Apache Kylin - JDBC Driver 1.6.1-SNAPSHOT
[INFO] ------------------------------------------------------------------------
[INFO] Downloading: http://repo.maven.apache.org/maven2/com/google/protobuf/protobuf-java/3.0.0-beta-1/protobuf-java-3.0.0-beta-1.pom
[INFO] Downloaded: http://repo.maven.apache.org/maven2/com/google/protobuf/protobuf-java/3.0.0-beta-1/protobuf-java-3.0.0-beta-1.pom (15 KB at 917.8 KB/sec)
[INFO] Downloading: http://repo.maven.apache.org/maven2/com/google/protobuf/protobuf-java/3.0.0-beta-1/protobuf-java-3.0.0-beta-1.jar
[INFO] Downloaded: http://repo.maven.apache.org/maven2/com/google/protobuf/protobuf-java/3.0.0-beta-1/protobuf-java-3.0.0-beta-1.jar (994 KB at 21136.4 KB/sec)
[INFO]
[INFO] --- maven-clean-plugin:2.5:clean (default-clean) @ kylin-jdbc ---
[INFO]
[INFO] --- maven-checkstyle-plugin:2.17:check (check-style) @ kylin-jdbc ---
[INFO] Starting audit...
Audit done.
[INFO]
[INFO] --- maven-remote-resources-plugin:1.5:process (default) @ kylin-jdbc ---
[INFO]
[INFO] --- maven-resources-plugin:3.0.1:resources (default-resources) @ kylin-jdbc ---
[INFO] Using 'UTF-8' encoding to copy filtered resources.
[INFO] Copying 1 resource
[INFO] Copying 3 resources
[INFO]
[INFO] --- maven-compiler-plugin:3.5.1:compile (default-compile) @ kylin-jdbc ---
[INFO] Changes detected - recompiling the module!
[INFO] Compiling 14 source files to <https://builds.apache.org/job/Kylin-Master-SonarQube/ws/jdbc/target/classes>
[INFO]
[INFO] ------------------------------------------------------------------------
[INFO] Skipping Apache Kylin - Assembly
[INFO] This project has been banned from the build due to previous failures.
[INFO] ------------------------------------------------------------------------
[INFO]
[INFO] ------------------------------------------------------------------------
[INFO] Skipping Apache Kylin - Integration Test
[INFO] This project has been banned from the build due to previous failures.
[INFO] ------------------------------------------------------------------------
[INFO]
[INFO] ------------------------------------------------------------------------
[INFO] Building Apache Kylin - Tomcat Extension 1.6.1-SNAPSHOT
[INFO] ------------------------------------------------------------------------
[INFO] Downloading: http://repo.maven.apache.org/maven2/org/apache/tomcat/tomcat-catalina/7.0.69/tomcat-catalina-7.0.69.pom
[INFO] Downloaded: http://repo.maven.apache.org/maven2/org/apache/tomcat/tomcat-catalina/7.0.69/tomcat-catalina-7.0.69.pom (3 KB at 153.6 KB/sec)
[INFO] Downloading: http://repo.maven.apache.org/maven2/org/apache/tomcat/tomcat-servlet-api/7.0.69/tomcat-servlet-api-7.0.69.pom
[INFO] Downloaded: http://repo.maven.apache.org/maven2/org/apache/tomcat/tomcat-servlet-api/7.0.69/tomcat-servlet-api-7.0.69.pom (2 KB at 133.0 KB/sec)
[INFO] Downloading: http://repo.maven.apache.org/maven2/org/apache/tomcat/tomcat-juli/7.0.69/tomcat-juli-7.0.69.pom
[INFO] Downloaded: http://repo.maven.apache.org/maven2/org/apache/tomcat/tomcat-juli/7.0.69/tomcat-juli-7.0.69.pom (2 KB at 92.5 KB/sec)
[INFO] Downloading: http://repo.maven.apache.org/maven2/org/apache/tomcat/tomcat-annotations-api/7.0.69/tomcat-annotations-api-7.0.69.pom
[INFO] Downloaded: http://repo.maven.apache.org/maven2/org/apache/tomcat/tomcat-annotations-api/7.0.69/tomcat-annotations-api-7.0.69.pom (2 KB at 92.7 KB/sec)
[INFO] Downloading: http://repo.maven.apache.org/maven2/org/apache/tomcat/tomcat-api/7.0.69/tomcat-api-7.0.69.pom
[INFO] Downloaded: http://repo.maven.apache.org/maven2/org/apache/tomcat/tomcat-api/7.0.69/tomcat-api-7.0.69.pom (2 KB at 110.5 KB/sec)
[INFO] Downloading: http://repo.maven.apache.org/maven2/org/apache/tomcat/tomcat-util/7.0.69/tomcat-util-7.0.69.pom
[INFO] Downloaded: http://repo.maven.apache.org/maven2/org/apache/tomcat/tomcat-util/7.0.69/tomcat-util-7.0.69.pom (2 KB at 122.2 KB/sec)
[INFO] Downloading: http://repo.maven.apache.org/maven2/org/apache/tomcat/tomcat-catalina/7.0.69/tomcat-catalina-7.0.69.jar
[INFO] Downloading: http://repo.maven.apache.org/maven2/org/apache/tomcat/tomcat-servlet-api/7.0.69/tomcat-servlet-api-7.0.69.jar
[INFO] Downloading: http://repo.maven.apache.org/maven2/org/apache/tomcat/tomcat-juli/7.0.69/tomcat-juli-7.0.69.jar
[INFO] Downloading: http://repo.maven.apache.org/maven2/org/apache/tomcat/tomcat-annotations-api/7.0.69/tomcat-annotations-api-7.0.69.jar
[INFO] Downloading: http://repo.maven.apache.org/maven2/org/apache/tomcat/tomcat-api/7.0.69/tomcat-api-7.0.69.jar
[INFO] Downloaded: http://repo.maven.apache.org/maven2/org/apache/tomcat/tomcat-juli/7.0.69/tomcat-juli-7.0.69.jar (38 KB at 2194.3 KB/sec)
[INFO] Downloading: http://repo.maven.apache.org/maven2/org/apache/tomcat/tomcat-util/7.0.69/tomcat-util-7.0.69.jar
[INFO] Downloaded: http://repo.maven.apache.org/maven2/org/apache/tomcat/tomcat-api/7.0.69/tomcat-api-7.0.69.jar (7 KB at 398.1 KB/sec)
[INFO] Downloaded: http://repo.maven.apache.org/maven2/org/apache/tomcat/tomcat-annotations-api/7.0.69/tomcat-annotations-api-7.0.69.jar (16 KB at 917.9 KB/sec)
[INFO] Downloaded: http://repo.maven.apache.org/maven2/org/apache/tomcat/tomcat-servlet-api/7.0.69/tomcat-servlet-api-7.0.69.jar (194 KB at 9208.4 KB/sec)
[INFO] Downloaded: http://repo.maven.apache.org/maven2/org/apache/tomcat/tomcat-util/7.0.69/tomcat-util-7.0.69.jar (34 KB at 1149.9 KB/sec)
[INFO] Downloaded: http://repo.maven.apache.org/maven2/org/apache/tomcat/tomcat-catalina/7.0.69/tomcat-catalina-7.0.69.jar (1622 KB at 24564.3 KB/sec)
[INFO]
[INFO] --- maven-clean-plugin:2.5:clean (default-clean) @ kylin-tomcat-ext ---
[INFO]
[INFO] --- maven-checkstyle-plugin:2.17:check (check-style) @ kylin-tomcat-ext ---
[INFO] Starting audit...
Audit done.
[INFO]
[INFO] --- maven-remote-resources-plugin:1.5:process (default) @ kylin-tomcat-ext ---
[INFO]
[INFO] --- maven-resources-plugin:3.0.1:resources (default-resources) @ kylin-tomcat-ext ---
[INFO] Using 'UTF-8' encoding to copy filtered resources.
[INFO] skip non existing resourceDirectory <https://builds.apache.org/job/Kylin-Master-SonarQube/ws/tomcat-ext/src/main/resources>
[INFO] Copying 3 resources
[INFO]
[INFO] --- maven-compiler-plugin:3.5.1:compile (default-compile) @ kylin-tomcat-ext ---
[INFO] Changes detected - recompiling the module!
[INFO] Compiling 1 source file to <https://builds.apache.org/job/Kylin-Master-SonarQube/ws/tomcat-ext/target/classes>
[INFO] ------------------------------------------------------------------------
[INFO] Reactor Summary:
[INFO]
[INFO] Apache Kylin ....................................... SUCCESS [ 2.899 s]
[INFO] Apache Kylin - Calcite Overrides ................... SUCCESS [ 4.828 s]
[INFO] Apache Kylin - Core Common ......................... SUCCESS [ 4.742 s]
[INFO] Apache Kylin - Core Metadata ....................... SUCCESS [ 6.426 s]
[INFO] Apache Kylin - Core Dictionary ..................... SUCCESS [ 4.487 s]
[INFO] Apache Kylin - Core Cube ........................... SUCCESS [ 5.240 s]
[INFO] Apache Kylin - Core Job ............................ SUCCESS [ 2.954 s]
[INFO] Apache Kylin - Core Storage ........................ SUCCESS [ 2.677 s]
[INFO] Apache Kylin - MapReduce Engine .................... SUCCESS [ 6.170 s]
[INFO] Apache Kylin - HBase Storage ....................... FAILURE [ 1.766 s]
[INFO] Apache Kylin - Spark Engine ........................ SKIPPED
[INFO] Apache Kylin - Hive Source ......................... SUCCESS [ 5.958 s]
[INFO] Apache Kylin - Kafka Source ........................ SUCCESS [ 4.271 s]
[INFO] Apache Kylin - Query ............................... SKIPPED
[INFO] Apache Kylin - Tool ................................ SKIPPED
[INFO] Apache Kylin - REST Server Base .................... SKIPPED
[INFO] Apache Kylin - REST Server ......................... SKIPPED
[INFO] Apache Kylin - JDBC Driver ......................... SUCCESS [ 2.159 s]
[INFO] Apache Kylin - Assembly ............................ SKIPPED
[INFO] Apache Kylin - Integration Test .................... SKIPPED
[INFO] Apache Kylin - Tomcat Extension .................... SUCCESS [ 1.573 s]
[INFO] ------------------------------------------------------------------------
[INFO] BUILD FAILURE
[INFO] ------------------------------------------------------------------------
[INFO] Total time: 01:08 min
[INFO] Finished at: 2016-12-28T16:43:39+00:00
[INFO] Final Memory: 41M/490M
[INFO] ------------------------------------------------------------------------
Waiting for Jenkins to finish collecting data
[ERROR] Failed to execute goal on project kylin-storage-hbase: Could not resolve dependencies for project org.apache.kylin:kylin-storage-hbase:jar:1.6.1-SNAPSHOT: Could not find artifact org.apache.kylin:kylin-core-storage:jar:tests:1.6.1-SNAPSHOT in conjars (http://conjars.org/repo/) -> [Help 1]
org.apache.maven.lifecycle.LifecycleExecutionException: Failed to execute goal on project kylin-storage-hbase: Could not resolve dependencies for project org.apache.kylin:kylin-storage-hbase:jar:1.6.1-SNAPSHOT: Could not find artifact org.apache.kylin:kylin-core-storage:jar:tests:1.6.1-SNAPSHOT in conjars (http://conjars.org/repo/)
at org.apache.maven.lifecycle.internal.LifecycleDependencyResolver.getDependencies(LifecycleDependencyResolver.java:221)
at org.apache.maven.lifecycle.internal.LifecycleDependencyResolver.resolveProjectDependencies(LifecycleDependencyResolver.java:127)
at org.apache.maven.lifecycle.internal.MojoExecutor.ensureDependenciesAreResolved(MojoExecutor.java:245)
at org.apache.maven.lifecycle.internal.MojoExecutor.execute(MojoExecutor.java:199)
at org.apache.maven.lifecycle.internal.MojoExecutor.execute(MojoExecutor.java:153)
at org.apache.maven.lifecycle.internal.MojoExecutor.execute(MojoExecutor.java:145)
at org.apache.maven.lifecycle.internal.LifecycleModuleBuilder.buildProject(LifecycleModuleBuilder.java:116)
at org.apache.maven.lifecycle.internal.LifecycleModuleBuilder.buildProject(LifecycleModuleBuilder.java:80)
at org.apache.maven.lifecycle.internal.builder.singlethreaded.SingleThreadedBuilder.build(SingleThreadedBuilder.java:51)
at org.apache.maven.lifecycle.internal.LifecycleStarter.execute(LifecycleStarter.java:128)
at org.apache.maven.DefaultMaven.doExecute(DefaultMaven.java:307)
at org.apache.maven.DefaultMaven.doExecute(DefaultMaven.java:193)
at org.apache.maven.DefaultMaven.execute(DefaultMaven.java:106)
at org.jvnet.hudson.maven3.launcher.Maven32Launcher.main(Maven32Launcher.java:132)
at sun.reflect.NativeMethodAccessorImpl.invoke0(Native Method)
at sun.reflect.NativeMethodAccessorImpl.invoke(NativeMethodAccessorImpl.java:57)
at sun.reflect.DelegatingMethodAccessorImpl.invoke(DelegatingMethodAccessorImpl.java:43)
at java.lang.reflect.Method.invoke(Method.java:606)
at org.codehaus.plexus.classworlds.launcher.Launcher.launchStandard(Launcher.java:330)
at org.codehaus.plexus.classworlds.launcher.Launcher.launch(Launcher.java:238)
at jenkins.maven3.agent.Maven32Main.launch(Maven32Main.java:186)
at sun.reflect.NativeMethodAccessorImpl.invoke0(Native Method)
at sun.reflect.NativeMethodAccessorImpl.invoke(NativeMethodAccessorImpl.java:57)
at sun.reflect.DelegatingMethodAccessorImpl.invoke(DelegatingMethodAccessorImpl.java:43)
at java.lang.reflect.Method.invoke(Method.java:606)
at hudson.maven.Maven3Builder.call(Maven3Builder.java:136)
at hudson.maven.Maven3Builder.call(Maven3Builder.java:71)
at hudson.remoting.UserRequest.perform(UserRequest.java:153)
at hudson.remoting.UserRequest.perform(UserRequest.java:50)
at hudson.remoting.Request$2.run(Request.java:332)
at hudson.remoting.InterceptingExecutorService$1.call(InterceptingExecutorService.java:68)
at java.util.concurrent.FutureTask.run(FutureTask.java:262)
at java.util.concurrent.ThreadPoolExecutor.runWorker(ThreadPoolExecutor.java:1145)
at java.util.concurrent.ThreadPoolExecutor$Worker.run(ThreadPoolExecutor.java:615)
at java.lang.Thread.run(Thread.java:745)
Caused by: org.apache.maven.project.DependencyResolutionException: Could not resolve dependencies for project org.apache.kylin:kylin-storage-hbase:jar:1.6.1-SNAPSHOT: Could not find artifact org.apache.kylin:kylin-core-storage:jar:tests:1.6.1-SNAPSHOT in conjars (http://conjars.org/repo/)
at org.apache.maven.project.DefaultProjectDependenciesResolver.resolve(DefaultProjectDependenciesResolver.java:211)
at org.apache.maven.lifecycle.internal.LifecycleDependencyResolver.getDependencies(LifecycleDependencyResolver.java:195)
... 34 more
Caused by: org.eclipse.aether.resolution.DependencyResolutionException: Could not find artifact org.apache.kylin:kylin-core-storage:jar:tests:1.6.1-SNAPSHOT in conjars (http://conjars.org/repo/)
at org.eclipse.aether.internal.impl.DefaultRepositorySystem.resolveDependencies(DefaultRepositorySystem.java:384)
at org.apache.maven.project.DefaultProjectDependenciesResolver.resolve(DefaultProjectDependenciesResolver.java:205)
... 35 more
Caused by: org.eclipse.aether.resolution.ArtifactResolutionException: Could not find artifact org.apache.kylin:kylin-core-storage:jar:tests:1.6.1-SNAPSHOT in conjars (http://conjars.org/repo/)
at org.eclipse.aether.internal.impl.DefaultArtifactResolver.resolve(DefaultArtifactResolver.java:444)
at org.eclipse.aether.internal.impl.DefaultArtifactResolver.resolveArtifacts(DefaultArtifactResolver.java:246)
at org.eclipse.aether.internal.impl.DefaultRepositorySystem.resolveDependencies(DefaultRepositorySystem.java:367)
... 36 more
Caused by: org.eclipse.aether.transfer.ArtifactNotFoundException: Could not find artifact org.apache.kylin:kylin-core-storage:jar:tests:1.6.1-SNAPSHOT in conjars (http://conjars.org/repo/)
at org.eclipse.aether.connector.basic.ArtifactTransportListener.transferFailed(ArtifactTransportListener.java:39)
at org.eclipse.aether.connector.basic.BasicRepositoryConnector$TaskRunner.run(BasicRepositoryConnector.java:355)
at org.eclipse.aether.util.concurrency.RunnableErrorForwarder$1.run(RunnableErrorForwarder.java:67)
at org.eclipse.aether.connector.basic.BasicRepositoryConnector$DirectExecutor.execute(BasicRepositoryConnector.java:581)
at org.eclipse.aether.connector.basic.BasicRepositoryConnector.get(BasicRepositoryConnector.java:249)
at org.eclipse.aether.internal.impl.DefaultArtifactResolver.performDownloads(DefaultArtifactResolver.java:520)
at org.eclipse.aether.internal.impl.DefaultArtifactResolver.resolve(DefaultArtifactResolver.java:421)
... 38 more
[ERROR]
[ERROR] Re-run Maven using the -X switch to enable full debug logging.
[ERROR]
[ERROR] For more information about the errors and possible solutions, please read the following articles:
[ERROR] [Help 1] http://cwiki.apache.org/confluence/display/MAVEN/DependencyResolutionException
[ERROR]
[ERROR] After correcting the problems, you can resume the build with the command
[ERROR] mvn <goals> -rf :kylin-storage-hbase
[JENKINS] Archiving <https://builds.apache.org/job/Kylin-Master-SonarQube/ws/server/pom.xml> to org.apache.kylin/kylin-server/1.6.1-SNAPSHOT/kylin-server-1.6.1-SNAPSHOT.pom
[JENKINS] Archiving <https://builds.apache.org/job/Kylin-Master-SonarQube/ws/jdbc/pom.xml> to org.apache.kylin/kylin-jdbc/1.6.1-SNAPSHOT/kylin-jdbc-1.6.1-SNAPSHOT.pom
[JENKINS] Archiving <https://builds.apache.org/job/Kylin-Master-SonarQube/ws/core-metadata/pom.xml> to org.apache.kylin/kylin-core-metadata/1.6.1-SNAPSHOT/kylin-core-metadata-1.6.1-SNAPSHOT.pom
No artifacts from Kylin-Master-SonarQube » Apache Kylin - Core Metadata #3 to compare, so performing full copy of artifacts
[JENKINS] Archiving <https://builds.apache.org/job/Kylin-Master-SonarQube/ws/storage-hbase/pom.xml> to org.apache.kylin/kylin-storage-hbase/1.6.1-SNAPSHOT/kylin-storage-hbase-1.6.1-SNAPSHOT.pom
[JENKINS] Archiving <https://builds.apache.org/job/Kylin-Master-SonarQube/ws/server-base/pom.xml> to org.apache.kylin/kylin-server-base/1.6.1-SNAPSHOT/kylin-server-base-1.6.1-SNAPSHOT.pom
[JENKINS] Archiving <https://builds.apache.org/job/Kylin-Master-SonarQube/ws/source-hive/pom.xml> to org.apache.kylin/kylin-source-hive/1.6.1-SNAPSHOT/kylin-source-hive-1.6.1-SNAPSHOT.pom
[JENKINS] Archiving <https://builds.apache.org/job/Kylin-Master-SonarQube/ws/core-job/pom.xml> to org.apache.kylin/kylin-core-job/1.6.1-SNAPSHOT/kylin-core-job-1.6.1-SNAPSHOT.pom
[JENKINS] Archiving <https://builds.apache.org/job/Kylin-Master-SonarQube/ws/atopcalcite/pom.xml> to org.apache.kylin/atopcalcite/1.6.1-SNAPSHOT/atopcalcite-1.6.1-SNAPSHOT.pom
No artifacts from Kylin-Master-SonarQube » Apache Kylin - Calcite Overrides #3 to compare, so performing full copy of artifacts
[JENKINS] Archiving <https://builds.apache.org/job/Kylin-Master-SonarQube/ws/tool/pom.xml> to org.apache.kylin/kylin-tool/1.6.1-SNAPSHOT/kylin-tool-1.6.1-SNAPSHOT.pom
[JENKINS] Archiving <https://builds.apache.org/job/Kylin-Master-SonarQube/ws/tomcat-ext/pom.xml> to org.apache.kylin/kylin-tomcat-ext/1.6.1-SNAPSHOT/kylin-tomcat-ext-1.6.1-SNAPSHOT.pom
No prior successful build to compare, so performing full copy of artifacts
[JENKINS] Archiving <https://builds.apache.org/job/Kylin-Master-SonarQube/ws/pom.xml> to org.apache.kylin/kylin/1.6.1-SNAPSHOT/kylin-1.6.1-SNAPSHOT.pom
No artifacts from Kylin-Master-SonarQube » Apache Kylin #3 to compare, so performing full copy of artifacts
[JENKINS] Archiving <https://builds.apache.org/job/Kylin-Master-SonarQube/ws/engine-spark/pom.xml> to org.apache.kylin/kylin-engine-spark/1.6.1-SNAPSHOT/kylin-engine-spark-1.6.1-SNAPSHOT.pom
[JENKINS] Archiving <https://builds.apache.org/job/Kylin-Master-SonarQube/ws/core-cube/pom.xml> to org.apache.kylin/kylin-core-cube/1.6.1-SNAPSHOT/kylin-core-cube-1.6.1-SNAPSHOT.pom
[JENKINS] Archiving <https://builds.apache.org/job/Kylin-Master-SonarQube/ws/assembly/pom.xml> to org.apache.kylin/kylin-assembly/1.6.1-SNAPSHOT/kylin-assembly-1.6.1-SNAPSHOT.pom
[JENKINS] Archiving <https://builds.apache.org/job/Kylin-Master-SonarQube/ws/core-common/pom.xml> to org.apache.kylin/kylin-core-common/1.6.1-SNAPSHOT/kylin-core-common-1.6.1-SNAPSHOT.pom
No artifacts from Kylin-Master-SonarQube » Apache Kylin - Core Common #3 to compare, so performing full copy of artifacts
[JENKINS] Archiving <https://builds.apache.org/job/Kylin-Master-SonarQube/ws/source-kafka/pom.xml> to org.apache.kylin/kylin-source-kafka/1.6.1-SNAPSHOT/kylin-source-kafka-1.6.1-SNAPSHOT.pom
[JENKINS] Archiving <https://builds.apache.org/job/Kylin-Master-SonarQube/ws/query/pom.xml> to org.apache.kylin/kylin-query/1.6.1-SNAPSHOT/kylin-query-1.6.1-SNAPSHOT.pom
[JENKINS] Archiving <https://builds.apache.org/job/Kylin-Master-SonarQube/ws/kylin-it/pom.xml> to org.apache.kylin/kylin-it/1.6.1-SNAPSHOT/kylin-it-1.6.1-SNAPSHOT.pom
No prior successful build to compare, so performing full copy of artifacts
[JENKINS] Archiving <https://builds.apache.org/job/Kylin-Master-SonarQube/ws/core-dictionary/pom.xml> to org.apache.kylin/kylin-core-dictionary/1.6.1-SNAPSHOT/kylin-core-dictionary-1.6.1-SNAPSHOT.pom
[JENKINS] Archiving <https://builds.apache.org/job/Kylin-Master-SonarQube/ws/core-storage/pom.xml> to org.apache.kylin/kylin-core-storage/1.6.1-SNAPSHOT/kylin-core-storage-1.6.1-SNAPSHOT.pom
[JENKINS] Archiving <https://builds.apache.org/job/Kylin-Master-SonarQube/ws/engine-mr/pom.xml> to org.apache.kylin/kylin-engine-mr/1.6.1-SNAPSHOT/kylin-engine-mr-1.6.1-SNAPSHOT.pom
channel stopped
Jenkins build is back to normal : Kylin-Master-SonarQube #7
Posted by Apache Jenkins Server <je...@builds.apache.org>.
See <https://builds.apache.org/job/Kylin-Master-SonarQube/7/>
Build failed in Jenkins: Kylin-Master-SonarQube #6
Posted by Apache Jenkins Server <je...@builds.apache.org>.
See <https://builds.apache.org/job/Kylin-Master-SonarQube/6/>
------------------------------------------
[...truncated 63 lines...]
[INFO] ------------------------------------------------------------------------
[INFO] Building Apache Kylin - Calcite Overrides 1.6.1-SNAPSHOT
[INFO] ------------------------------------------------------------------------
[INFO]
[INFO] --- maven-clean-plugin:2.5:clean (default-clean) @ atopcalcite ---
[INFO] Deleting <https://builds.apache.org/job/Kylin-Master-SonarQube/ws/atopcalcite/target>
[INFO]
[INFO] --- maven-checkstyle-plugin:2.17:check (check-style) @ atopcalcite ---
[INFO] Starting audit...
Audit done.
[INFO]
[INFO] --- maven-remote-resources-plugin:1.5:process (default) @ atopcalcite ---
[INFO]
[INFO] --- maven-resources-plugin:3.0.1:resources (default-resources) @ atopcalcite ---
[INFO] Using 'UTF-8' encoding to copy filtered resources.
[INFO] skip non existing resourceDirectory <https://builds.apache.org/job/Kylin-Master-SonarQube/ws/atopcalcite/src/main/resources>
[INFO] Copying 3 resources
[INFO]
[INFO] --- maven-compiler-plugin:3.5.1:compile (default-compile) @ atopcalcite ---
[INFO] Changes detected - recompiling the module!
[INFO] Compiling 6 source files to <https://builds.apache.org/job/Kylin-Master-SonarQube/ws/atopcalcite/target/classes>
[INFO]
[INFO] ------------------------------------------------------------------------
[INFO] Building Apache Kylin - Core Common 1.6.1-SNAPSHOT
[INFO] ------------------------------------------------------------------------
[INFO]
[INFO] --- maven-clean-plugin:2.5:clean (default-clean) @ kylin-core-common ---
[INFO] Deleting <https://builds.apache.org/job/Kylin-Master-SonarQube/ws/core-common/target>
[INFO]
[INFO] --- maven-checkstyle-plugin:2.17:check (check-style) @ kylin-core-common ---
[INFO] Starting audit...
Audit done.
[INFO]
[INFO] --- maven-remote-resources-plugin:1.5:process (default) @ kylin-core-common ---
[INFO]
[INFO] --- maven-resources-plugin:3.0.1:resources (default-resources) @ kylin-core-common ---
[INFO] Using 'UTF-8' encoding to copy filtered resources.
[INFO] Copying 1 resource
[INFO] Copying 3 resources
[INFO]
[INFO] --- maven-compiler-plugin:3.5.1:compile (default-compile) @ kylin-core-common ---
[INFO] Changes detected - recompiling the module!
[INFO] Compiling 73 source files to <https://builds.apache.org/job/Kylin-Master-SonarQube/ws/core-common/target/classes>
[WARNING] <https://builds.apache.org/job/Kylin-Master-SonarQube/ws/core-common/src/main/java/org/apache/kylin/common/util/Bytes.java>:[44,15] Unsafe is internal proprietary API and may be removed in a future release
[WARNING] <https://builds.apache.org/job/Kylin-Master-SonarQube/ws/core-common/src/main/java/org/apache/kylin/common/util/Bytes.java>:[1033,25] Unsafe is internal proprietary API and may be removed in a future release
[WARNING] <https://builds.apache.org/job/Kylin-Master-SonarQube/ws/core-common/src/main/java/org/apache/kylin/common/util/Bytes.java>:[1041,29] Unsafe is internal proprietary API and may be removed in a future release
[WARNING] <https://builds.apache.org/job/Kylin-Master-SonarQube/ws/core-common/src/main/java/org/apache/kylin/common/util/Bytes.java>:[1045,38] Unsafe is internal proprietary API and may be removed in a future release
[INFO]
[INFO] ------------------------------------------------------------------------
[INFO] Building Apache Kylin - Core Metadata 1.6.1-SNAPSHOT
[INFO] ------------------------------------------------------------------------
[INFO]
[INFO] --- maven-clean-plugin:2.5:clean (default-clean) @ kylin-core-metadata ---
[INFO] Deleting <https://builds.apache.org/job/Kylin-Master-SonarQube/ws/core-metadata/target>
[INFO]
[INFO] --- maven-checkstyle-plugin:2.17:check (check-style) @ kylin-core-metadata ---
[INFO] Starting audit...
Audit done.
[INFO]
[INFO] --- maven-remote-resources-plugin:1.5:process (default) @ kylin-core-metadata ---
[INFO]
[INFO] --- maven-resources-plugin:3.0.1:resources (default-resources) @ kylin-core-metadata ---
[INFO] Using 'UTF-8' encoding to copy filtered resources.
[INFO] skip non existing resourceDirectory <https://builds.apache.org/job/Kylin-Master-SonarQube/ws/core-metadata/src/main/resources>
[INFO] Copying 3 resources
[INFO]
[INFO] --- maven-compiler-plugin:3.5.1:compile (default-compile) @ kylin-core-metadata ---
[INFO] Changes detected - recompiling the module!
[INFO] Compiling 167 source files to <https://builds.apache.org/job/Kylin-Master-SonarQube/ws/core-metadata/target/classes>
[INFO]
[INFO] ------------------------------------------------------------------------
[INFO] Building Apache Kylin - Core Dictionary 1.6.1-SNAPSHOT
[INFO] ------------------------------------------------------------------------
[INFO]
[INFO] --- maven-clean-plugin:2.5:clean (default-clean) @ kylin-core-dictionary ---
[INFO] Deleting <https://builds.apache.org/job/Kylin-Master-SonarQube/ws/core-dictionary/target>
[INFO]
[INFO] --- maven-checkstyle-plugin:2.17:check (check-style) @ kylin-core-dictionary ---
[INFO] Starting audit...
Audit done.
[INFO]
[INFO] --- maven-remote-resources-plugin:1.5:process (default) @ kylin-core-dictionary ---
[INFO]
[INFO] --- maven-resources-plugin:3.0.1:resources (default-resources) @ kylin-core-dictionary ---
[INFO] Using 'UTF-8' encoding to copy filtered resources.
[INFO] skip non existing resourceDirectory <https://builds.apache.org/job/Kylin-Master-SonarQube/ws/core-dictionary/src/main/resources>
[INFO] Copying 3 resources
[INFO]
[INFO] --- maven-compiler-plugin:3.5.1:compile (default-compile) @ kylin-core-dictionary ---
[INFO] Changes detected - recompiling the module!
[INFO] Compiling 38 source files to <https://builds.apache.org/job/Kylin-Master-SonarQube/ws/core-dictionary/target/classes>
[INFO]
[INFO] ------------------------------------------------------------------------
[INFO] Building Apache Kylin - Core Cube 1.6.1-SNAPSHOT
[INFO] ------------------------------------------------------------------------
[INFO]
[INFO] --- maven-clean-plugin:2.5:clean (default-clean) @ kylin-core-cube ---
[INFO] Deleting <https://builds.apache.org/job/Kylin-Master-SonarQube/ws/core-cube/target>
[INFO]
[INFO] --- maven-checkstyle-plugin:2.17:check (check-style) @ kylin-core-cube ---
[INFO] Starting audit...
Audit done.
[INFO]
[INFO] --- maven-remote-resources-plugin:1.5:process (default) @ kylin-core-cube ---
[INFO]
[INFO] --- maven-resources-plugin:3.0.1:resources (default-resources) @ kylin-core-cube ---
[INFO] Using 'UTF-8' encoding to copy filtered resources.
[INFO] skip non existing resourceDirectory <https://builds.apache.org/job/Kylin-Master-SonarQube/ws/core-cube/src/main/resources>
[INFO] Copying 3 resources
[INFO]
[INFO] --- maven-compiler-plugin:3.5.1:compile (default-compile) @ kylin-core-cube ---
[INFO] Changes detected - recompiling the module!
[INFO] Compiling 124 source files to <https://builds.apache.org/job/Kylin-Master-SonarQube/ws/core-cube/target/classes>
[INFO]
[INFO] ------------------------------------------------------------------------
[INFO] Building Apache Kylin - Core Job 1.6.1-SNAPSHOT
[INFO] ------------------------------------------------------------------------
[INFO]
[INFO] --- maven-clean-plugin:2.5:clean (default-clean) @ kylin-core-job ---
[INFO] Deleting <https://builds.apache.org/job/Kylin-Master-SonarQube/ws/core-job/target>
[INFO]
[INFO] --- maven-checkstyle-plugin:2.17:check (check-style) @ kylin-core-job ---
[INFO] Starting audit...
Audit done.
[INFO]
[INFO] --- maven-remote-resources-plugin:1.5:process (default) @ kylin-core-job ---
[INFO]
[INFO] --- maven-resources-plugin:3.0.1:resources (default-resources) @ kylin-core-job ---
[INFO] Using 'UTF-8' encoding to copy filtered resources.
[INFO] skip non existing resourceDirectory <https://builds.apache.org/job/Kylin-Master-SonarQube/ws/core-job/src/main/resources>
[INFO] Copying 3 resources
[INFO]
[INFO] --- maven-compiler-plugin:3.5.1:compile (default-compile) @ kylin-core-job ---
[INFO] Changes detected - recompiling the module!
[INFO] Compiling 39 source files to <https://builds.apache.org/job/Kylin-Master-SonarQube/ws/core-job/target/classes>
[INFO]
[INFO] ------------------------------------------------------------------------
[INFO] Building Apache Kylin - Core Storage 1.6.1-SNAPSHOT
[INFO] ------------------------------------------------------------------------
[INFO]
[INFO] --- maven-clean-plugin:2.5:clean (default-clean) @ kylin-core-storage ---
[INFO] Deleting <https://builds.apache.org/job/Kylin-Master-SonarQube/ws/core-storage/target>
[INFO]
[INFO] --- maven-checkstyle-plugin:2.17:check (check-style) @ kylin-core-storage ---
[INFO] Starting audit...
Audit done.
[INFO]
[INFO] --- maven-remote-resources-plugin:1.5:process (default) @ kylin-core-storage ---
[INFO]
[INFO] --- maven-resources-plugin:3.0.1:resources (default-resources) @ kylin-core-storage ---
[INFO] Using 'UTF-8' encoding to copy filtered resources.
[INFO] skip non existing resourceDirectory <https://builds.apache.org/job/Kylin-Master-SonarQube/ws/core-storage/src/main/resources>
[INFO] Copying 3 resources
[INFO]
[INFO] --- maven-compiler-plugin:3.5.1:compile (default-compile) @ kylin-core-storage ---
[INFO] Changes detected - recompiling the module!
[INFO] Compiling 27 source files to <https://builds.apache.org/job/Kylin-Master-SonarQube/ws/core-storage/target/classes>
[INFO]
[INFO] ------------------------------------------------------------------------
[INFO] Building Apache Kylin - MapReduce Engine 1.6.1-SNAPSHOT
[INFO] ------------------------------------------------------------------------
[INFO]
[INFO] --- maven-clean-plugin:2.5:clean (default-clean) @ kylin-engine-mr ---
[INFO] Deleting <https://builds.apache.org/job/Kylin-Master-SonarQube/ws/engine-mr/target>
[INFO]
[INFO] --- maven-checkstyle-plugin:2.17:check (check-style) @ kylin-engine-mr ---
[INFO] Starting audit...
Audit done.
[INFO]
[INFO] --- maven-remote-resources-plugin:1.5:process (default) @ kylin-engine-mr ---
[INFO]
[INFO] --- maven-resources-plugin:3.0.1:resources (default-resources) @ kylin-engine-mr ---
[INFO] Using 'UTF-8' encoding to copy filtered resources.
[INFO] skip non existing resourceDirectory <https://builds.apache.org/job/Kylin-Master-SonarQube/ws/engine-mr/src/main/resources>
[INFO] Copying 3 resources
[INFO]
[INFO] --- maven-compiler-plugin:3.5.1:compile (default-compile) @ kylin-engine-mr ---
[INFO] Changes detected - recompiling the module!
[INFO] Compiling 69 source files to <https://builds.apache.org/job/Kylin-Master-SonarQube/ws/engine-mr/target/classes>
[INFO]
[INFO] ------------------------------------------------------------------------
[INFO] Building Apache Kylin - HBase Storage 1.6.1-SNAPSHOT
[INFO] ------------------------------------------------------------------------
[INFO] ------------------------------------------------------------------------
[INFO] Reactor Summary:
[INFO]
[INFO] Apache Kylin ....................................... SUCCESS [ 3.606 s]
[INFO] Apache Kylin - Calcite Overrides ................... SUCCESS [ 5.161 s]
[INFO] Apache Kylin - Core Common ......................... SUCCESS [ 5.079 s]
[INFO] Apache Kylin - Core Metadata ....................... SUCCESS [ 5.547 s]
[INFO] Apache Kylin - Core Dictionary ..................... SUCCESS [ 4.869 s]
[INFO] Apache Kylin - Core Cube ........................... SUCCESS [ 5.598 s]
[INFO] Apache Kylin - Core Job ............................ SUCCESS [ 2.961 s]
[INFO] Apache Kylin - Core Storage ........................ SUCCESS [ 2.872 s]
[INFO] Apache Kylin - MapReduce Engine .................... SUCCESS [ 5.407 s]
[INFO] Apache Kylin - HBase Storage ....................... FAILURE [ 0.495 s]
[INFO] Apache Kylin - Spark Engine ........................ SKIPPED
[INFO] Apache Kylin - Hive Source ......................... SKIPPED
[INFO] Apache Kylin - Kafka Source ........................ SKIPPED
[INFO] Apache Kylin - Query ............................... SKIPPED
[INFO] Apache Kylin - Tool ................................ SKIPPED
[INFO] Apache Kylin - REST Server Base .................... SKIPPED
[INFO] Apache Kylin - REST Server ......................... SKIPPED
[INFO] Apache Kylin - JDBC Driver ......................... SKIPPED
[INFO] Apache Kylin - Assembly ............................ SKIPPED
[INFO] Apache Kylin - Integration Test .................... SKIPPED
[INFO] Apache Kylin - Tomcat Extension .................... SKIPPED
[INFO] ------------------------------------------------------------------------
[INFO] BUILD FAILURE
[INFO] ------------------------------------------------------------------------
[INFO] Total time: 50.956 s
[INFO] Finished at: 2016-12-28T16:49:50+00:00
[INFO] Final Memory: 37M/519M
[INFO] ------------------------------------------------------------------------
Waiting for Jenkins to finish collecting data
[ERROR] Failed to execute goal on project kylin-storage-hbase: Could not resolve dependencies for project org.apache.kylin:kylin-storage-hbase:jar:1.6.1-SNAPSHOT: Failure to find org.apache.kylin:kylin-core-storage:jar:tests:1.6.1-SNAPSHOT in http://conjars.org/repo/ was cached in the local repository, resolution will not be reattempted until the update interval of conjars has elapsed or updates are forced -> [Help 1]
[ERROR]
[ERROR] To see the full stack trace of the errors, re-run Maven with the -e switch.
[ERROR] Re-run Maven using the -X switch to enable full debug logging.
[ERROR]
[ERROR] For more information about the errors and possible solutions, please read the following articles:
[ERROR] [Help 1] http://cwiki.apache.org/confluence/display/MAVEN/DependencyResolutionException
[ERROR]
[ERROR] After correcting the problems, you can resume the build with the command
[ERROR] mvn <goals> -rf :kylin-storage-hbase
[JENKINS] Archiving <https://builds.apache.org/job/Kylin-Master-SonarQube/ws/server/pom.xml> to org.apache.kylin/kylin-server/1.6.1-SNAPSHOT/kylin-server-1.6.1-SNAPSHOT.pom
[JENKINS] Archiving <https://builds.apache.org/job/Kylin-Master-SonarQube/ws/jdbc/pom.xml> to org.apache.kylin/kylin-jdbc/1.6.1-SNAPSHOT/kylin-jdbc-1.6.1-SNAPSHOT.pom
[JENKINS] Archiving <https://builds.apache.org/job/Kylin-Master-SonarQube/ws/core-metadata/pom.xml> to org.apache.kylin/kylin-core-metadata/1.6.1-SNAPSHOT/kylin-core-metadata-1.6.1-SNAPSHOT.pom
[JENKINS] Archiving <https://builds.apache.org/job/Kylin-Master-SonarQube/ws/storage-hbase/pom.xml> to org.apache.kylin/kylin-storage-hbase/1.6.1-SNAPSHOT/kylin-storage-hbase-1.6.1-SNAPSHOT.pom
[JENKINS] Archiving <https://builds.apache.org/job/Kylin-Master-SonarQube/ws/server-base/pom.xml> to org.apache.kylin/kylin-server-base/1.6.1-SNAPSHOT/kylin-server-base-1.6.1-SNAPSHOT.pom
[JENKINS] Archiving <https://builds.apache.org/job/Kylin-Master-SonarQube/ws/source-hive/pom.xml> to org.apache.kylin/kylin-source-hive/1.6.1-SNAPSHOT/kylin-source-hive-1.6.1-SNAPSHOT.pom
[JENKINS] Archiving <https://builds.apache.org/job/Kylin-Master-SonarQube/ws/core-job/pom.xml> to org.apache.kylin/kylin-core-job/1.6.1-SNAPSHOT/kylin-core-job-1.6.1-SNAPSHOT.pom
[JENKINS] Archiving <https://builds.apache.org/job/Kylin-Master-SonarQube/ws/atopcalcite/pom.xml> to org.apache.kylin/atopcalcite/1.6.1-SNAPSHOT/atopcalcite-1.6.1-SNAPSHOT.pom
[JENKINS] Archiving <https://builds.apache.org/job/Kylin-Master-SonarQube/ws/tool/pom.xml> to org.apache.kylin/kylin-tool/1.6.1-SNAPSHOT/kylin-tool-1.6.1-SNAPSHOT.pom
[JENKINS] Archiving <https://builds.apache.org/job/Kylin-Master-SonarQube/ws/tomcat-ext/pom.xml> to org.apache.kylin/kylin-tomcat-ext/1.6.1-SNAPSHOT/kylin-tomcat-ext-1.6.1-SNAPSHOT.pom
[JENKINS] Archiving <https://builds.apache.org/job/Kylin-Master-SonarQube/ws/pom.xml> to org.apache.kylin/kylin/1.6.1-SNAPSHOT/kylin-1.6.1-SNAPSHOT.pom
Compressed 55.85 KB of artifacts by 57.3% relative to #5
[JENKINS] Archiving <https://builds.apache.org/job/Kylin-Master-SonarQube/ws/engine-spark/pom.xml> to org.apache.kylin/kylin-engine-spark/1.6.1-SNAPSHOT/kylin-engine-spark-1.6.1-SNAPSHOT.pom
[JENKINS] Archiving <https://builds.apache.org/job/Kylin-Master-SonarQube/ws/core-cube/pom.xml> to org.apache.kylin/kylin-core-cube/1.6.1-SNAPSHOT/kylin-core-cube-1.6.1-SNAPSHOT.pom
[JENKINS] Archiving <https://builds.apache.org/job/Kylin-Master-SonarQube/ws/assembly/pom.xml> to org.apache.kylin/kylin-assembly/1.6.1-SNAPSHOT/kylin-assembly-1.6.1-SNAPSHOT.pom
[JENKINS] Archiving <https://builds.apache.org/job/Kylin-Master-SonarQube/ws/core-common/pom.xml> to org.apache.kylin/kylin-core-common/1.6.1-SNAPSHOT/kylin-core-common-1.6.1-SNAPSHOT.pom
[JENKINS] Archiving <https://builds.apache.org/job/Kylin-Master-SonarQube/ws/source-kafka/pom.xml> to org.apache.kylin/kylin-source-kafka/1.6.1-SNAPSHOT/kylin-source-kafka-1.6.1-SNAPSHOT.pom
[JENKINS] Archiving <https://builds.apache.org/job/Kylin-Master-SonarQube/ws/query/pom.xml> to org.apache.kylin/kylin-query/1.6.1-SNAPSHOT/kylin-query-1.6.1-SNAPSHOT.pom
[JENKINS] Archiving <https://builds.apache.org/job/Kylin-Master-SonarQube/ws/kylin-it/pom.xml> to org.apache.kylin/kylin-it/1.6.1-SNAPSHOT/kylin-it-1.6.1-SNAPSHOT.pom
No prior successful build to compare, so performing full copy of artifacts
[JENKINS] Archiving <https://builds.apache.org/job/Kylin-Master-SonarQube/ws/core-dictionary/pom.xml> to org.apache.kylin/kylin-core-dictionary/1.6.1-SNAPSHOT/kylin-core-dictionary-1.6.1-SNAPSHOT.pom
[JENKINS] Archiving <https://builds.apache.org/job/Kylin-Master-SonarQube/ws/core-storage/pom.xml> to org.apache.kylin/kylin-core-storage/1.6.1-SNAPSHOT/kylin-core-storage-1.6.1-SNAPSHOT.pom
[JENKINS] Archiving <https://builds.apache.org/job/Kylin-Master-SonarQube/ws/engine-mr/pom.xml> to org.apache.kylin/kylin-engine-mr/1.6.1-SNAPSHOT/kylin-engine-mr-1.6.1-SNAPSHOT.pom
channel stopped
Build failed in Jenkins: Kylin-Master-SonarQube #5
Posted by Apache Jenkins Server <je...@builds.apache.org>.
See <https://builds.apache.org/job/Kylin-Master-SonarQube/5/>
------------------------------------------
[...truncated 250 lines...]
[INFO] Downloading: http://repository.apache.org/snapshots/org/apache/kylin/kylin-core-storage/1.6.1-SNAPSHOT/maven-metadata.xml
[INFO] Downloading: http://conjars.org/repo/org/apache/kylin/kylin-core-storage/1.6.1-SNAPSHOT/kylin-core-storage-1.6.1-SNAPSHOT-tests.jar
[INFO] Downloading: http://repository.apache.org/snapshots/org/apache/kylin/kylin-core-storage/1.6.1-SNAPSHOT/kylin-core-storage-1.6.1-SNAPSHOT-tests.jar
[INFO]
[INFO] ------------------------------------------------------------------------
[INFO] Skipping Apache Kylin - Spark Engine
[INFO] This project has been banned from the build due to previous failures.
[INFO] ------------------------------------------------------------------------
[INFO]
[INFO] ------------------------------------------------------------------------
[INFO] Building Apache Kylin - Hive Source 1.6.1-SNAPSHOT
[INFO] ------------------------------------------------------------------------
[INFO]
[INFO] --- maven-clean-plugin:2.5:clean (default-clean) @ kylin-source-hive ---
[INFO] Deleting <https://builds.apache.org/job/Kylin-Master-SonarQube/ws/source-hive/target>
[INFO]
[INFO] --- maven-checkstyle-plugin:2.17:check (check-style) @ kylin-source-hive ---
[INFO] Starting audit...
Audit done.
[INFO]
[INFO] --- maven-remote-resources-plugin:1.5:process (default) @ kylin-source-hive ---
[INFO]
[INFO] --- maven-resources-plugin:3.0.1:resources (default-resources) @ kylin-source-hive ---
[INFO] Using 'UTF-8' encoding to copy filtered resources.
[INFO] skip non existing resourceDirectory <https://builds.apache.org/job/Kylin-Master-SonarQube/ws/source-hive/src/main/resources>
[INFO] Copying 3 resources
[INFO]
[INFO] --- maven-compiler-plugin:3.5.1:compile (default-compile) @ kylin-source-hive ---
[INFO] Changes detected - recompiling the module!
[INFO] Compiling 18 source files to <https://builds.apache.org/job/Kylin-Master-SonarQube/ws/source-hive/target/classes>
[INFO]
[INFO] ------------------------------------------------------------------------
[INFO] Building Apache Kylin - Kafka Source 1.6.1-SNAPSHOT
[INFO] ------------------------------------------------------------------------
[INFO]
[INFO] --- maven-clean-plugin:2.5:clean (default-clean) @ kylin-source-kafka ---
[INFO] Deleting <https://builds.apache.org/job/Kylin-Master-SonarQube/ws/source-kafka/target>
[INFO]
[INFO] --- maven-checkstyle-plugin:2.17:check (check-style) @ kylin-source-kafka ---
[INFO] Starting audit...
Audit done.
[INFO]
[INFO] --- maven-remote-resources-plugin:1.5:process (default) @ kylin-source-kafka ---
[INFO]
[INFO] --- maven-resources-plugin:3.0.1:resources (default-resources) @ kylin-source-kafka ---
[INFO] Using 'UTF-8' encoding to copy filtered resources.
[INFO] skip non existing resourceDirectory <https://builds.apache.org/job/Kylin-Master-SonarQube/ws/source-kafka/src/main/resources>
[INFO] Copying 3 resources
[INFO]
[INFO] --- maven-compiler-plugin:3.5.1:compile (default-compile) @ kylin-source-kafka ---
[INFO] Changes detected - recompiling the module!
[INFO] Compiling 23 source files to <https://builds.apache.org/job/Kylin-Master-SonarQube/ws/source-kafka/target/classes>
[INFO]
[INFO] ------------------------------------------------------------------------
[INFO] Skipping Apache Kylin - Query
[INFO] This project has been banned from the build due to previous failures.
[INFO] ------------------------------------------------------------------------
[INFO]
[INFO] ------------------------------------------------------------------------
[INFO] Skipping Apache Kylin - Tool
[INFO] This project has been banned from the build due to previous failures.
[INFO] ------------------------------------------------------------------------
[INFO]
[INFO] ------------------------------------------------------------------------
[INFO] Skipping Apache Kylin - REST Server Base
[INFO] This project has been banned from the build due to previous failures.
[INFO] ------------------------------------------------------------------------
[INFO]
[INFO] ------------------------------------------------------------------------
[INFO] Skipping Apache Kylin - REST Server
[INFO] This project has been banned from the build due to previous failures.
[INFO] ------------------------------------------------------------------------
[INFO]
[INFO] ------------------------------------------------------------------------
[INFO] Building Apache Kylin - JDBC Driver 1.6.1-SNAPSHOT
[INFO] ------------------------------------------------------------------------
[INFO]
[INFO] --- maven-clean-plugin:2.5:clean (default-clean) @ kylin-jdbc ---
[INFO] Deleting <https://builds.apache.org/job/Kylin-Master-SonarQube/ws/jdbc/target>
[INFO]
[INFO] --- maven-checkstyle-plugin:2.17:check (check-style) @ kylin-jdbc ---
[INFO] Starting audit...
Audit done.
[INFO]
[INFO] --- maven-remote-resources-plugin:1.5:process (default) @ kylin-jdbc ---
[INFO]
[INFO] --- maven-resources-plugin:3.0.1:resources (default-resources) @ kylin-jdbc ---
[INFO] Using 'UTF-8' encoding to copy filtered resources.
[INFO] Copying 1 resource
[INFO] Copying 3 resources
[INFO]
[INFO] --- maven-compiler-plugin:3.5.1:compile (default-compile) @ kylin-jdbc ---
[INFO] Changes detected - recompiling the module!
[INFO] Compiling 14 source files to <https://builds.apache.org/job/Kylin-Master-SonarQube/ws/jdbc/target/classes>
[INFO]
[INFO] ------------------------------------------------------------------------
[INFO] Skipping Apache Kylin - Assembly
[INFO] This project has been banned from the build due to previous failures.
[INFO] ------------------------------------------------------------------------
[INFO]
[INFO] ------------------------------------------------------------------------
[INFO] Skipping Apache Kylin - Integration Test
[INFO] This project has been banned from the build due to previous failures.
[INFO] ------------------------------------------------------------------------
[INFO]
[INFO] ------------------------------------------------------------------------
[INFO] Building Apache Kylin - Tomcat Extension 1.6.1-SNAPSHOT
[INFO] ------------------------------------------------------------------------
[INFO]
[INFO] --- maven-clean-plugin:2.5:clean (default-clean) @ kylin-tomcat-ext ---
[INFO] Deleting <https://builds.apache.org/job/Kylin-Master-SonarQube/ws/tomcat-ext/target>
[INFO]
[INFO] --- maven-checkstyle-plugin:2.17:check (check-style) @ kylin-tomcat-ext ---
[INFO] Starting audit...
Audit done.
[INFO]
[INFO] --- maven-remote-resources-plugin:1.5:process (default) @ kylin-tomcat-ext ---
[INFO]
[INFO] --- maven-resources-plugin:3.0.1:resources (default-resources) @ kylin-tomcat-ext ---
[INFO] Using 'UTF-8' encoding to copy filtered resources.
[INFO] skip non existing resourceDirectory <https://builds.apache.org/job/Kylin-Master-SonarQube/ws/tomcat-ext/src/main/resources>
[INFO] Copying 3 resources
[INFO]
[INFO] --- maven-compiler-plugin:3.5.1:compile (default-compile) @ kylin-tomcat-ext ---
[INFO] Changes detected - recompiling the module!
[INFO] Compiling 1 source file to <https://builds.apache.org/job/Kylin-Master-SonarQube/ws/tomcat-ext/target/classes>
[INFO] ------------------------------------------------------------------------
[INFO] Reactor Summary:
[INFO]
[INFO] Apache Kylin ....................................... SUCCESS [ 2.857 s]
[INFO] Apache Kylin - Calcite Overrides ................... SUCCESS [ 4.922 s]
[INFO] Apache Kylin - Core Common ......................... SUCCESS [ 4.667 s]
[INFO] Apache Kylin - Core Metadata ....................... SUCCESS [ 6.444 s]
[INFO] Apache Kylin - Core Dictionary ..................... SUCCESS [ 6.998 s]
[INFO] Apache Kylin - Core Cube ........................... SUCCESS [ 5.521 s]
[INFO] Apache Kylin - Core Job ............................ SUCCESS [ 2.954 s]
[INFO] Apache Kylin - Core Storage ........................ SUCCESS [ 2.850 s]
[INFO] Apache Kylin - MapReduce Engine .................... SUCCESS [ 5.470 s]
[INFO] Apache Kylin - HBase Storage ....................... FAILURE [ 1.031 s]
[INFO] Apache Kylin - Spark Engine ........................ SKIPPED
[INFO] Apache Kylin - Hive Source ......................... SUCCESS [ 4.598 s]
[INFO] Apache Kylin - Kafka Source ........................ SUCCESS [ 3.504 s]
[INFO] Apache Kylin - Query ............................... SKIPPED
[INFO] Apache Kylin - Tool ................................ SKIPPED
[INFO] Apache Kylin - REST Server Base .................... SKIPPED
[INFO] Apache Kylin - REST Server ......................... SKIPPED
[INFO] Apache Kylin - JDBC Driver ......................... SUCCESS [ 2.428 s]
[INFO] Apache Kylin - Assembly ............................ SKIPPED
[INFO] Apache Kylin - Integration Test .................... SKIPPED
[INFO] Apache Kylin - Tomcat Extension .................... SUCCESS [ 1.777 s]
[INFO] ------------------------------------------------------------------------
[INFO] BUILD FAILURE
[INFO] ------------------------------------------------------------------------
[INFO] Total time: 01:10 min
[INFO] Finished at: 2016-12-28T16:46:48+00:00
[INFO] Final Memory: 40M/490M
[INFO] ------------------------------------------------------------------------
Waiting for Jenkins to finish collecting data
[ERROR] Failed to execute goal on project kylin-storage-hbase: Could not resolve dependencies for project org.apache.kylin:kylin-storage-hbase:jar:1.6.1-SNAPSHOT: Could not find artifact org.apache.kylin:kylin-core-storage:jar:tests:1.6.1-SNAPSHOT in conjars (http://conjars.org/repo/) -> [Help 1]
org.apache.maven.lifecycle.LifecycleExecutionException: Failed to execute goal on project kylin-storage-hbase: Could not resolve dependencies for project org.apache.kylin:kylin-storage-hbase:jar:1.6.1-SNAPSHOT: Could not find artifact org.apache.kylin:kylin-core-storage:jar:tests:1.6.1-SNAPSHOT in conjars (http://conjars.org/repo/)
at org.apache.maven.lifecycle.internal.LifecycleDependencyResolver.getDependencies(LifecycleDependencyResolver.java:221)
at org.apache.maven.lifecycle.internal.LifecycleDependencyResolver.resolveProjectDependencies(LifecycleDependencyResolver.java:127)
at org.apache.maven.lifecycle.internal.MojoExecutor.ensureDependenciesAreResolved(MojoExecutor.java:245)
at org.apache.maven.lifecycle.internal.MojoExecutor.execute(MojoExecutor.java:199)
at org.apache.maven.lifecycle.internal.MojoExecutor.execute(MojoExecutor.java:153)
at org.apache.maven.lifecycle.internal.MojoExecutor.execute(MojoExecutor.java:145)
at org.apache.maven.lifecycle.internal.LifecycleModuleBuilder.buildProject(LifecycleModuleBuilder.java:116)
at org.apache.maven.lifecycle.internal.LifecycleModuleBuilder.buildProject(LifecycleModuleBuilder.java:80)
at org.apache.maven.lifecycle.internal.builder.singlethreaded.SingleThreadedBuilder.build(SingleThreadedBuilder.java:51)
at org.apache.maven.lifecycle.internal.LifecycleStarter.execute(LifecycleStarter.java:128)
at org.apache.maven.DefaultMaven.doExecute(DefaultMaven.java:307)
at org.apache.maven.DefaultMaven.doExecute(DefaultMaven.java:193)
at org.apache.maven.DefaultMaven.execute(DefaultMaven.java:106)
at org.jvnet.hudson.maven3.launcher.Maven32Launcher.main(Maven32Launcher.java:132)
at sun.reflect.NativeMethodAccessorImpl.invoke0(Native Method)
at sun.reflect.NativeMethodAccessorImpl.invoke(NativeMethodAccessorImpl.java:57)
at sun.reflect.DelegatingMethodAccessorImpl.invoke(DelegatingMethodAccessorImpl.java:43)
at java.lang.reflect.Method.invoke(Method.java:606)
at org.codehaus.plexus.classworlds.launcher.Launcher.launchStandard(Launcher.java:330)
at org.codehaus.plexus.classworlds.launcher.Launcher.launch(Launcher.java:238)
at jenkins.maven3.agent.Maven32Main.launch(Maven32Main.java:186)
at sun.reflect.NativeMethodAccessorImpl.invoke0(Native Method)
at sun.reflect.NativeMethodAccessorImpl.invoke(NativeMethodAccessorImpl.java:57)
at sun.reflect.DelegatingMethodAccessorImpl.invoke(DelegatingMethodAccessorImpl.java:43)
at java.lang.reflect.Method.invoke(Method.java:606)
at hudson.maven.Maven3Builder.call(Maven3Builder.java:136)
at hudson.maven.Maven3Builder.call(Maven3Builder.java:71)
at hudson.remoting.UserRequest.perform(UserRequest.java:153)
at hudson.remoting.UserRequest.perform(UserRequest.java:50)
at hudson.remoting.Request$2.run(Request.java:332)
at hudson.remoting.InterceptingExecutorService$1.call(InterceptingExecutorService.java:68)
at java.util.concurrent.FutureTask.run(FutureTask.java:262)
at java.util.concurrent.ThreadPoolExecutor.runWorker(ThreadPoolExecutor.java:1145)
at java.util.concurrent.ThreadPoolExecutor$Worker.run(ThreadPoolExecutor.java:615)
at java.lang.Thread.run(Thread.java:745)
Caused by: org.apache.maven.project.DependencyResolutionException: Could not resolve dependencies for project org.apache.kylin:kylin-storage-hbase:jar:1.6.1-SNAPSHOT: Could not find artifact org.apache.kylin:kylin-core-storage:jar:tests:1.6.1-SNAPSHOT in conjars (http://conjars.org/repo/)
at org.apache.maven.project.DefaultProjectDependenciesResolver.resolve(DefaultProjectDependenciesResolver.java:211)
at org.apache.maven.lifecycle.internal.LifecycleDependencyResolver.getDependencies(LifecycleDependencyResolver.java:195)
... 34 more
Caused by: org.eclipse.aether.resolution.DependencyResolutionException: Could not find artifact org.apache.kylin:kylin-core-storage:jar:tests:1.6.1-SNAPSHOT in conjars (http://conjars.org/repo/)
at org.eclipse.aether.internal.impl.DefaultRepositorySystem.resolveDependencies(DefaultRepositorySystem.java:384)
at org.apache.maven.project.DefaultProjectDependenciesResolver.resolve(DefaultProjectDependenciesResolver.java:205)
... 35 more
Caused by: org.eclipse.aether.resolution.ArtifactResolutionException: Could not find artifact org.apache.kylin:kylin-core-storage:jar:tests:1.6.1-SNAPSHOT in conjars (http://conjars.org/repo/)
at org.eclipse.aether.internal.impl.DefaultArtifactResolver.resolve(DefaultArtifactResolver.java:444)
at org.eclipse.aether.internal.impl.DefaultArtifactResolver.resolveArtifacts(DefaultArtifactResolver.java:246)
at org.eclipse.aether.internal.impl.DefaultRepositorySystem.resolveDependencies(DefaultRepositorySystem.java:367)
... 36 more
Caused by: org.eclipse.aether.transfer.ArtifactNotFoundException: Could not find artifact org.apache.kylin:kylin-core-storage:jar:tests:1.6.1-SNAPSHOT in conjars (http://conjars.org/repo/)
at org.eclipse.aether.connector.basic.ArtifactTransportListener.transferFailed(ArtifactTransportListener.java:39)
at org.eclipse.aether.connector.basic.BasicRepositoryConnector$TaskRunner.run(BasicRepositoryConnector.java:355)
at org.eclipse.aether.util.concurrency.RunnableErrorForwarder$1.run(RunnableErrorForwarder.java:67)
at org.eclipse.aether.connector.basic.BasicRepositoryConnector$DirectExecutor.execute(BasicRepositoryConnector.java:581)
at org.eclipse.aether.connector.basic.BasicRepositoryConnector.get(BasicRepositoryConnector.java:249)
at org.eclipse.aether.internal.impl.DefaultArtifactResolver.performDownloads(DefaultArtifactResolver.java:520)
at org.eclipse.aether.internal.impl.DefaultArtifactResolver.resolve(DefaultArtifactResolver.java:421)
... 38 more
[ERROR]
[ERROR] Re-run Maven using the -X switch to enable full debug logging.
[ERROR]
[ERROR] For more information about the errors and possible solutions, please read the following articles:
[ERROR] [Help 1] http://cwiki.apache.org/confluence/display/MAVEN/DependencyResolutionException
[ERROR]
[ERROR] After correcting the problems, you can resume the build with the command
[ERROR] mvn <goals> -rf :kylin-storage-hbase
[JENKINS] Archiving <https://builds.apache.org/job/Kylin-Master-SonarQube/ws/server/pom.xml> to org.apache.kylin/kylin-server/1.6.1-SNAPSHOT/kylin-server-1.6.1-SNAPSHOT.pom
[JENKINS] Archiving <https://builds.apache.org/job/Kylin-Master-SonarQube/ws/jdbc/pom.xml> to org.apache.kylin/kylin-jdbc/1.6.1-SNAPSHOT/kylin-jdbc-1.6.1-SNAPSHOT.pom
[JENKINS] Archiving <https://builds.apache.org/job/Kylin-Master-SonarQube/ws/core-metadata/pom.xml> to org.apache.kylin/kylin-core-metadata/1.6.1-SNAPSHOT/kylin-core-metadata-1.6.1-SNAPSHOT.pom
[JENKINS] Archiving <https://builds.apache.org/job/Kylin-Master-SonarQube/ws/storage-hbase/pom.xml> to org.apache.kylin/kylin-storage-hbase/1.6.1-SNAPSHOT/kylin-storage-hbase-1.6.1-SNAPSHOT.pom
[JENKINS] Archiving <https://builds.apache.org/job/Kylin-Master-SonarQube/ws/server-base/pom.xml> to org.apache.kylin/kylin-server-base/1.6.1-SNAPSHOT/kylin-server-base-1.6.1-SNAPSHOT.pom
[JENKINS] Archiving <https://builds.apache.org/job/Kylin-Master-SonarQube/ws/source-hive/pom.xml> to org.apache.kylin/kylin-source-hive/1.6.1-SNAPSHOT/kylin-source-hive-1.6.1-SNAPSHOT.pom
[JENKINS] Archiving <https://builds.apache.org/job/Kylin-Master-SonarQube/ws/core-job/pom.xml> to org.apache.kylin/kylin-core-job/1.6.1-SNAPSHOT/kylin-core-job-1.6.1-SNAPSHOT.pom
[JENKINS] Archiving <https://builds.apache.org/job/Kylin-Master-SonarQube/ws/atopcalcite/pom.xml> to org.apache.kylin/atopcalcite/1.6.1-SNAPSHOT/atopcalcite-1.6.1-SNAPSHOT.pom
[JENKINS] Archiving <https://builds.apache.org/job/Kylin-Master-SonarQube/ws/tool/pom.xml> to org.apache.kylin/kylin-tool/1.6.1-SNAPSHOT/kylin-tool-1.6.1-SNAPSHOT.pom
[JENKINS] Archiving <https://builds.apache.org/job/Kylin-Master-SonarQube/ws/tomcat-ext/pom.xml> to org.apache.kylin/kylin-tomcat-ext/1.6.1-SNAPSHOT/kylin-tomcat-ext-1.6.1-SNAPSHOT.pom
[JENKINS] Archiving <https://builds.apache.org/job/Kylin-Master-SonarQube/ws/pom.xml> to org.apache.kylin/kylin/1.6.1-SNAPSHOT/kylin-1.6.1-SNAPSHOT.pom
Compressed 55.85 KB of artifacts by 57.3% relative to #4
[JENKINS] Archiving <https://builds.apache.org/job/Kylin-Master-SonarQube/ws/engine-spark/pom.xml> to org.apache.kylin/kylin-engine-spark/1.6.1-SNAPSHOT/kylin-engine-spark-1.6.1-SNAPSHOT.pom
[JENKINS] Archiving <https://builds.apache.org/job/Kylin-Master-SonarQube/ws/core-cube/pom.xml> to org.apache.kylin/kylin-core-cube/1.6.1-SNAPSHOT/kylin-core-cube-1.6.1-SNAPSHOT.pom
[JENKINS] Archiving <https://builds.apache.org/job/Kylin-Master-SonarQube/ws/assembly/pom.xml> to org.apache.kylin/kylin-assembly/1.6.1-SNAPSHOT/kylin-assembly-1.6.1-SNAPSHOT.pom
[JENKINS] Archiving <https://builds.apache.org/job/Kylin-Master-SonarQube/ws/core-common/pom.xml> to org.apache.kylin/kylin-core-common/1.6.1-SNAPSHOT/kylin-core-common-1.6.1-SNAPSHOT.pom
[JENKINS] Archiving <https://builds.apache.org/job/Kylin-Master-SonarQube/ws/source-kafka/pom.xml> to org.apache.kylin/kylin-source-kafka/1.6.1-SNAPSHOT/kylin-source-kafka-1.6.1-SNAPSHOT.pom
[JENKINS] Archiving <https://builds.apache.org/job/Kylin-Master-SonarQube/ws/query/pom.xml> to org.apache.kylin/kylin-query/1.6.1-SNAPSHOT/kylin-query-1.6.1-SNAPSHOT.pom
[JENKINS] Archiving <https://builds.apache.org/job/Kylin-Master-SonarQube/ws/kylin-it/pom.xml> to org.apache.kylin/kylin-it/1.6.1-SNAPSHOT/kylin-it-1.6.1-SNAPSHOT.pom
No prior successful build to compare, so performing full copy of artifacts
[JENKINS] Archiving <https://builds.apache.org/job/Kylin-Master-SonarQube/ws/core-dictionary/pom.xml> to org.apache.kylin/kylin-core-dictionary/1.6.1-SNAPSHOT/kylin-core-dictionary-1.6.1-SNAPSHOT.pom
[JENKINS] Archiving <https://builds.apache.org/job/Kylin-Master-SonarQube/ws/core-storage/pom.xml> to org.apache.kylin/kylin-core-storage/1.6.1-SNAPSHOT/kylin-core-storage-1.6.1-SNAPSHOT.pom
[JENKINS] Archiving <https://builds.apache.org/job/Kylin-Master-SonarQube/ws/engine-mr/pom.xml> to org.apache.kylin/kylin-engine-mr/1.6.1-SNAPSHOT/kylin-engine-mr-1.6.1-SNAPSHOT.pom
channel stopped