You are viewing a plain text version of this content. The canonical link for it is here.
Posted to builds@hbase.apache.org by Apache Jenkins Server <je...@builds.apache.org> on 2024/07/28 08:09:29 UTC
Build failed in Jenkins: HBase-Nightly-s390x #482
See <https://ci-hbase.apache.org/job/HBase-Nightly-s390x/482/display/redirect>
Changes:
------------------------------------------
Started by user Duo Zhang
Running as SYSTEM
Building remotely on jenkins-s390x-6 (s390x) in workspace <https://ci-hbase.apache.org/job/HBase-Nightly-s390x/ws/>
The recommended git tool is: NONE
No credentials specified
> git rev-parse --resolve-git-dir <https://ci-hbase.apache.org/job/HBase-Nightly-s390x/ws/.git> # timeout=10
Fetching changes from the remote Git repository
> git config remote.origin.url https://github.com/apache/hbase.git # timeout=10
Fetching upstream changes from https://github.com/apache/hbase.git
> git --version # timeout=10
> git --version # 'git version 2.34.1'
> git fetch --tags --force --progress -- https://github.com/apache/hbase.git +refs/heads/*:refs/remotes/origin/* # timeout=10
> git rev-parse refs/remotes/origin/master^{commit} # timeout=10
Checking out Revision 836f2d9a5b3ae013ecd84efb457bf7ff20cdd997 (refs/remotes/origin/master)
> git config core.sparsecheckout # timeout=10
> git checkout -f 836f2d9a5b3ae013ecd84efb457bf7ff20cdd997 # timeout=10
Commit message: "HBASE-28719 Use ExtendedCell in WALEdit (#6108)"
> git rev-list --no-walk 836f2d9a5b3ae013ecd84efb457bf7ff20cdd997 # timeout=10
[HBase-Nightly-s390x] $ /bin/bash /tmp/jenkins15665079133243506140.sh
getting machine specs, find in https://ci-hbase.apache.org/job/HBase-Nightly-s390x/482//artifact/output/machine/
Running mvn install...
Running mvn test...
Build step 'Execute shell' marked build as failure
Archiving artifacts
Recording test results
[Checks API] No suitable checks publisher found.
Jenkins build is back to normal : HBase-Nightly-s390x #490
Posted by Apache Jenkins Server <je...@builds.apache.org>.
See <https://ci-hbase.apache.org/job/HBase-Nightly-s390x/490/display/redirect>
Build failed in Jenkins: HBase-Nightly-s390x #489
Posted by Apache Jenkins Server <je...@builds.apache.org>.
See <https://ci-hbase.apache.org/job/HBase-Nightly-s390x/489/display/redirect?page=changes>
Changes:
[noreply] HBASE-28648 Change the deprecation cycle for RegionObserver.postInstantiateDeleteTracker (#6133)
------------------------------------------
[...truncated 1.78 MB...]
WARNING: System::setSecurityManager will be removed in a future release
[[1;34mINFO[m] Running org.apache.hadoop.hbase.snapshot.[1mTestMobRestoreFlushSnapshotFromClient[m
WARNING: A terminally deprecated method in java.lang.System has been called
WARNING: System::setSecurityManager has been called by org.apache.hadoop.hbase.SystemExitRule$1 (file:/home/jenkins/jenkins-home/70ad3735/workspace/HBase-Nightly-s390x/hbase-common/target/test-classes/)
WARNING: Please consider reporting this to the maintainers of org.apache.hadoop.hbase.SystemExitRule$1
WARNING: System::setSecurityManager will be removed in a future release
[[1;31mERROR[m] [1;31mTests [0;1mrun: [0;1m4[m, Failures: 0, [1;31mErrors: [0;1;31m2[m, Skipped: 0, Time elapsed: 733.159 s[1;31m <<< FAILURE![m - in org.apache.hadoop.hbase.snapshot.[1mTestMobRestoreFlushSnapshotFromClient[m
[[1;31mERROR[m] org.apache.hadoop.hbase.snapshot.TestMobRestoreFlushSnapshotFromClient Time elapsed: 164.606 s <<< ERROR!
org.junit.runners.model.TestTimedOutException: test timed out after 780 seconds
at java.base@17.0.7/java.lang.Object.wait(Native Method)
at java.base@17.0.7/java.lang.Object.wait(Object.java:338)
at app//org.apache.hadoop.hbase.client.AsyncTableResultScanner.next(AsyncTableResultScanner.java:176)
at app//org.apache.hadoop.hbase.snapshot.MobSnapshotTestingUtils.countMobRows(MobSnapshotTestingUtils.java:132)
at app//org.apache.hadoop.hbase.snapshot.MobSnapshotTestingUtils.verifyMobRowCount(MobSnapshotTestingUtils.java:148)
at app//org.apache.hadoop.hbase.snapshot.TestMobRestoreFlushSnapshotFromClient.verifyRowCount(TestMobRestoreFlushSnapshotFromClient.java:68)
at app//org.apache.hadoop.hbase.snapshot.TestRestoreFlushSnapshotFromClient.testRestoreSnapshot(TestRestoreFlushSnapshotFromClient.java:154)
at java.base@17.0.7/jdk.internal.reflect.NativeMethodAccessorImpl.invoke0(Native Method)
at java.base@17.0.7/jdk.internal.reflect.NativeMethodAccessorImpl.invoke(NativeMethodAccessorImpl.java:77)
at java.base@17.0.7/jdk.internal.reflect.DelegatingMethodAccessorImpl.invoke(DelegatingMethodAccessorImpl.java:43)
at java.base@17.0.7/java.lang.reflect.Method.invoke(Method.java:568)
at app//org.junit.runners.model.FrameworkMethod$1.runReflectiveCall(FrameworkMethod.java:59)
at app//org.junit.internal.runners.model.ReflectiveCallable.run(ReflectiveCallable.java:12)
at app//org.junit.runners.model.FrameworkMethod.invokeExplosively(FrameworkMethod.java:56)
at app//org.junit.internal.runners.statements.InvokeMethod.evaluate(InvokeMethod.java:17)
at app//org.junit.internal.runners.statements.RunBefores.evaluate(RunBefores.java:26)
at app//org.junit.internal.runners.statements.RunAfters.evaluate(RunAfters.java:27)
at app//org.junit.runners.ParentRunner$3.evaluate(ParentRunner.java:306)
at app//org.junit.runners.BlockJUnit4ClassRunner$1.evaluate(BlockJUnit4ClassRunner.java:100)
at app//org.junit.runners.ParentRunner.runLeaf(ParentRunner.java:366)
at app//org.junit.runners.BlockJUnit4ClassRunner.runChild(BlockJUnit4ClassRunner.java:103)
at app//org.junit.runners.BlockJUnit4ClassRunner.runChild(BlockJUnit4ClassRunner.java:63)
at app//org.junit.runners.ParentRunner$4.run(ParentRunner.java:331)
at app//org.junit.runners.ParentRunner$1.schedule(ParentRunner.java:79)
at app//org.junit.runners.ParentRunner.runChildren(ParentRunner.java:329)
at app//org.junit.runners.ParentRunner.access$100(ParentRunner.java:66)
at app//org.junit.runners.ParentRunner$2.evaluate(ParentRunner.java:293)
at app//org.junit.internal.runners.statements.RunBefores.evaluate(RunBefores.java:26)
at app//org.junit.internal.runners.statements.RunAfters.evaluate(RunAfters.java:27)
at app//org.junit.internal.runners.statements.FailOnTimeout$CallableStatement.call(FailOnTimeout.java:299)
at app//org.junit.internal.runners.statements.FailOnTimeout$CallableStatement.call(FailOnTimeout.java:293)
at java.base@17.0.7/java.util.concurrent.FutureTask.run(FutureTask.java:264)
at java.base@17.0.7/java.lang.Thread.run(Thread.java:833)
[[1;31mERROR[m] org.apache.hadoop.hbase.snapshot.TestMobRestoreFlushSnapshotFromClient Time elapsed: 164.636 s <<< ERROR!
java.lang.Exception: Appears to be stuck in thread MiniHBaseClusterRegionServer-EventLoopGroup-5-1
at java.base@17.0.7/sun.nio.ch.EPoll.wait(Native Method)
at java.base@17.0.7/sun.nio.ch.EPollSelectorImpl.doSelect(EPollSelectorImpl.java:118)
at java.base@17.0.7/sun.nio.ch.SelectorImpl.lockAndDoSelect(SelectorImpl.java:129)
at java.base@17.0.7/sun.nio.ch.SelectorImpl.select(SelectorImpl.java:141)
at app//org.apache.hbase.thirdparty.io.netty.channel.nio.SelectedSelectionKeySetSelector.select(SelectedSelectionKeySetSelector.java:62)
at app//org.apache.hbase.thirdparty.io.netty.channel.nio.NioEventLoop.select(NioEventLoop.java:883)
at app//org.apache.hbase.thirdparty.io.netty.channel.nio.NioEventLoop.run(NioEventLoop.java:526)
at app//org.apache.hbase.thirdparty.io.netty.util.concurrent.SingleThreadEventExecutor$4.run(SingleThreadEventExecutor.java:997)
at app//org.apache.hbase.thirdparty.io.netty.util.internal.ThreadExecutorMap$2.run(ThreadExecutorMap.java:74)
at app//org.apache.hbase.thirdparty.io.netty.util.concurrent.FastThreadLocalRunnable.run(FastThreadLocalRunnable.java:30)
at java.base@17.0.7/java.lang.Thread.run(Thread.java:833)
WARNING: A terminally deprecated method in java.lang.System has been called
WARNING: System::setSecurityManager has been called by org.apache.hadoop.hbase.SystemExitRule (file:/home/jenkins/jenkins-home/70ad3735/workspace/HBase-Nightly-s390x/hbase-common/target/test-classes/)
WARNING: Please consider reporting this to the maintainers of org.apache.hadoop.hbase.SystemExitRule
WARNING: System::setSecurityManager will be removed in a future release
[[1;34mINFO[m] Running org.apache.hadoop.hbase.snapshot.[1mTestSnapshotClientRetries[m
WARNING: A terminally deprecated method in java.lang.System has been called
WARNING: System::setSecurityManager has been called by org.apache.hadoop.hbase.SystemExitRule$1 (file:/home/jenkins/jenkins-home/70ad3735/workspace/HBase-Nightly-s390x/hbase-common/target/test-classes/)
WARNING: Please consider reporting this to the maintainers of org.apache.hadoop.hbase.SystemExitRule$1
WARNING: System::setSecurityManager will be removed in a future release
[[1;34mINFO[m] [1;32mTests run: [0;1;32m2[m, Failures: 0, Errors: 0, Skipped: 0, Time elapsed: 78.923 s - in org.apache.hadoop.hbase.snapshot.[1mTestSnapshotClientRetries[m
WARNING: A terminally deprecated method in java.lang.System has been called
WARNING: System::setSecurityManager has been called by org.apache.hadoop.hbase.SystemExitRule (file:/home/jenkins/jenkins-home/70ad3735/workspace/HBase-Nightly-s390x/hbase-common/target/test-classes/)
WARNING: Please consider reporting this to the maintainers of org.apache.hadoop.hbase.SystemExitRule
WARNING: System::setSecurityManager will be removed in a future release
[[1;34mINFO[m] Running org.apache.hadoop.hbase.snapshot.[1mTestRestoreSnapshotHelper[m
WARNING: A terminally deprecated method in java.lang.System has been called
WARNING: System::setSecurityManager has been called by org.apache.hadoop.hbase.SystemExitRule$1 (file:/home/jenkins/jenkins-home/70ad3735/workspace/HBase-Nightly-s390x/hbase-common/target/test-classes/)
WARNING: Please consider reporting this to the maintainers of org.apache.hadoop.hbase.SystemExitRule$1
WARNING: System::setSecurityManager will be removed in a future release
[[1;34mINFO[m] [1;32mTests run: [0;1;32m5[m, Failures: 0, Errors: 0, Skipped: 0, Time elapsed: 104.288 s - in org.apache.hadoop.hbase.snapshot.[1mTestRestoreSnapshotHelper[m
WARNING: A terminally deprecated method in java.lang.System has been called
WARNING: System::setSecurityManager has been called by org.apache.hadoop.hbase.SystemExitRule (file:/home/jenkins/jenkins-home/70ad3735/workspace/HBase-Nightly-s390x/hbase-common/target/test-classes/)
WARNING: Please consider reporting this to the maintainers of org.apache.hadoop.hbase.SystemExitRule
WARNING: System::setSecurityManager will be removed in a future release
[[1;34mINFO[m] Running org.apache.hadoop.hbase.ipc.[1mTestNettyTlsIPC[m
WARNING: A terminally deprecated method in java.lang.System has been called
WARNING: System::setSecurityManager has been called by org.apache.hadoop.hbase.SystemExitRule$1 (file:/home/jenkins/jenkins-home/70ad3735/workspace/HBase-Nightly-s390x/hbase-common/target/test-classes/)
WARNING: Please consider reporting this to the maintainers of org.apache.hadoop.hbase.SystemExitRule$1
WARNING: System::setSecurityManager will be removed in a future release
[[1;31mERROR[m] [1;31mTests [0;1mrun: [0;1m408[m, [1;31mFailures: [0;1;31m2[m, Errors: 0, Skipped: 0, Time elapsed: 244.114 s[1;31m <<< FAILURE![m - in org.apache.hadoop.hbase.ipc.[1mTestNettyTlsIPC[m
[[1;31mERROR[m] org.apache.hadoop.hbase.ipc.TestNettyTlsIPC.testTimeout[0: rpcServerImpl=class org.apache.hadoop.hbase.ipc.NettyRpcServer, caKeyType=RSA, certKeyType=RSA, keyPassword=[C@2c88b9fc, acceptPlainText=false, clientTlsEnabled=true] Time elapsed: 1.661 s <<< FAILURE!
java.lang.AssertionError
at org.junit.Assert.fail(Assert.java:87)
at org.junit.Assert.assertTrue(Assert.java:42)
at org.junit.Assert.assertTrue(Assert.java:53)
at org.apache.hadoop.hbase.ipc.AbstractTestIPC.testTimeout(AbstractTestIPC.java:353)
at java.base/jdk.internal.reflect.NativeMethodAccessorImpl.invoke0(Native Method)
at java.base/jdk.internal.reflect.NativeMethodAccessorImpl.invoke(NativeMethodAccessorImpl.java:77)
at java.base/jdk.internal.reflect.DelegatingMethodAccessorImpl.invoke(DelegatingMethodAccessorImpl.java:43)
at java.base/java.lang.reflect.Method.invoke(Method.java:568)
at org.junit.runners.model.FrameworkMethod$1.runReflectiveCall(FrameworkMethod.java:59)
at org.junit.internal.runners.model.ReflectiveCallable.run(ReflectiveCallable.java:12)
at org.junit.runners.model.FrameworkMethod.invokeExplosively(FrameworkMethod.java:56)
at org.junit.internal.runners.statements.InvokeMethod.evaluate(InvokeMethod.java:17)
at org.junit.internal.runners.statements.RunBefores.evaluate(RunBefores.java:26)
at org.junit.internal.runners.statements.RunAfters.evaluate(RunAfters.java:27)
at org.junit.rules.ExternalResource$1.evaluate(ExternalResource.java:54)
at org.junit.runners.ParentRunner$3.evaluate(ParentRunner.java:306)
at org.junit.runners.BlockJUnit4ClassRunner$1.evaluate(BlockJUnit4ClassRunner.java:100)
at org.junit.runners.ParentRunner.runLeaf(ParentRunner.java:366)
at org.junit.runners.BlockJUnit4ClassRunner.runChild(BlockJUnit4ClassRunner.java:103)
at org.junit.runners.BlockJUnit4ClassRunner.runChild(BlockJUnit4ClassRunner.java:63)
at org.junit.runners.ParentRunner$4.run(ParentRunner.java:331)
at org.junit.runners.ParentRunner$1.schedule(ParentRunner.java:79)
at org.junit.runners.ParentRunner.runChildren(ParentRunner.java:329)
at org.junit.runners.ParentRunner.access$100(ParentRunner.java:66)
at org.junit.runners.ParentRunner$2.evaluate(ParentRunner.java:293)
at org.junit.runners.ParentRunner.run(ParentRunner.java:413)
at org.junit.runners.Suite.runChild(Suite.java:128)
at org.junit.runners.Suite.runChild(Suite.java:27)
at org.junit.runners.ParentRunner$4.run(ParentRunner.java:331)
at org.junit.runners.ParentRunner$1.schedule(ParentRunner.java:79)
at org.junit.runners.ParentRunner.runChildren(ParentRunner.java:329)
at org.junit.runners.ParentRunner.access$100(ParentRunner.java:66)
at org.junit.runners.ParentRunner$2.evaluate(ParentRunner.java:293)
at org.junit.internal.runners.statements.RunBefores.evaluate(RunBefores.java:26)
at org.junit.internal.runners.statements.RunAfters.evaluate(RunAfters.java:27)
at org.junit.internal.runners.statements.FailOnTimeout$CallableStatement.call(FailOnTimeout.java:299)
at org.junit.internal.runners.statements.FailOnTimeout$CallableStatement.call(FailOnTimeout.java:293)
at java.base/java.util.concurrent.FutureTask.run(FutureTask.java:264)
at java.base/java.lang.Thread.run(Thread.java:833)
[[1;31mERROR[m] org.apache.hadoop.hbase.ipc.TestNettyTlsIPC.testAsyncTimeout[8: rpcServerImpl=class org.apache.hadoop.hbase.ipc.NettyRpcServer, caKeyType=RSA, certKeyType=EC, keyPassword=[C@6111ba37, acceptPlainText=true, clientTlsEnabled=false] Time elapsed: 0.677 s <<< FAILURE!
java.lang.AssertionError
at org.junit.Assert.fail(Assert.java:87)
at org.junit.Assert.assertTrue(Assert.java:42)
at org.junit.Assert.assertTrue(Assert.java:53)
at org.apache.hadoop.hbase.ipc.AbstractTestIPC.testAsyncTimeout(AbstractTestIPC.java:509)
at java.base/jdk.internal.reflect.NativeMethodAccessorImpl.invoke0(Native Method)
at java.base/jdk.internal.reflect.NativeMethodAccessorImpl.invoke(NativeMethodAccessorImpl.java:77)
at java.base/jdk.internal.reflect.DelegatingMethodAccessorImpl.invoke(DelegatingMethodAccessorImpl.java:43)
at java.base/java.lang.reflect.Method.invoke(Method.java:568)
at org.junit.runners.model.FrameworkMethod$1.runReflectiveCall(FrameworkMethod.java:59)
at org.junit.internal.runners.model.ReflectiveCallable.run(ReflectiveCallable.java:12)
at org.junit.runners.model.FrameworkMethod.invokeExplosively(FrameworkMethod.java:56)
at org.junit.internal.runners.statements.InvokeMethod.evaluate(InvokeMethod.java:17)
at org.junit.internal.runners.statements.RunBefores.evaluate(RunBefores.java:26)
at org.junit.internal.runners.statements.RunAfters.evaluate(RunAfters.java:27)
at org.junit.rules.ExternalResource$1.evaluate(ExternalResource.java:54)
at org.junit.runners.ParentRunner$3.evaluate(ParentRunner.java:306)
at org.junit.runners.BlockJUnit4ClassRunner$1.evaluate(BlockJUnit4ClassRunner.java:100)
at org.junit.runners.ParentRunner.runLeaf(ParentRunner.java:366)
at org.junit.runners.BlockJUnit4ClassRunner.runChild(BlockJUnit4ClassRunner.java:103)
at org.junit.runners.BlockJUnit4ClassRunner.runChild(BlockJUnit4ClassRunner.java:63)
at org.junit.runners.ParentRunner$4.run(ParentRunner.java:331)
at org.junit.runners.ParentRunner$1.schedule(ParentRunner.java:79)
at org.junit.runners.ParentRunner.runChildren(ParentRunner.java:329)
at org.junit.runners.ParentRunner.access$100(ParentRunner.java:66)
at org.junit.runners.ParentRunner$2.evaluate(ParentRunner.java:293)
at org.junit.runners.ParentRunner.run(ParentRunner.java:413)
at org.junit.runners.Suite.runChild(Suite.java:128)
at org.junit.runners.Suite.runChild(Suite.java:27)
at org.junit.runners.ParentRunner$4.run(ParentRunner.java:331)
at org.junit.runners.ParentRunner$1.schedule(ParentRunner.java:79)
at org.junit.runners.ParentRunner.runChildren(ParentRunner.java:329)
at org.junit.runners.ParentRunner.access$100(ParentRunner.java:66)
at org.junit.runners.ParentRunner$2.evaluate(ParentRunner.java:293)
at org.junit.internal.runners.statements.RunBefores.evaluate(RunBefores.java:26)
at org.junit.internal.runners.statements.RunAfters.evaluate(RunAfters.java:27)
at org.junit.internal.runners.statements.FailOnTimeout$CallableStatement.call(FailOnTimeout.java:299)
at org.junit.internal.runners.statements.FailOnTimeout$CallableStatement.call(FailOnTimeout.java:293)
at java.base/java.util.concurrent.FutureTask.run(FutureTask.java:264)
at java.base/java.lang.Thread.run(Thread.java:833)
WARNING: A terminally deprecated method in java.lang.System has been called
WARNING: System::setSecurityManager has been called by org.apache.hadoop.hbase.SystemExitRule (file:/home/jenkins/jenkins-home/70ad3735/workspace/HBase-Nightly-s390x/hbase-common/target/test-classes/)
WARNING: Please consider reporting this to the maintainers of org.apache.hadoop.hbase.SystemExitRule
WARNING: System::setSecurityManager will be removed in a future release
[[1;34mINFO[m] Running org.apache.hadoop.hbase.ipc.[1mTestNettyChannelWritability[m
WARNING: A terminally deprecated method in java.lang.System has been called
WARNING: System::setSecurityManager has been called by org.apache.hadoop.hbase.SystemExitRule$1 (file:/home/jenkins/jenkins-home/70ad3735/workspace/HBase-Nightly-s390x/hbase-common/target/test-classes/)
WARNING: Please consider reporting this to the maintainers of org.apache.hadoop.hbase.SystemExitRule$1
WARNING: System::setSecurityManager will be removed in a future release
[[1;34mINFO[m] [1;32mTests run: [0;1;32m2[m, Failures: 0, Errors: 0, Skipped: 0, Time elapsed: 7.052 s - in org.apache.hadoop.hbase.ipc.[1mTestNettyChannelWritability[m
WARNING: A terminally deprecated method in java.lang.System has been called
WARNING: System::setSecurityManager has been called by org.apache.hadoop.hbase.SystemExitRule (file:/home/jenkins/jenkins-home/70ad3735/workspace/HBase-Nightly-s390x/hbase-common/target/test-classes/)
WARNING: Please consider reporting this to the maintainers of org.apache.hadoop.hbase.SystemExitRule
WARNING: System::setSecurityManager will be removed in a future release
[[1;34mINFO[m] Running org.apache.hadoop.hbase.ipc.[1mTestRpcServerSlowConnectionSetup[m
FATAL: command execution failed
java.io.EOFException
at java.base/java.io.ObjectInputStream$PeekInputStream.readFully(ObjectInputStream.java:2911)
at java.base/java.io.ObjectInputStream$BlockDataInputStream.readShort(ObjectInputStream.java:3406)
at java.base/java.io.ObjectInputStream.readStreamHeader(ObjectInputStream.java:932)
at java.base/java.io.ObjectInputStream.<init>(ObjectInputStream.java:375)
at hudson.remoting.ObjectInputStreamEx.<init>(ObjectInputStreamEx.java:49)
at hudson.remoting.Command.readFrom(Command.java:142)
at hudson.remoting.Command.readFrom(Command.java:128)
at hudson.remoting.AbstractSynchronousByteArrayCommandTransport.read(AbstractSynchronousByteArrayCommandTransport.java:35)
at hudson.remoting.SynchronousCommandTransport$ReaderThread.run(SynchronousCommandTransport.java:61)
Caused: java.io.IOException: Unexpected termination of the channel
at hudson.remoting.SynchronousCommandTransport$ReaderThread.run(SynchronousCommandTransport.java:75)
Caused: java.io.IOException: Backing channel 'jenkins-s390x-1' is disconnected.
at hudson.remoting.RemoteInvocationHandler.channelOrFail(RemoteInvocationHandler.java:215)
at hudson.remoting.RemoteInvocationHandler.invoke(RemoteInvocationHandler.java:285)
at com.sun.proxy.$Proxy206.isAlive(Unknown Source)
at hudson.Launcher$RemoteLauncher$ProcImpl.isAlive(Launcher.java:1212)
at hudson.Launcher$RemoteLauncher$ProcImpl.join(Launcher.java:1204)
at hudson.tasks.CommandInterpreter.join(CommandInterpreter.java:195)
at hudson.tasks.CommandInterpreter.perform(CommandInterpreter.java:145)
at hudson.tasks.CommandInterpreter.perform(CommandInterpreter.java:92)
at hudson.tasks.BuildStepMonitor$1.perform(BuildStepMonitor.java:20)
at hudson.model.AbstractBuild$AbstractBuildExecution.perform(AbstractBuild.java:818)
at hudson.model.Build$BuildExecution.build(Build.java:199)
at hudson.model.Build$BuildExecution.doRun(Build.java:164)
at hudson.model.AbstractBuild$AbstractBuildExecution.run(AbstractBuild.java:526)
at hudson.model.Run.execute(Run.java:1841)
at hudson.model.FreeStyleBuild.run(FreeStyleBuild.java:44)
at hudson.model.ResourceController.execute(ResourceController.java:101)
at hudson.model.Executor.run(Executor.java:442)
FATAL: Unable to delete script file /tmp/jenkins4305375414273318806.sh
java.io.EOFException
at java.base/java.io.ObjectInputStream$PeekInputStream.readFully(ObjectInputStream.java:2911)
at java.base/java.io.ObjectInputStream$BlockDataInputStream.readShort(ObjectInputStream.java:3406)
at java.base/java.io.ObjectInputStream.readStreamHeader(ObjectInputStream.java:932)
at java.base/java.io.ObjectInputStream.<init>(ObjectInputStream.java:375)
at hudson.remoting.ObjectInputStreamEx.<init>(ObjectInputStreamEx.java:49)
at hudson.remoting.Command.readFrom(Command.java:142)
at hudson.remoting.Command.readFrom(Command.java:128)
at hudson.remoting.AbstractSynchronousByteArrayCommandTransport.read(AbstractSynchronousByteArrayCommandTransport.java:35)
at hudson.remoting.SynchronousCommandTransport$ReaderThread.run(SynchronousCommandTransport.java:61)
Caused: java.io.IOException: Unexpected termination of the channel
at hudson.remoting.SynchronousCommandTransport$ReaderThread.run(SynchronousCommandTransport.java:75)
Caused: hudson.remoting.ChannelClosedException: Channel "hudson.remoting.Channel@27420d1b:jenkins-s390x-1": Remote call on jenkins-s390x-1 failed. The channel is closing down or has closed down
at hudson.remoting.Channel.call(Channel.java:996)
at hudson.FilePath.act(FilePath.java:1230)
at hudson.FilePath.act(FilePath.java:1219)
at hudson.FilePath.delete(FilePath.java:1766)
at hudson.tasks.CommandInterpreter.perform(CommandInterpreter.java:163)
at hudson.tasks.CommandInterpreter.perform(CommandInterpreter.java:92)
at hudson.tasks.BuildStepMonitor$1.perform(BuildStepMonitor.java:20)
at hudson.model.AbstractBuild$AbstractBuildExecution.perform(AbstractBuild.java:818)
at hudson.model.Build$BuildExecution.build(Build.java:199)
at hudson.model.Build$BuildExecution.doRun(Build.java:164)
at hudson.model.AbstractBuild$AbstractBuildExecution.run(AbstractBuild.java:526)
at hudson.model.Run.execute(Run.java:1841)
at hudson.model.FreeStyleBuild.run(FreeStyleBuild.java:44)
at hudson.model.ResourceController.execute(ResourceController.java:101)
at hudson.model.Executor.run(Executor.java:442)
Build step 'Execute shell' marked build as failure
ERROR: Step ‘Archive the artifacts’ failed: no workspace for HBase-Nightly-s390x #489
ERROR: Step ‘Publish JUnit test result report’ failed: no workspace for HBase-Nightly-s390x #489
Jenkins build is still unstable: HBase-Nightly-s390x #488
Posted by Apache Jenkins Server <je...@builds.apache.org>.
See <https://ci-hbase.apache.org/job/HBase-Nightly-s390x/488/display/redirect?page=changes>
Jenkins build is still unstable: HBase-Nightly-s390x #487
Posted by Apache Jenkins Server <je...@builds.apache.org>.
See <https://ci-hbase.apache.org/job/HBase-Nightly-s390x/487/display/redirect?page=changes>
Jenkins build is still unstable: HBase-Nightly-s390x #486
Posted by Apache Jenkins Server <je...@builds.apache.org>.
See <https://ci-hbase.apache.org/job/HBase-Nightly-s390x/486/display/redirect?page=changes>
Jenkins build is still unstable: HBase-Nightly-s390x #485
Posted by Apache Jenkins Server <je...@builds.apache.org>.
See <https://ci-hbase.apache.org/job/HBase-Nightly-s390x/485/display/redirect>
Jenkins build is still unstable: HBase-Nightly-s390x #484
Posted by Apache Jenkins Server <je...@builds.apache.org>.
See <https://ci-hbase.apache.org/job/HBase-Nightly-s390x/484/display/redirect>
Jenkins build is unstable: HBase-Nightly-s390x #483
Posted by Apache Jenkins Server <je...@builds.apache.org>.
See <https://ci-hbase.apache.org/job/HBase-Nightly-s390x/483/display/redirect>