You are viewing a plain text version of this content. The canonical link for it is here.
Posted to dev@any23.apache.org by Apache Jenkins Server <je...@builds.apache.org> on 2013/03/16 10:03:27 UTC
Build failed in Jenkins: Any23-trunk #512
See <https://builds.apache.org/job/Any23-trunk/512/>
------------------------------------------
[...truncated 5361 lines...]
[INFO] Retrieving previous build number from apache.snapshots.https
Uploading: https://repository.apache.org/content/repositories/snapshots/org/apache/any23/plugins/apache-any23-basic-crawler/1.0.1-SNAPSHOT/apache-any23-basic-crawler-1.0.1-20130316.074404-154.zip
2530K uploaded (apache-any23-basic-crawler-1.0.1-20130316.074404-154.zip)
[INFO] Retrieving previous build number from apache.snapshots.https
Uploading: https://repository.apache.org/content/repositories/snapshots/org/apache/any23/plugins/apache-any23-basic-crawler/1.0.1-SNAPSHOT/apache-any23-basic-crawler-1.0.1-20130316.074404-154-tests.jar
9K uploaded (apache-any23-basic-crawler-1.0.1-20130316.074404-154-tests.jar)
[JENKINS] Archiving <https://builds.apache.org/job/Any23-trunk/ws/plugins/basic-crawler/pom.xml> to /home/hudson/hudson/jobs/Any23-trunk/modules/org.apache.any23.plugins$apache-any23-basic-crawler/builds/2013-03-16_07-36-10/archive/org.apache.any23.plugins/apache-any23-basic-crawler/1.0.1-SNAPSHOT/apache-any23-basic-crawler-1.0.1-SNAPSHOT.pom
[JENKINS] Archiving <https://builds.apache.org/job/Any23-trunk/ws/plugins/basic-crawler/target/apache-any23-basic-crawler-1.0.1-SNAPSHOT.jar> to /home/hudson/hudson/jobs/Any23-trunk/modules/org.apache.any23.plugins$apache-any23-basic-crawler/builds/2013-03-16_07-36-10/archive/org.apache.any23.plugins/apache-any23-basic-crawler/1.0.1-20130316.074404-154/apache-any23-basic-crawler-1.0.1-20130316.074404-154.jar
[JENKINS] Archiving <https://builds.apache.org/job/Any23-trunk/ws/plugins/basic-crawler/target/apache-any23-basic-crawler-1.0.1-SNAPSHOT.tar.gz> to /home/hudson/hudson/jobs/Any23-trunk/modules/org.apache.any23.plugins$apache-any23-basic-crawler/builds/2013-03-16_07-36-10/archive/org.apache.any23.plugins/apache-any23-basic-crawler/1.0.1-20130316.074404-154/apache-any23-basic-crawler-1.0.1-20130316.074404-154.tar.gz
[JENKINS] Archiving <https://builds.apache.org/job/Any23-trunk/ws/plugins/basic-crawler/target/apache-any23-basic-crawler-1.0.1-SNAPSHOT.zip> to /home/hudson/hudson/jobs/Any23-trunk/modules/org.apache.any23.plugins$apache-any23-basic-crawler/builds/2013-03-16_07-36-10/archive/org.apache.any23.plugins/apache-any23-basic-crawler/1.0.1-20130316.074404-154/apache-any23-basic-crawler-1.0.1-20130316.074404-154.zip
[JENKINS] Archiving <https://builds.apache.org/job/Any23-trunk/ws/plugins/basic-crawler/target/apache-any23-basic-crawler-1.0.1-SNAPSHOT-tests.jar> to /home/hudson/hudson/jobs/Any23-trunk/modules/org.apache.any23.plugins$apache-any23-basic-crawler/builds/2013-03-16_07-36-10/archive/org.apache.any23.plugins/apache-any23-basic-crawler/1.0.1-20130316.074404-154/apache-any23-basic-crawler-1.0.1-20130316.074404-154-tests.jar
[INFO] ------------------------------------------------------------------------
[INFO] Building Apache Any23 :: Plugins :: HTML Scraper
[INFO] task-segment: [clean, deploy]
[INFO] ------------------------------------------------------------------------
[INFO] [clean:clean {execution: default-clean}]
[INFO] [cobertura:clean {execution: default}]
[INFO] [buildnumber:create {execution: default}]
[INFO] Checking for local modifications: skipped.
[INFO] Updating project files from SCM: skipped.
[INFO] Executing: /bin/sh -c cd <https://builds.apache.org/job/Any23-trunk/ws/plugins/html-scraper> && svn --non-interactive info
[INFO] Working directory: <https://builds.apache.org/job/Any23-trunk/ws/plugins/html-scraper>
[INFO] Storing buildNumber: 1435999 at timestamp: 1363424028124
[INFO] Executing: /bin/sh -c cd <https://builds.apache.org/job/Any23-trunk/ws/plugins/html-scraper> && svn --non-interactive info
[INFO] Working directory: <https://builds.apache.org/job/Any23-trunk/ws/plugins/html-scraper>
[INFO] Storing buildScmBranch: trunk
[debug] execute contextualize
[INFO] [resources:resources {execution: default-resources}]
[INFO] Using 'UTF-8' encoding to copy filtered resources.
[INFO] Copying 2 resources to META-INF
[INFO] [compiler:compile {execution: default-compile}]
[INFO] Compiling 3 source files to <https://builds.apache.org/job/Any23-trunk/ws/plugins/html-scraper/target/classes>
[debug] execute contextualize
[INFO] [resources:testResources {execution: default-testResources}]
[INFO] Using 'UTF-8' encoding to copy filtered resources.
[INFO] Copying 1 resource
[INFO] [compiler:testCompile {execution: default-testCompile}]
[INFO] Compiling 1 source file to <https://builds.apache.org/job/Any23-trunk/ws/plugins/html-scraper/target/test-classes>
[INFO] [surefire:test {execution: default-test}]
[INFO] Surefire report directory: <https://builds.apache.org/job/Any23-trunk/ws/plugins/html-scraper/target/surefire-reports>
-------------------------------------------------------
T E S T S
-------------------------------------------------------
Running org.apache.any23.plugin.htmlscraper.HTMLScraperExtractorTest
SLF4J: Failed to load class "org.slf4j.impl.StaticLoggerBinder".
SLF4J: Defaulting to no-operation (NOP) logger implementation
SLF4J: See http://www.slf4j.org/codes.html#StaticLoggerBinder for further details.
Tests run: 2, Failures: 0, Errors: 0, Skipped: 0, Time elapsed: 0.588 sec
Results :
Tests run: 2, Failures: 0, Errors: 0, Skipped: 0
[JENKINS] Recording test results
[INFO] [jar:jar {execution: default-jar}]
[INFO] Building jar: <https://builds.apache.org/job/Any23-trunk/ws/plugins/html-scraper/target/apache-any23-html-scraper-1.0.2-SNAPSHOT.jar>
[INFO] [assembly:single {execution: assembly}]
[INFO] Reading assembly descriptor: <https://builds.apache.org/job/Any23-trunk/ws/plugins/html-scraper/src/main/assembly/bin.xml>
[INFO] Building tar: <https://builds.apache.org/job/Any23-trunk/ws/plugins/html-scraper/target/apache-any23-html-scraper-1.0.2-SNAPSHOT.tar.gz>
[INFO] Building zip: <https://builds.apache.org/job/Any23-trunk/ws/plugins/html-scraper/target/apache-any23-html-scraper-1.0.2-SNAPSHOT.zip>
[INFO] [install:install {execution: default-install}]
[INFO] Installing <https://builds.apache.org/job/Any23-trunk/ws/plugins/html-scraper/target/apache-any23-html-scraper-1.0.2-SNAPSHOT.jar> to /export/home/hudson/hudson-slave/maven-repositories/1/org/apache/any23/plugins/apache-any23-html-scraper/1.0.2-SNAPSHOT/apache-any23-html-scraper-1.0.2-SNAPSHOT.jar
[INFO] Installing <https://builds.apache.org/job/Any23-trunk/ws/plugins/html-scraper/target/apache-any23-html-scraper-1.0.2-SNAPSHOT.tar.gz> to /export/home/hudson/hudson-slave/maven-repositories/1/org/apache/any23/plugins/apache-any23-html-scraper/1.0.2-SNAPSHOT/apache-any23-html-scraper-1.0.2-SNAPSHOT.tar.gz
[INFO] Installing <https://builds.apache.org/job/Any23-trunk/ws/plugins/html-scraper/target/apache-any23-html-scraper-1.0.2-SNAPSHOT.zip> to /export/home/hudson/hudson-slave/maven-repositories/1/org/apache/any23/plugins/apache-any23-html-scraper/1.0.2-SNAPSHOT/apache-any23-html-scraper-1.0.2-SNAPSHOT.zip
[INFO] [deploy:deploy {execution: default-deploy}]
[INFO] Retrieving previous build number from apache.snapshots.https
[WARNING] *** CHECKSUM FAILED - Checksum failed on download: local = 'c030a1bcb1d4599de8e9169f75804035c67e6b7a'; remote = '318ad7411fb0969a4cd32b37f74887d03841c4cd' - RETRYING
[WARNING] *** CHECKSUM FAILED - Checksum failed on download: local = 'c030a1bcb1d4599de8e9169f75804035c67e6b7a'; remote = '318ad7411fb0969a4cd32b37f74887d03841c4cd' - IGNORING
Uploading: https://repository.apache.org/content/repositories/snapshots/org/apache/any23/plugins/apache-any23-html-scraper/1.0.2-SNAPSHOT/apache-any23-html-scraper-1.0.2-20130316.074404-151.jar
12K uploaded (apache-any23-html-scraper-1.0.2-20130316.074404-151.jar)
[INFO] Retrieving previous metadata from apache.snapshots.https
[WARNING] *** CHECKSUM FAILED - Checksum failed on download: local = 'c030a1bcb1d4599de8e9169f75804035c67e6b7a'; remote = '318ad7411fb0969a4cd32b37f74887d03841c4cd' - RETRYING
[WARNING] *** CHECKSUM FAILED - Checksum failed on download: local = 'c030a1bcb1d4599de8e9169f75804035c67e6b7a'; remote = '318ad7411fb0969a4cd32b37f74887d03841c4cd' - IGNORING
[INFO] Uploading repository metadata for: 'snapshot org.apache.any23.plugins:apache-any23-html-scraper:1.0.2-SNAPSHOT'
[INFO] Uploading project information for apache-any23-html-scraper 1.0.2-20130316.074404-151
[INFO] Retrieving previous metadata from apache.snapshots.https
[WARNING] *** CHECKSUM FAILED - Checksum failed on download: local = '4c08ab681d08cc04ef52eb989bb4212b5f93e85f'; remote = 'fc34287268fb5e00e257ae7e9f94284ef21d901e' - RETRYING
[WARNING] *** CHECKSUM FAILED - Checksum failed on download: local = '4c08ab681d08cc04ef52eb989bb4212b5f93e85f'; remote = 'fc34287268fb5e00e257ae7e9f94284ef21d901e' - IGNORING
[INFO] Uploading repository metadata for: 'artifact org.apache.any23.plugins:apache-any23-html-scraper'
[INFO] Retrieving previous build number from apache.snapshots.https
Uploading: https://repository.apache.org/content/repositories/snapshots/org/apache/any23/plugins/apache-any23-html-scraper/1.0.2-SNAPSHOT/apache-any23-html-scraper-1.0.2-20130316.074404-151.tar.gz
99K uploaded (apache-any23-html-scraper-1.0.2-20130316.074404-151.tar.gz)
[INFO] Retrieving previous build number from apache.snapshots.https
Uploading: https://repository.apache.org/content/repositories/snapshots/org/apache/any23/plugins/apache-any23-html-scraper/1.0.2-SNAPSHOT/apache-any23-html-scraper-1.0.2-20130316.074404-151.zip
100K uploaded (apache-any23-html-scraper-1.0.2-20130316.074404-151.zip)
[JENKINS] Archiving <https://builds.apache.org/job/Any23-trunk/ws/plugins/html-scraper/pom.xml> to /home/hudson/hudson/jobs/Any23-trunk/modules/org.apache.any23.plugins$apache-any23-html-scraper/builds/2013-03-16_07-36-11/archive/org.apache.any23.plugins/apache-any23-html-scraper/1.0.2-SNAPSHOT/apache-any23-html-scraper-1.0.2-SNAPSHOT.pom
[JENKINS] Archiving <https://builds.apache.org/job/Any23-trunk/ws/plugins/html-scraper/target/apache-any23-html-scraper-1.0.2-SNAPSHOT.jar> to /home/hudson/hudson/jobs/Any23-trunk/modules/org.apache.any23.plugins$apache-any23-html-scraper/builds/2013-03-16_07-36-11/archive/org.apache.any23.plugins/apache-any23-html-scraper/1.0.2-20130316.074404-151/apache-any23-html-scraper-1.0.2-20130316.074404-151.jar
[JENKINS] Archiving <https://builds.apache.org/job/Any23-trunk/ws/plugins/html-scraper/target/apache-any23-html-scraper-1.0.2-SNAPSHOT.tar.gz> to /home/hudson/hudson/jobs/Any23-trunk/modules/org.apache.any23.plugins$apache-any23-html-scraper/builds/2013-03-16_07-36-11/archive/org.apache.any23.plugins/apache-any23-html-scraper/1.0.2-20130316.074404-151/apache-any23-html-scraper-1.0.2-20130316.074404-151.tar.gz
[JENKINS] Archiving <https://builds.apache.org/job/Any23-trunk/ws/plugins/html-scraper/target/apache-any23-html-scraper-1.0.2-SNAPSHOT.zip> to /home/hudson/hudson/jobs/Any23-trunk/modules/org.apache.any23.plugins$apache-any23-html-scraper/builds/2013-03-16_07-36-11/archive/org.apache.any23.plugins/apache-any23-html-scraper/1.0.2-20130316.074404-151/apache-any23-html-scraper-1.0.2-20130316.074404-151.zip
[INFO] ------------------------------------------------------------------------
[INFO] Building Apache Any23 :: Plugins :: Office Scraper
[INFO] task-segment: [clean, deploy]
[INFO] ------------------------------------------------------------------------
[INFO] [clean:clean {execution: default-clean}]
[INFO] [cobertura:clean {execution: default}]
[INFO] [buildnumber:create {execution: default}]
[INFO] Checking for local modifications: skipped.
[INFO] Updating project files from SCM: skipped.
[INFO] Executing: /bin/sh -c cd <https://builds.apache.org/job/Any23-trunk/ws/plugins/office-scraper> && svn --non-interactive info
[INFO] Working directory: <https://builds.apache.org/job/Any23-trunk/ws/plugins/office-scraper>
[INFO] Storing buildNumber: 1435999 at timestamp: 1363424081655
[INFO] Executing: /bin/sh -c cd <https://builds.apache.org/job/Any23-trunk/ws/plugins/office-scraper> && svn --non-interactive info
[INFO] Working directory: <https://builds.apache.org/job/Any23-trunk/ws/plugins/office-scraper>
[INFO] Storing buildScmBranch: trunk
[debug] execute contextualize
[INFO] [resources:resources {execution: default-resources}]
[INFO] Using 'UTF-8' encoding to copy filtered resources.
[INFO] Copying 2 resources to META-INF
[INFO] [compiler:compile {execution: default-compile}]
[INFO] Compiling 4 source files to <https://builds.apache.org/job/Any23-trunk/ws/plugins/office-scraper/target/classes>
[debug] execute contextualize
[INFO] [resources:testResources {execution: default-testResources}]
[INFO] Using 'UTF-8' encoding to copy filtered resources.
[INFO] Copying 2 resources
[INFO] [compiler:testCompile {execution: default-testCompile}]
[INFO] Compiling 2 source files to <https://builds.apache.org/job/Any23-trunk/ws/plugins/office-scraper/target/test-classes>
[INFO] [surefire:test {execution: default-test}]
[INFO] Surefire report directory: <https://builds.apache.org/job/Any23-trunk/ws/plugins/office-scraper/target/surefire-reports>
-------------------------------------------------------
T E S T S
-------------------------------------------------------
Running org.apache.any23.plugin.officescraper.XSSFWorkbookTest
SLF4J: Failed to load class "org.slf4j.impl.StaticLoggerBinder".
SLF4J: Defaulting to no-operation (NOP) logger implementation
SLF4J: See http://www.slf4j.org/codes.html#StaticLoggerBinder for further details.
Tests run: 2, Failures: 0, Errors: 0, Skipped: 0, Time elapsed: 1.866 sec
Running org.apache.any23.plugin.officescraper.ExcelExtractorTest
Tests run: 3, Failures: 0, Errors: 0, Skipped: 0, Time elapsed: 0.514 sec
Results :
Tests run: 5, Failures: 0, Errors: 0, Skipped: 0
[JENKINS] Recording test results
[INFO] [jar:jar {execution: default-jar}]
[INFO] Building jar: <https://builds.apache.org/job/Any23-trunk/ws/plugins/office-scraper/target/apache-any23-office-scraper-1.0.1-SNAPSHOT.jar>
[INFO] [assembly:single {execution: assembly}]
[INFO] Reading assembly descriptor: <https://builds.apache.org/job/Any23-trunk/ws/plugins/office-scraper/src/main/assembly/bin.xml>
[INFO] Building tar: <https://builds.apache.org/job/Any23-trunk/ws/plugins/office-scraper/target/apache-any23-office-scraper-1.0.1-SNAPSHOT.tar.gz>
[INFO] Building zip: <https://builds.apache.org/job/Any23-trunk/ws/plugins/office-scraper/target/apache-any23-office-scraper-1.0.1-SNAPSHOT.zip>
[INFO] [install:install {execution: default-install}]
[INFO] Installing <https://builds.apache.org/job/Any23-trunk/ws/plugins/office-scraper/target/apache-any23-office-scraper-1.0.1-SNAPSHOT.jar> to /export/home/hudson/hudson-slave/maven-repositories/1/org/apache/any23/plugins/apache-any23-office-scraper/1.0.1-SNAPSHOT/apache-any23-office-scraper-1.0.1-SNAPSHOT.jar
[INFO] Installing <https://builds.apache.org/job/Any23-trunk/ws/plugins/office-scraper/target/apache-any23-office-scraper-1.0.1-SNAPSHOT.tar.gz> to /export/home/hudson/hudson-slave/maven-repositories/1/org/apache/any23/plugins/apache-any23-office-scraper/1.0.1-SNAPSHOT/apache-any23-office-scraper-1.0.1-SNAPSHOT.tar.gz
[INFO] Installing <https://builds.apache.org/job/Any23-trunk/ws/plugins/office-scraper/target/apache-any23-office-scraper-1.0.1-SNAPSHOT.zip> to /export/home/hudson/hudson-slave/maven-repositories/1/org/apache/any23/plugins/apache-any23-office-scraper/1.0.1-SNAPSHOT/apache-any23-office-scraper-1.0.1-SNAPSHOT.zip
[INFO] [deploy:deploy {execution: default-deploy}]
[INFO] Retrieving previous build number from apache.snapshots.https
[WARNING] *** CHECKSUM FAILED - Checksum failed on download: local = '6cd6b635491bdd3e3f694600a6d3b785a6624e2e'; remote = '0f2c6567e3cd71aab3844f3c8bb0efa3e4992202' - RETRYING
[WARNING] *** CHECKSUM FAILED - Checksum failed on download: local = '6cd6b635491bdd3e3f694600a6d3b785a6624e2e'; remote = '0f2c6567e3cd71aab3844f3c8bb0efa3e4992202' - IGNORING
Uploading: https://repository.apache.org/content/repositories/snapshots/org/apache/any23/plugins/apache-any23-office-scraper/1.0.1-SNAPSHOT/apache-any23-office-scraper-1.0.1-20130316.074404-150.jar
13K uploaded (apache-any23-office-scraper-1.0.1-20130316.074404-150.jar)
[INFO] Retrieving previous metadata from apache.snapshots.https
[WARNING] *** CHECKSUM FAILED - Checksum failed on download: local = '6cd6b635491bdd3e3f694600a6d3b785a6624e2e'; remote = '0f2c6567e3cd71aab3844f3c8bb0efa3e4992202' - RETRYING
[WARNING] *** CHECKSUM FAILED - Checksum failed on download: local = '6cd6b635491bdd3e3f694600a6d3b785a6624e2e'; remote = '0f2c6567e3cd71aab3844f3c8bb0efa3e4992202' - IGNORING
[INFO] Uploading repository metadata for: 'snapshot org.apache.any23.plugins:apache-any23-office-scraper:1.0.1-SNAPSHOT'
[INFO] Uploading project information for apache-any23-office-scraper 1.0.1-20130316.074404-150
[INFO] Retrieving previous metadata from apache.snapshots.https
[WARNING] *** CHECKSUM FAILED - Checksum failed on download: local = '344b267824197e17be2445c64468c3a92a9bf9b9'; remote = '862d796dea86c37425abaea90f492e8a3f9f0a66' - RETRYING
[WARNING] *** CHECKSUM FAILED - Checksum failed on download: local = '344b267824197e17be2445c64468c3a92a9bf9b9'; remote = '862d796dea86c37425abaea90f492e8a3f9f0a66' - IGNORING
[INFO] Uploading repository metadata for: 'artifact org.apache.any23.plugins:apache-any23-office-scraper'
[INFO] Retrieving previous build number from apache.snapshots.https
Uploading: https://repository.apache.org/content/repositories/snapshots/org/apache/any23/plugins/apache-any23-office-scraper/1.0.1-SNAPSHOT/apache-any23-office-scraper-1.0.1-20130316.074404-150.tar.gz
1636K uploaded (apache-any23-office-scraper-1.0.1-20130316.074404-150.tar.gz)
[INFO] Retrieving previous build number from apache.snapshots.https
Uploading: https://repository.apache.org/content/repositories/snapshots/org/apache/any23/plugins/apache-any23-office-scraper/1.0.1-SNAPSHOT/apache-any23-office-scraper-1.0.1-20130316.074404-150.zip
1636K uploaded (apache-any23-office-scraper-1.0.1-20130316.074404-150.zip)
[JENKINS] Archiving <https://builds.apache.org/job/Any23-trunk/ws/plugins/office-scraper/pom.xml> to /home/hudson/hudson/jobs/Any23-trunk/modules/org.apache.any23.plugins$apache-any23-office-scraper/builds/2013-03-16_07-36-11/archive/org.apache.any23.plugins/apache-any23-office-scraper/1.0.1-SNAPSHOT/apache-any23-office-scraper-1.0.1-SNAPSHOT.pom
[JENKINS] Archiving <https://builds.apache.org/job/Any23-trunk/ws/plugins/office-scraper/target/apache-any23-office-scraper-1.0.1-SNAPSHOT.jar> to /home/hudson/hudson/jobs/Any23-trunk/modules/org.apache.any23.plugins$apache-any23-office-scraper/builds/2013-03-16_07-36-11/archive/org.apache.any23.plugins/apache-any23-office-scraper/1.0.1-20130316.074404-150/apache-any23-office-scraper-1.0.1-20130316.074404-150.jar
[JENKINS] Archiving <https://builds.apache.org/job/Any23-trunk/ws/plugins/office-scraper/target/apache-any23-office-scraper-1.0.1-SNAPSHOT.tar.gz> to /home/hudson/hudson/jobs/Any23-trunk/modules/org.apache.any23.plugins$apache-any23-office-scraper/builds/2013-03-16_07-36-11/archive/org.apache.any23.plugins/apache-any23-office-scraper/1.0.1-20130316.074404-150/apache-any23-office-scraper-1.0.1-20130316.074404-150.tar.gz
[JENKINS] Archiving <https://builds.apache.org/job/Any23-trunk/ws/plugins/office-scraper/target/apache-any23-office-scraper-1.0.1-SNAPSHOT.zip> to /home/hudson/hudson/jobs/Any23-trunk/modules/org.apache.any23.plugins$apache-any23-office-scraper/builds/2013-03-16_07-36-11/archive/org.apache.any23.plugins/apache-any23-office-scraper/1.0.1-20130316.074404-150/apache-any23-office-scraper-1.0.1-20130316.074404-150.zip
[INFO] ------------------------------------------------------------------------
[INFO] Building Apache Any23 :: Plugins :: Integration Test
[INFO] task-segment: [clean, deploy]
[INFO] ------------------------------------------------------------------------
[INFO] [clean:clean {execution: default-clean}]
[INFO] [cobertura:clean {execution: default}]
[INFO] [buildnumber:create {execution: default}]
[INFO] Checking for local modifications: skipped.
[INFO] Updating project files from SCM: skipped.
[INFO] Executing: /bin/sh -c cd <https://builds.apache.org/job/Any23-trunk/ws/plugins/integration-test> && svn --non-interactive info
[INFO] Working directory: <https://builds.apache.org/job/Any23-trunk/ws/plugins/integration-test>
[INFO] Storing buildNumber: 1448870 at timestamp: 1363424307264
[INFO] Executing: /bin/sh -c cd <https://builds.apache.org/job/Any23-trunk/ws/plugins/integration-test> && svn --non-interactive info
[INFO] Working directory: <https://builds.apache.org/job/Any23-trunk/ws/plugins/integration-test>
[INFO] Storing buildScmBranch: trunk
[debug] execute contextualize
[INFO] [resources:resources {execution: default-resources}]
[INFO] Using 'UTF-8' encoding to copy filtered resources.
[INFO] Copying 2 resources to META-INF
[INFO] [compiler:compile {execution: default-compile}]
[INFO] Nothing to compile - all classes are up to date
[debug] execute contextualize
[INFO] [resources:testResources {execution: default-testResources}]
[INFO] Using 'UTF-8' encoding to copy filtered resources.
[INFO] Copying 1 resource
[INFO] [compiler:testCompile {execution: default-testCompile}]
[INFO] Compiling 1 source file to <https://builds.apache.org/job/Any23-trunk/ws/plugins/integration-test/target/test-classes>
[INFO] [surefire:test {execution: default-test}]
[INFO] Surefire report directory: <https://builds.apache.org/job/Any23-trunk/ws/plugins/integration-test/target/surefire-reports>
-------------------------------------------------------
T E S T S
-------------------------------------------------------
There are no tests to run.
Results :
Tests run: 0, Failures: 0, Errors: 0, Skipped: 0
[JENKINS] Recording test results
[INFO] [jar:jar {execution: default-jar}]
[INFO] Building jar: <https://builds.apache.org/job/Any23-trunk/ws/plugins/integration-test/target/apache-any23-integration-test-0.8.0-SNAPSHOT.jar>
[INFO] [assembly:single {execution: assembly}]
[INFO] Assemblies have been skipped per configuration of the skipAssembly parameter.
[INFO] [invoker:run {execution: default}]
[INFO] Building: office-scraper/pom.xml
[INFO] ..SUCCESS (84.5 s)
[INFO] Building: html-scraper/pom.xml
[INFO] ..SUCCESS (76.5 s)
[INFO] Building: basic-crawler/pom.xml
[INFO] ..FAILED (190.3 s)
[INFO] The build exited with code 1. See <https://builds.apache.org/job/Any23-trunk/ws/plugins/integration-test/target/plugins-build/basic-crawler/build.log> for details.
[INFO] -------------------------------------------------
[INFO] Build Summary:
[INFO] Passed: 2, Failed: 1, Errors: 0, Skipped: 0
[INFO] -------------------------------------------------
[ERROR] The following builds failed:
[ERROR] * basic-crawler/pom.xml
[INFO] -------------------------------------------------
[JENKINS] Archiving <https://builds.apache.org/job/Any23-trunk/ws/plugins/integration-test/pom.xml> to /home/hudson/hudson/jobs/Any23-trunk/modules/org.apache.any23.plugins$apache-any23-integration-test/builds/2013-03-16_07-36-12/archive/org.apache.any23.plugins/apache-any23-integration-test/0.8.0-SNAPSHOT/apache-any23-integration-test-0.8.0-SNAPSHOT.pom
[JENKINS] Archiving <https://builds.apache.org/job/Any23-trunk/ws/plugins/integration-test/target/apache-any23-integration-test-0.8.0-SNAPSHOT.jar> to /home/hudson/hudson/jobs/Any23-trunk/modules/org.apache.any23.plugins$apache-any23-integration-test/builds/2013-03-16_07-36-12/archive/org.apache.any23.plugins/apache-any23-integration-test/0.8.0-SNAPSHOT/apache-any23-integration-test-0.8.0-SNAPSHOT.jar
[INFO] ------------------------------------------------------------------------
[ERROR] BUILD FAILURE
[INFO] ------------------------------------------------------------------------
[INFO] : org.apache.maven.plugin.invoker.InvokerSession@181499a
1 build failed.
[INFO] ------------------------------------------------------------------------
[INFO] For more information, run Maven with the -e switch
[INFO] ------------------------------------------------------------------------
[INFO] Total time: 82 minutes 32 seconds
[INFO] Finished at: Sat Mar 16 09:04:49 GMT+00:00 2013
[INFO] Final Memory: 78M/419M
[INFO] ------------------------------------------------------------------------
Maven failed with error.
Sending e-mails to: any23-dev@apache.org
Sending e-mails to: any23-dev@apache.org
Sending e-mails to: any23-dev@apache.org
channel stopped
Jenkins build is back to stable : Any23-trunk #514
Posted by Apache Jenkins Server <je...@builds.apache.org>.
See <https://builds.apache.org/job/Any23-trunk/514/>
Jenkins build is unstable: Any23-trunk #513
Posted by Apache Jenkins Server <je...@builds.apache.org>.
See <https://builds.apache.org/job/Any23-trunk/513/>