You are viewing a plain text version of this content. The canonical link for it is here.
Posted to dev@brooklyn.apache.org by Apache Jenkins Server <je...@builds.apache.org> on 2018/01/25 17:25:20 UTC

Build failed in Jenkins: brooklyn-master-build-docker #181

See <https://builds.apache.org/job/brooklyn-master-build-docker/181/display/redirect>

------------------------------------------
[...truncated 3.47 MB...]
2018-01-25 17:24:37,445 INFO  TESTNG PASSED CONFIGURATION: "Surefire test" - @AfterMethod org.apache.brooklyn.core.test.BrooklynMgmtUnitTestSupport.tearDown() finished in 0 ms
2018-01-25 17:24:37,446 INFO  TESTNG INVOKING CONFIGURATION: "Surefire test" - @BeforeMethod org.apache.brooklyn.core.test.BrooklynMgmtUnitTestSupport.setUp()
2018-01-25 17:24:37,446 INFO  Added external config supplier named 'brooklyn-demo-sample': org.apache.brooklyn.core.config.external.InPlaceExternalConfigSupplier@695320ae
2018-01-25 17:24:37,446 INFO  TESTNG PASSED CONFIGURATION: "Surefire test" - @BeforeMethod org.apache.brooklyn.core.test.BrooklynMgmtUnitTestSupport.setUp() finished in 0 ms
2018-01-25 17:24:37,446 INFO  TESTNG INVOKING: "Surefire test" - org.apache.brooklyn.core.objs.BasicSpecParameterFromListTest.testInvalidType()
2018-01-25 17:24:37,449 INFO  TESTNG PASSED: "Surefire test" - org.apache.brooklyn.core.objs.BasicSpecParameterFromListTest.testInvalidType() finished in 3 ms
2018-01-25 17:24:37,449 INFO  TESTNG INVOKING CONFIGURATION: "Surefire test" - @AfterMethod org.apache.brooklyn.core.test.BrooklynMgmtUnitTestSupport.tearDown()
2018-01-25 17:24:37,450 INFO  TESTNG PASSED CONFIGURATION: "Surefire test" - @AfterMethod org.apache.brooklyn.core.test.BrooklynMgmtUnitTestSupport.tearDown() finished in 1 ms
2018-01-25 17:24:37,450 INFO  TESTNG INVOKING CONFIGURATION: "Surefire test" - @BeforeMethod org.apache.brooklyn.core.test.BrooklynMgmtUnitTestSupport.setUp()
2018-01-25 17:24:37,450 INFO  Added external config supplier named 'brooklyn-demo-sample': org.apache.brooklyn.core.config.external.InPlaceExternalConfigSupplier@126f1e97
2018-01-25 17:24:37,451 INFO  TESTNG PASSED CONFIGURATION: "Surefire test" - @BeforeMethod org.apache.brooklyn.core.test.BrooklynMgmtUnitTestSupport.setUp() finished in 1 ms
2018-01-25 17:24:37,451 INFO  TESTNG INVOKING: "Surefire test" - org.apache.brooklyn.core.objs.BasicSpecParameterFromListTest.testJavaType()
2018-01-25 17:24:37,451 INFO  TESTNG PASSED: "Surefire test" - org.apache.brooklyn.core.objs.BasicSpecParameterFromListTest.testJavaType() finished in 0 ms
2018-01-25 17:24:37,451 INFO  TESTNG INVOKING CONFIGURATION: "Surefire test" - @AfterMethod org.apache.brooklyn.core.test.BrooklynMgmtUnitTestSupport.tearDown()
2018-01-25 17:24:37,452 INFO  TESTNG PASSED CONFIGURATION: "Surefire test" - @AfterMethod org.apache.brooklyn.core.test.BrooklynMgmtUnitTestSupport.tearDown() finished in 1 ms
2018-01-25 17:24:37,452 INFO  TESTNG INVOKING CONFIGURATION: "Surefire test" - @BeforeMethod org.apache.brooklyn.core.test.BrooklynMgmtUnitTestSupport.setUp()
2018-01-25 17:24:37,452 INFO  Added external config supplier named 'brooklyn-demo-sample': org.apache.brooklyn.core.config.external.InPlaceExternalConfigSupplier@129a091a
2018-01-25 17:24:37,453 INFO  TESTNG PASSED CONFIGURATION: "Surefire test" - @BeforeMethod org.apache.brooklyn.core.test.BrooklynMgmtUnitTestSupport.setUp() finished in 1 ms
2018-01-25 17:24:37,453 INFO  TESTNG INVOKING: "Surefire test" - org.apache.brooklyn.core.objs.BasicSpecParameterFromListTest.testMissingName()
2018-01-25 17:24:37,453 INFO  TESTNG PASSED: "Surefire test" - org.apache.brooklyn.core.objs.BasicSpecParameterFromListTest.testMissingName() finished in 0 ms
2018-01-25 17:24:37,453 INFO  TESTNG INVOKING CONFIGURATION: "Surefire test" - @AfterMethod org.apache.brooklyn.core.test.BrooklynMgmtUnitTestSupport.tearDown()
2018-01-25 17:24:37,454 INFO  TESTNG PASSED CONFIGURATION: "Surefire test" - @AfterMethod org.apache.brooklyn.core.test.BrooklynMgmtUnitTestSupport.tearDown() finished in 1 ms
2018-01-25 17:24:37,454 INFO  TESTNG INVOKING CONFIGURATION: "Surefire test" - @BeforeMethod org.apache.brooklyn.core.test.BrooklynMgmtUnitTestSupport.setUp()
2018-01-25 17:24:37,454 INFO  Added external config supplier named 'brooklyn-demo-sample': org.apache.brooklyn.core.config.external.InPlaceExternalConfigSupplier@37c6d80
2018-01-25 17:24:37,454 INFO  TESTNG PASSED CONFIGURATION: "Surefire test" - @BeforeMethod org.apache.brooklyn.core.test.BrooklynMgmtUnitTestSupport.setUp() finished in 0 ms
2018-01-25 17:24:37,454 INFO  TESTNG INVOKING: "Surefire test" - org.apache.brooklyn.core.objs.BasicSpecParameterFromListTest.testOnlyName()
2018-01-25 17:24:37,455 INFO  TESTNG PASSED: "Surefire test" - org.apache.brooklyn.core.objs.BasicSpecParameterFromListTest.testOnlyName() finished in 1 ms
2018-01-25 17:24:37,455 INFO  TESTNG INVOKING CONFIGURATION: "Surefire test" - @AfterMethod org.apache.brooklyn.core.test.BrooklynMgmtUnitTestSupport.tearDown()
2018-01-25 17:24:37,455 INFO  TESTNG PASSED CONFIGURATION: "Surefire test" - @AfterMethod org.apache.brooklyn.core.test.BrooklynMgmtUnitTestSupport.tearDown() finished in 0 ms
2018-01-25 17:24:37,455 INFO  TESTNG INVOKING CONFIGURATION: "Surefire test" - @BeforeMethod org.apache.brooklyn.core.test.BrooklynMgmtUnitTestSupport.setUp()
2018-01-25 17:24:37,456 INFO  Added external config supplier named 'brooklyn-demo-sample': org.apache.brooklyn.core.config.external.InPlaceExternalConfigSupplier@7fc6d2fb
2018-01-25 17:24:37,456 INFO  TESTNG PASSED CONFIGURATION: "Surefire test" - @BeforeMethod org.apache.brooklyn.core.test.BrooklynMgmtUnitTestSupport.setUp() finished in 1 ms
2018-01-25 17:24:37,456 INFO  TESTNG INVOKING: "Surefire test" - org.apache.brooklyn.core.objs.BasicSpecParameterFromListTest.testUnexpectedType()
2018-01-25 17:24:37,456 INFO  TESTNG PASSED: "Surefire test" - org.apache.brooklyn.core.objs.BasicSpecParameterFromListTest.testUnexpectedType() finished in 0 ms
2018-01-25 17:24:37,457 INFO  TESTNG INVOKING CONFIGURATION: "Surefire test" - @AfterMethod org.apache.brooklyn.core.test.BrooklynMgmtUnitTestSupport.tearDown()
2018-01-25 17:24:37,457 INFO  TESTNG PASSED CONFIGURATION: "Surefire test" - @AfterMethod org.apache.brooklyn.core.test.BrooklynMgmtUnitTestSupport.tearDown() finished in 1 ms
2018-01-25 17:24:37,457 INFO  TESTNG INVOKING CONFIGURATION: "Surefire test" - @BeforeMethod org.apache.brooklyn.core.test.BrooklynMgmtUnitTestSupport.setUp()
2018-01-25 17:24:37,458 INFO  Added external config supplier named 'brooklyn-demo-sample': org.apache.brooklyn.core.config.external.InPlaceExternalConfigSupplier@6705db33
2018-01-25 17:24:37,458 INFO  TESTNG PASSED CONFIGURATION: "Surefire test" - @BeforeMethod org.apache.brooklyn.core.test.BrooklynMgmtUnitTestSupport.setUp() finished in 1 ms
2018-01-25 17:24:37,458 INFO  TESTNG INVOKING: "Surefire test" - org.apache.brooklyn.core.objs.BasicSpecParameterFromListTest.testUnusualName()
2018-01-25 17:24:37,458 INFO  TESTNG PASSED: "Surefire test" - org.apache.brooklyn.core.objs.BasicSpecParameterFromListTest.testUnusualName() finished in 0 ms
2018-01-25 17:24:37,458 INFO  TESTNG INVOKING CONFIGURATION: "Surefire test" - @AfterMethod org.apache.brooklyn.core.test.BrooklynMgmtUnitTestSupport.tearDown()
2018-01-25 17:24:37,459 INFO  TESTNG PASSED CONFIGURATION: "Surefire test" - @AfterMethod org.apache.brooklyn.core.test.BrooklynMgmtUnitTestSupport.tearDown() finished in 1 ms
2018-01-25 17:24:37,459 INFO  TESTNG INVOKING: "Surefire test" - org.apache.brooklyn.core.objs.AbstractEntityAdjunctTest.testImmutableFlags()
2018-01-25 17:24:37,460 WARN  Config 'unusedKey' on TestAdjunct{running=true, id=n8ev55lcaz} conflicts with key already set; ignoring
2018-01-25 17:24:37,460 INFO  TESTNG PASSED: "Surefire test" - org.apache.brooklyn.core.objs.AbstractEntityAdjunctTest.testImmutableFlags() finished in 1 ms
2018-01-25 17:24:37,461 INFO  TESTNG INVOKING CONFIGURATION: "Surefire test" - @BeforeMethod org.apache.brooklyn.core.objs.proxy.ClassLoaderCacheTest.setUp()
2018-01-25 17:24:37,461 INFO  TESTNG PASSED CONFIGURATION: "Surefire test" - @BeforeMethod org.apache.brooklyn.core.objs.proxy.ClassLoaderCacheTest.setUp() finished in 0 ms
2018-01-25 17:24:37,461 INFO  TESTNG INVOKING: "Surefire test" - org.apache.brooklyn.core.objs.proxy.ClassLoaderCacheTest.testDifferentLoader()
2018-01-25 17:24:37,462 INFO  TESTNG PASSED: "Surefire test" - org.apache.brooklyn.core.objs.proxy.ClassLoaderCacheTest.testDifferentLoader() finished in 1 ms
2018-01-25 17:24:37,462 INFO  TESTNG INVOKING CONFIGURATION: "Surefire test" - @BeforeMethod org.apache.brooklyn.core.objs.proxy.ClassLoaderCacheTest.setUp()
2018-01-25 17:24:37,462 INFO  TESTNG PASSED CONFIGURATION: "Surefire test" - @BeforeMethod org.apache.brooklyn.core.objs.proxy.ClassLoaderCacheTest.setUp() finished in 0 ms
2018-01-25 17:24:37,462 INFO  TESTNG INVOKING: "Surefire test" - org.apache.brooklyn.core.objs.proxy.ClassLoaderCacheTest.testSameLoader()
2018-01-25 17:24:37,463 INFO  TESTNG PASSED: "Surefire test" - org.apache.brooklyn.core.objs.proxy.ClassLoaderCacheTest.testSameLoader() finished in 1 ms
2018-01-25 17:24:37,463 INFO  TESTNG INVOKING CONFIGURATION: "Surefire test" - @BeforeMethod org.apache.brooklyn.core.test.BrooklynMgmtUnitTestSupport.setUp()
2018-01-25 17:24:37,463 INFO  Added external config supplier named 'brooklyn-demo-sample': org.apache.brooklyn.core.config.external.InPlaceExternalConfigSupplier@16f59770
2018-01-25 17:24:37,463 INFO  TESTNG PASSED CONFIGURATION: "Surefire test" - @BeforeMethod org.apache.brooklyn.core.test.BrooklynMgmtUnitTestSupport.setUp() finished in 0 ms
2018-01-25 17:24:37,463 INFO  TESTNG INVOKING: "Surefire test" - org.apache.brooklyn.core.objs.BasicSpecParameterFromClassTest.testConfigInImplVisible()
2018-01-25 17:24:37,468 INFO  TESTNG PASSED: "Surefire test" - org.apache.brooklyn.core.objs.BasicSpecParameterFromClassTest.testConfigInImplVisible() finished in 5 ms
2018-01-25 17:24:37,468 INFO  TESTNG INVOKING CONFIGURATION: "Surefire test" - @AfterMethod org.apache.brooklyn.core.test.BrooklynMgmtUnitTestSupport.tearDown()
2018-01-25 17:24:37,469 INFO  TESTNG PASSED CONFIGURATION: "Surefire test" - @AfterMethod org.apache.brooklyn.core.test.BrooklynMgmtUnitTestSupport.tearDown() finished in 1 ms
2018-01-25 17:24:37,469 INFO  TESTNG INVOKING CONFIGURATION: "Surefire test" - @BeforeMethod org.apache.brooklyn.core.test.BrooklynMgmtUnitTestSupport.setUp()
2018-01-25 17:24:37,469 INFO  Added external config supplier named 'brooklyn-demo-sample': org.apache.brooklyn.core.config.external.InPlaceExternalConfigSupplier@2e99d9c3
2018-01-25 17:24:37,469 INFO  TESTNG PASSED CONFIGURATION: "Surefire test" - @BeforeMethod org.apache.brooklyn.core.test.BrooklynMgmtUnitTestSupport.setUp() finished in 0 ms
2018-01-25 17:24:37,469 INFO  TESTNG INVOKING: "Surefire test" - org.apache.brooklyn.core.objs.BasicSpecParameterFromClassTest.testDebug()
[BasicSpecParameter{label=application.stop.shouldDestroy, pinned=false, type=application.stop.shouldDestroy[ConfigKey:java.lang.Boolean]}, BasicSpecParameter{label=defaultDisplayName, pinned=false, type=defaultDisplayName[ConfigKey:java.lang.String]}, BasicSpecParameter{label=latch.start, pinned=false, type=latch.start[ConfigKey:java.lang.Boolean]}, BasicSpecParameter{label=quorum.running, pinned=false, type=quorum.running[ConfigKey:org.apache.brooklyn.util.collections.QuorumCheck]}, BasicSpecParameter{label=quorum.up, pinned=false, type=quorum.up[ConfigKey:org.apache.brooklyn.util.collections.QuorumCheck]}]
2018-01-25 17:24:37,470 INFO  TESTNG PASSED: "Surefire test" - org.apache.brooklyn.core.objs.BasicSpecParameterFromClassTest.testDebug() finished in 1 ms
2018-01-25 17:24:37,471 INFO  TESTNG INVOKING CONFIGURATION: "Surefire test" - @AfterMethod org.apache.brooklyn.core.test.BrooklynMgmtUnitTestSupport.tearDown()
2018-01-25 17:24:37,471 INFO  TESTNG PASSED CONFIGURATION: "Surefire test" - @AfterMethod org.apache.brooklyn.core.test.BrooklynMgmtUnitTestSupport.tearDown() finished in 0 ms
2018-01-25 17:24:37,471 INFO  TESTNG INVOKING CONFIGURATION: "Surefire test" - @BeforeMethod org.apache.brooklyn.core.test.BrooklynMgmtUnitTestSupport.setUp()
2018-01-25 17:24:37,471 INFO  Added external config supplier named 'brooklyn-demo-sample': org.apache.brooklyn.core.config.external.InPlaceExternalConfigSupplier@5811213d
2018-01-25 17:24:37,472 INFO  TESTNG PASSED CONFIGURATION: "Surefire test" - @BeforeMethod org.apache.brooklyn.core.test.BrooklynMgmtUnitTestSupport.setUp() finished in 1 ms
2018-01-25 17:24:37,472 INFO  TESTNG INVOKING: "Surefire test" - org.apache.brooklyn.core.objs.BasicSpecParameterFromClassTest.testFullDefinition()
2018-01-25 17:24:37,473 INFO  TESTNG PASSED: "Surefire test" - org.apache.brooklyn.core.objs.BasicSpecParameterFromClassTest.testFullDefinition() finished in 1 ms
2018-01-25 17:24:37,473 INFO  TESTNG INVOKING CONFIGURATION: "Surefire test" - @AfterMethod org.apache.brooklyn.core.test.BrooklynMgmtUnitTestSupport.tearDown()
2018-01-25 17:24:37,474 INFO  TESTNG PASSED CONFIGURATION: "Surefire test" - @AfterMethod org.apache.brooklyn.core.test.BrooklynMgmtUnitTestSupport.tearDown() finished in 1 ms
2018-01-25 17:24:37,748 INFO  TESTNG 
===============================================
    Surefire test
    Tests run: 2310, Failures: 1, Skips: 0
===============================================
[GC (Allocation Failure)  424255K->242247K(744448K), 0.0127494 secs]
[GC (Allocation Failure)  421848K->242663K(748032K), 0.0135425 secs]
[GC (Allocation Failure)  426983K->241696K(747008K), 0.0085655 secs]
[GC (Allocation Failure)  426016K->241744K(750592K), 0.0207539 secs]
[GC (Allocation Failure)  430672K->241752K(749056K), 0.0144648 secs]
[GC (Allocation Failure)  430680K->241776K(753152K), 0.0092303 secs]
[GC (Allocation Failure)  435824K->241872K(751616K), 0.0085761 secs]
Tests run: 2310, Failures: 1, Errors: 0, Skipped: 0, Time elapsed: 202.742 sec <<< FAILURE! - in TestSuite
testManuallySettingIndicatorsOnApplications(org.apache.brooklyn.core.entity.lifecycle.ServiceStateLogicTest)  Time elapsed: 3.564 sec  <<< FAILURE!
java.lang.AssertionError: failed succeeds-eventually, 21 attempts, 3001ms elapsed: AssertionError: entity=Application[z1a6sl45]; attribute=Sensor: service.state (org.apache.brooklyn.core.entity.lifecycle.Lifecycle) expected [running] but found [on-fire]
	at org.apache.brooklyn.core.entity.lifecycle.ServiceStateLogicTest.assertAttributeEqualsEventually(ServiceStateLogicTest.java:339)
	at org.apache.brooklyn.core.entity.lifecycle.ServiceStateLogicTest.testManuallySettingIndicatorsOnApplications(ServiceStateLogicTest.java:270)
Caused by: java.lang.AssertionError: entity=Application[z1a6sl45]; attribute=Sensor: service.state (org.apache.brooklyn.core.entity.lifecycle.Lifecycle) expected [running] but found [on-fire]
	at org.apache.brooklyn.core.entity.lifecycle.ServiceStateLogicTest.assertAttributeEqualsEventually(ServiceStateLogicTest.java:339)
	at org.apache.brooklyn.core.entity.lifecycle.ServiceStateLogicTest.testManuallySettingIndicatorsOnApplications(ServiceStateLogicTest.java:270)

2018-01-25 17:24:41,475 INFO  Brooklyn shutdown: stopping entities [TestEntityImpl{id=uo0lt49ufi}, TestEntityImpl{id=xca5vq4lf2}, BlockingEntityImpl{id=k7axi9b2fi}]

Results :

Failed tests: 
  ServiceStateLogicTest.testManuallySettingIndicatorsOnApplications:270->assertAttributeEqualsEventually:339 failed succeeds-eventually, 21 attempts, 3001ms elapsed: AssertionError: entity=Application[z1a6sl45]; attribute=Sensor: service.state (org.apache.brooklyn.core.entity.lifecycle.Lifecycle) expected [running] but found [on-fire]

Tests run: 2310, Failures: 1, Errors: 0, Skipped: 0

[INFO] ------------------------------------------------------------------------
[INFO] Reactor Summary:
[INFO] 
[INFO] Brooklyn REST JavaScript Web GUI ................... SUCCESS [ 33.696 s]
[INFO] Brooklyn Server Root ............................... SUCCESS [  0.217 s]
[INFO] Brooklyn Parent Project ............................ SUCCESS [  2.578 s]
[INFO] Brooklyn Test Support Utilities .................... SUCCESS [  4.540 s]
[INFO] Brooklyn Logback Includable Configuration .......... SUCCESS [  0.447 s]
[INFO] Brooklyn Common Utilities .......................... SUCCESS [ 24.442 s]
[INFO] Brooklyn API ....................................... SUCCESS [  2.067 s]
[INFO] CAMP Server Parent Project ......................... SUCCESS [  0.224 s]
[INFO] CAMP Base .......................................... SUCCESS [  3.045 s]
[INFO] Brooklyn Test Support .............................. SUCCESS [  1.201 s]
[INFO] Brooklyn REST Swagger Apidoc Utilities ............. SUCCESS [  1.018 s]
[INFO] Brooklyn Logback Configuration ..................... SUCCESS [  0.284 s]
[INFO] CAMP Server ........................................ SUCCESS [  5.578 s]
[INFO] Brooklyn Felix Runtime ............................. SUCCESS [  3.270 s]
[INFO] Brooklyn Groovy Utilities .......................... SUCCESS [  2.317 s]
[INFO] Brooklyn Core ...................................... FAILURE [04:14 min]
[INFO] Brooklyn Policies .................................. SKIPPED
[INFO] Brooklyn WinRM Software Entities ................... SKIPPED
[INFO] Brooklyn Secure JMXMP Agent ........................ SKIPPED
[INFO] Brooklyn JMX RMI Agent ............................. SKIPPED
[INFO] Brooklyn Jclouds Location Targets .................. SKIPPED
[INFO] Brooklyn Software Base ............................. SKIPPED
[INFO] Brooklyn CAMP ...................................... SKIPPED
[INFO] Brooklyn Launcher Common ........................... SKIPPED
[INFO] Brooklyn REST API .................................. SKIPPED
[INFO] Brooklyn REST Resources ............................ SKIPPED
[INFO] Brooklyn REST Server ............................... SKIPPED
[INFO] Brooklyn Launcher .................................. SKIPPED
[INFO] Brooklyn Container Location Targets ................ SKIPPED
[INFO] Brooklyn Command Line Interface .................... SKIPPED
[INFO] Brooklyn Test Framework ............................ SKIPPED
[INFO] Brooklyn OSGi init ................................. SKIPPED
[INFO] Brooklyn OSGi start ................................ SKIPPED
[INFO] Brooklyn Karaf ..................................... SKIPPED
[INFO] Jetty config fragment .............................. SKIPPED
[INFO] Apache Http Component extension .................... SKIPPED
[INFO] Brooklyn Karaf Features ............................ SKIPPED
[INFO] Brooklyn Karaf Shell Commands ...................... SKIPPED
[INFO] Brooklyn Library Root .............................. SKIPPED
[INFO] Brooklyn CM Chef ................................... SKIPPED
[INFO] Brooklyn CM SaltStack .............................. SKIPPED
[INFO] Brooklyn CM Ansible ................................ SKIPPED
[INFO] Brooklyn CM Integration Root ....................... SKIPPED
[INFO] Brooklyn Network Software Entities ................. SKIPPED
[INFO] Brooklyn OSGi Software Entities .................... SKIPPED
[INFO] Brooklyn Database Software Entities ................ SKIPPED
[INFO] Brooklyn Web App Software Entities ................. SKIPPED
[INFO] Brooklyn Messaging Software Entities ............... SKIPPED
[INFO] Brooklyn NoSQL Data Store Software Entities ........ SKIPPED
[INFO] Brooklyn Monitoring Software Entities .............. SKIPPED
[INFO] Brooklyn Web App Software Entities ................. SKIPPED
[INFO] Brooklyn QA ........................................ SKIPPED
[INFO] Brooklyn Examples Aggregator Project ............... SKIPPED
[INFO] Brooklyn Examples Aggregator Project - Webapps ..... SKIPPED
[INFO] hello-world-webapp Maven Webapp .................... SKIPPED
[INFO] hello-world-sql-webapp Maven Webapp ................ SKIPPED
[INFO] Brooklyn Simple Web Cluster Example ................ SKIPPED
[INFO] Brooklyn Library Karaf integration ................. SKIPPED
[INFO] Brooklyn Library Catalog ........................... SKIPPED
[INFO] Brooklyn Library Karaf Features .................... SKIPPED
[INFO] Brooklyn Client .................................... SKIPPED
[INFO] Brooklyn Client Command Line Interface ............. SKIPPED
[INFO] Brooklyn REST java Client .......................... SKIPPED
[INFO] Brooklyn Downstream Project Parent ................. SKIPPED
[INFO] Brooklyn Dist Root ................................. SKIPPED
[INFO] Brooklyn All Things ................................ SKIPPED
[INFO] Brooklyn Distribution .............................. SKIPPED
[INFO] Brooklyn Karaf Distribution Parent ................. SKIPPED
[INFO] Brooklyn Karaf Server Configuration ................ SKIPPED
[INFO] Brooklyn Dist Karaf Features ....................... SKIPPED
[INFO] Brooklyn Karaf Distribution ........................ SKIPPED
[INFO] Brooklyn Karaf pax-exam itest ...................... SKIPPED
[INFO] Brooklyn Vagrant Getting Started Environment ....... SKIPPED
[INFO] Brooklyn Quick-Start Project Archetype ............. SKIPPED
[INFO] Brooklyn Shared Package Files ...................... SKIPPED
[INFO] Brooklyn RPM Package ............................... SKIPPED
[INFO] Brooklyn DEB Package ............................... SKIPPED
[INFO] Brooklyn Root ...................................... SKIPPED
[INFO] ------------------------------------------------------------------------
[INFO] BUILD FAILURE
[INFO] ------------------------------------------------------------------------
[INFO] Total time: 05:44 min
[INFO] Finished at: 2018-01-25T17:24:41Z
[INFO] Final Memory: 92M/675M
[INFO] ------------------------------------------------------------------------
[ERROR] Failed to execute goal org.apache.maven.plugins:maven-surefire-plugin:2.19.1:test (default-test) on project brooklyn-core: There are test failures.
[ERROR] 
[ERROR] Please refer to /usr/build/brooklyn-server/core/target/surefire-reports for the individual test results.
[ERROR] -> [Help 1]
[ERROR] 
[ERROR] To see the full stack trace of the errors, re-run Maven with the -e switch.
[ERROR] Re-run Maven using the -X switch to enable full debug logging.
[ERROR] 
[ERROR] For more information about the errors and possible solutions, please read the following articles:
[ERROR] [Help 1] http://cwiki.apache.org/confluence/display/MAVEN/MojoFailureException
[ERROR] 
[ERROR] After correcting the problems, you can resume the build with the command
[ERROR]   mvn <goals> -rf :brooklyn-core
Build step 'Execute shell' marked build as failure
Recording test results
TestNG Reports Processing: START
Looking for TestNG results report in workspace using pattern: **/testng-results.xml
testng-results.xml was last modified before this build started. Ignoring it.
testng-results.xml was last modified before this build started. Ignoring it.
testng-results.xml was last modified before this build started. Ignoring it.
testng-results.xml was last modified before this build started. Ignoring it.
testng-results.xml was last modified before this build started. Ignoring it.
testng-results.xml was last modified before this build started. Ignoring it.
testng-results.xml was last modified before this build started. Ignoring it.
testng-results.xml was last modified before this build started. Ignoring it.
testng-results.xml was last modified before this build started. Ignoring it.
testng-results.xml was last modified before this build started. Ignoring it.
testng-results.xml was last modified before this build started. Ignoring it.
testng-results.xml was last modified before this build started. Ignoring it.
testng-results.xml was last modified before this build started. Ignoring it.
testng-results.xml was last modified before this build started. Ignoring it.
testng-results.xml was last modified before this build started. Ignoring it.
testng-results.xml was last modified before this build started. Ignoring it.
testng-results.xml was last modified before this build started. Ignoring it.
testng-results.xml was last modified before this build started. Ignoring it.
testng-results.xml was last modified before this build started. Ignoring it.
testng-results.xml was last modified before this build started. Ignoring it.
testng-results.xml was last modified before this build started. Ignoring it.
testng-results.xml was last modified before this build started. Ignoring it.
testng-results.xml was last modified before this build started. Ignoring it.
testng-results.xml was last modified before this build started. Ignoring it.
testng-results.xml was last modified before this build started. Ignoring it.
testng-results.xml was last modified before this build started. Ignoring it.
testng-results.xml was last modified before this build started. Ignoring it.
testng-results.xml was last modified before this build started. Ignoring it.
testng-results.xml was last modified before this build started. Ignoring it.
Saving reports...
Processing '/x1/jenkins/jenkins-home/jobs/brooklyn-master-build-docker/builds/181/testng/testng-results-1.xml'
Processing '/x1/jenkins/jenkins-home/jobs/brooklyn-master-build-docker/builds/181/testng/testng-results-2.xml'
Processing '/x1/jenkins/jenkins-home/jobs/brooklyn-master-build-docker/builds/181/testng/testng-results-3.xml'
Processing '/x1/jenkins/jenkins-home/jobs/brooklyn-master-build-docker/builds/181/testng/testng-results-4.xml'
Processing '/x1/jenkins/jenkins-home/jobs/brooklyn-master-build-docker/builds/181/testng/testng-results-5.xml'
Processing '/x1/jenkins/jenkins-home/jobs/brooklyn-master-build-docker/builds/181/testng/testng-results.xml'
0.034294% of tests failed, which exceeded threshold of 0%. Marking build as UNSTABLE
TestNG Reports Processing: FINISH

Jenkins build is back to normal : brooklyn-master-build-docker #182

Posted by Apache Jenkins Server <je...@builds.apache.org>.
See <https://builds.apache.org/job/brooklyn-master-build-docker/182/display/redirect>